##TITLE= 2-hexanone
##JCAMP-DX= 5.00 $$From Command Line Converter 1.0
##DATA TYPE= NMR Spectrum
##DATA CLASS=  XYDATA

##ORIGIN= Exported from Command Line Converter 1.0
##OWNER= SVB
##$URL= http://wwwchem.uwimona.edu.jm:1104/software/jcampdx.html
##SPECTROMETER/DATA SYSTEM= NUTS EXPORT
##.OBSERVE FREQUENCY= 300.149506
##.OBSERVE NUCLEUS= ^1H
##INSTRUMENTAL PARAMETERS= 1H
##XUNITS= PPM
##YUNITS= ARBITRARY UNITS
##XFACTOR= 0.0000011896
##YFACTOR= 4.6259390000
##FIRSTX=   0.262780
##FIRSTY= 25152.000000
##LASTX=   1.452400
##NPOINTS= 2926
##MAXY= 4622907.000000
##MINY= -3032.000000
##DELTAX=   0.000407
##XYDATA= (X++(Y..Y))
220897E437Pp8O9k1J20k1n5k3O0M0l7KO3m9J45K1P1Q9j75J24K5L5P5j64J17k31
$$ 5437 5444 5366 5435 5414 5534 5513 5458 5435 5495 5535 5498 5500 5563 5514 5659 5680 5751 5840 5665 5789 5814 5849 5924 5760 5877 5646
229819E646R4Rr3R5P8j61l9J84m2J07q4Q6o1j38Q3J37K0j12Q9j1J55p2P4k4J7
$$ 5646 5740 5749 5656 5751 5829 5668 5629 5813 5771 5878 5794 5880 5819 5681 5764 5901 5921 5809 5898 5887 6042 5970 6044 6020 6037
238399F037j8k9P3n8O2P8j28j1J83n5o1P6o4O0q3q8J62m3NP3l3L9J07P0q6O4n7
$$ 6037 6019 5990 6063 6005 6067 6145 6017 6006 6189 6134 6073 6149 6085 6145 6062 5974 6136 6093 6098 6171 6138 6177 6284 6354 6268 6332 6275
247629F275l0O8P8O6J29N9K5k7k27k6r6M8J01K3j3P9j20J24N9l7o6J8K5L0K0M
$$ 6275 6245 6313 6391 6457 6586 6645 6670 6643 6416 6390 6294 6342 6443 6466 6453 6532 6412 6536 6595 6558 6492 6510 6535 6565 6585 6589
256467F589O9Q4q0k2m1J18M0J44J77M9m4ok48n9p1P0l0K9J00Rl7J45Q5mN9q6o5
$$ 6589 6658 6742 6662 6640 6599 6717 6757 6901 7078 7127 7083 7077 6829 6770 6699 6769 6739 6768 6868 6877 6840 6985 7070 7066 7125 7039 6974
265697F974J22O7K3j57J92m8M7p5k0j2J58J50M7K18o9j35j31m7r0n0J25KK22j58
$$ 6974 7096 7163 7186 7029 7221 7173 7220 7145 7125 7113 7271 7421 7468 7686 7617 7482 7351 7304 7214 7164 7289 7291 7513 7355
273935G355L01j36P7J72n8qJQ3jl8N1j8L8JJ11n4N5K4P4jP4JlQJ77J83J54K83
$$ 7355 7656 7520 7597 7769 7711 7703 7704 7787 7786 7748 7799 7781 7819 7820 7931 7877 7932 7956 8030 8029 8103 8104 8101 8109 8286 8469 8623 8906
283456H906J36M03n4l58n55j81k12K14k0L6Q9l5rJ2K3J97p7pJ9P0RK1OJ07Q3K19
$$ 8906 9042 9445 9391 9033 8478 8297 8085 8299 8279 8315 8404 8369 8360 8372 8395 8592 8515 8508 8527 8597 8606 8627 8633 8740 8823 9042
292344I042K41K05M29K05N57R28K55j454j176m27j39J29Q7p3O3J54k2q2J62q3
$$ 9042 9283 9488 9917 10122 10679 11607 11862 10408 9232 8805 8666 8795 8882 8809 8872 9026 9004 8922 9084 9001
299248I001Q1k9J37Rn3J5l1k2J27J24K73K28J42L07L18M82m5p07n45k54p2K44
$$ 9001 9082 9053 9190 9199 9146 9161 9130 9108 9235 9359 9632 9860 10002 10309 10627 11109 11064 10357 9812 9558 9486 9730
306719I730l6m0J88J71O3P6J89o4J24j19j05q5k57M2JJ03R5J01K67J5J5M5P2J56
$$ 9730 9694 9654 9842 10013 10076 10152 10341 10277 10401 10282 10177 10092 9835 9877 9878 9981 10076 10177 10444 10459 10474 10519 10591 10747
314957A0747k8M9O5m5j05j9J90J70J21K96N5J57J75J46ol16l72k63K6j8L0J54
$$ 10747 10719 10768 10833 10788 10683 10664 10854 11024 11145 11441 11496 11653 11828 11974 11968 11652 11280 11017 11043 11025 11055 11209
322461A1209J12J63R8r4O9J21M4J39K0P7O2P9MM6l1KK00J35K38K18J04k7j70k53
$$ 11209 11321 11484 11582 11488 11557 11678 11722 11861 11881 11958 12020 12099 12103 12149 12118 12120 12320 12455 12693 12911 13015 12988 12818 12565
330699A2565o6l27Q8J37K56J30K10R9RJ94N6j2M3J04J70K21J61nO2K27O1j0J64
$$ 12565 12499 12172 12260 12397 12653 12783 12993 13092 13101 13295 13351 13339 13382 13486 13656 13877 14038 14033 14095 14322 14383 14373 14537
338511A4537k5L02K06K29P7J43j24k03j85K27K59%K55J4K00J82N3J51R2J57J70
$$ 14537 14512 14814 15020 15249 15326 15469 15345 15142 14957 15184 15443 15443 15698 15712 15912 16094 16147 16298 16390 16547 16717
345723A6717L7K69J65J64K40K00J10K91P5K44L33M00N03M62L10M51L89j60n96
$$ 16717 16754 17023 17188 17352 17592 17792 17902 18193 18268 18512 18845 19245 19748 20210 20520 20971 21360 21200 20604
352202B0604m80k14R3M91K95K00J52L31J26O8K85J19K31K35L68L37K62L49K32
$$ 20604 20124 19910 20003 20494 20789 20989 21141 21472 21598 21666 21951 22070 22301 22536 22904 23241 23503 23852 24084
358680B4084J94N62M33M87N00N88O52M84M45K14J84K23R7N47N84O09P16P89M38
$$ 24084 24278 24840 25273 25760 26260 26848 27500 27984 28429 28643 28827 29050 29147 29694 30278 30887 31603 32392 32830
365159C2830J144P08R11J073J161J251J534J877K095K104K645L379M190N818Q313
$$ 32830 33974 34682 35593 36666 37827 39078 40612 42489 44584 46688 49333 52712 56902 62720 71033
370354G1033J2567J7870K6122M1762M1238J2084o7o4070o0001m8966j7868k068
$$ 71033 83600 101470 127592 169354 210592 222676 222609 158539 98538 49572 31704 29636
374389B9636J654K523K147J918K026K392J867J942K361L350L786L755M972N457
$$ 29636 31290 33813 35960 37878 39904 42296 44163 46105 48466 51816 55602 59357 64329 69786
379191F9786O308Q413J0150J6244K6256L8868N4996P8568J26189J21696l3034
$$ 69786 76094 84507 94657 110901 137157 176025 231021 309589 435778 557474 524440
382968E24440k41974j89742p7022j1273K308L740L725K191K353K519J410M60J117
$$ 524440 282466 92724 15702 4429 6737 10477 14202 16393 18746 21265 22675 23135 24252
387429B4252J302J801K488K511L054L422L876M818P105J1008J6439K3258L2891
$$ 24252 25554 27355 29843 32354 35408 38830 42706 47524 54629 65637 82076 105334 138225
391890A38225N1622O7591K4926l3579r3936p7376n3118j7963l142K95J139L32
$$ 138225 189847 257438 282364 248785 154849 77473 24355 6392 3250 3545 4684 5016
396009E016J243L2O34m63k00k56J8L25K8J39K37K21L35K32J87J29o7J63L20M05
$$ 5016 6259 6291 6925 6462 6262 6006 6024 6349 6377 6516 6753 6974 7309 7541 7728 7857 7790 7953 8273 8678
402796H678P5J10n9j92j44m29m86l61k15k58l03p9k27k18j17j48j89j94j5j57
$$ 8678 8753 8863 8804 8612 8468 8039 7553 7192 6977 6719 6416 6337 6110 5892 5775 5627 5438 5244 5229 5072
409616E072l1J84Q3J46m02j55K0J27K94K04j74j12J42k93r9l94k65k9j15n1j98
$$ 5072 5041 5225 5308 5454 5052 4897 4917 5044 5338 5542 5368 5256 5398 5105 5006 4612 4347 4318 4203 4152 3954
416862C954k0q2R0K0Ml2j14L5m4N0O1L9J66j33j8l0L25K66L20M28J61p91p70m82
$$ 3954 3934 3852 3942 3962 3966 3934 3820 3855 3811 3861 3922 3961 4127 3994 3976 3946 4271 4537 4857 5285 5446 4655 3885 3403
425016C403l51J49J4k01K50k00R1q4r3Mj65M5J43j29L1j86j00J19jj22L5pJ25
$$ 3403 3052 3201 3215 3014 3264 3064 3155 3071 2978 2982 2817 2862 3005 2876 2907 2721 2621 2740 2739 2617 2652 2645 2770
432912B770J71K79n1j37k67n16m07J50k60J46o4L8J32M0p1k00N8j4j13J37p2j4
$$ 2770 2941 3220 3169 3032 2765 2249 1842 1992 1732 1878 1814 1852 1984 2024 1953 1753 1811 1797 1684 1821 1749 1735
440383A735q3L8l6j05o3l3J88j1K8N3Q2j0P1m1k31J06j09Q0R9Q0K16o2J3n5K91
$$ 1735 1652 1690 1654 1549 1486 1453 1641 1630 1658 1711 1793 1783 1854 1813 1582 1688 1579 1659 1758 1838 2054 1992 2005 1950 2241
448963B241jL5J30Q5j13k18N2j04K37p4N0jQJ87l8N6k14J61J16J41p0J46oK51
$$ 2241 2240 2275 2405 2490 2377 2159 2211 2107 2344 2270 2320 2319 2327 2514 2476 2532 2318 2479 2595 2736 2666 2812 2806 3057
457201C057J21qJ60K28J63J13O8j08pN8k27k38j07j02Q5J10O4jj35k13n6O0rJ22
$$ 3057 3178 3170 3330 3558 3721 3834 3902 3794 3787 3845 3618 3380 3273 3171 3256 3366 3430 3429 3294 3081 3025 3085 3076 3198
465355C198J36M1R7l1R4K92L59K40L61L20L07n7k17o24n93k74J0j2j10Lq4L6R0
$$ 3198 3334 3375 3472 3441 3535 3827 4186 4426 4787 5107 5414 5357 5140 4516 3923 3649 3659 3647 3537 3540 3456 3492 3582
473251C582j29m8n4L6o3Q0K7J10L5j48R4K05J92K35K79jK28o4l29k00O9k14j80
$$ 3582 3453 3405 3351 3387 3324 3404 3431 3541 3576 3428 3522 3727 3919 4154 4433 4432 4660 4596 4267 4067 4136 3922 3742
481063C742o4p1j58O9JJ0J93j31K03m7J78q5J30j5j1jj6l4J26O0j13j6l7%P9n0
$$ 3742 3678 3607 3449 3518 3519 3529 3722 3591 3794 3747 3925 3840 3970 3955 3944 3943 3927 3893 4019 4079 3966 3950 3913 3913 3992 3942
489985C942j3J06j12K9J05J25qM5Q5Q8K0K49J97k8J06L2q0k6l6l3N6qJ69l7m8
$$ 3942 3929 4035 3923 3952 4057 4182 4174 4219 4304 4392 4412 4661 4858 4830 4936 4968 4888 4862 4826 4793 4849 4841 5010 4973 4925
498565D925K04n8n1j97J8J06p2J74J37J24r5K60j44J36J43O4O5L60J50J53L9j20
$$ 4925 5129 5071 5020 4823 4841 4947 4875 5049 5186 5310 5215 5475 5331 5467 5610 5674 5739 6099 6249 6402 6441 6321
506035F321K6j40Q8o4Q3J62j20K8l9J25J28R7J28J27l2J13M7r7J30J84o6RO3K69
$$ 6321 6347 6207 6295 6231 6314 6476 6356 6384 6345 6470 6598 6695 6823 6950 6918 7031 7078 6981 7111 7295 7229 7238 7301 7570
514273G570N9K48K97J50K54j25M3O8P6K52L3j86J07P0K59R9M3K60K71j56K87K42
$$ 7570 7629 7877 8174 8324 8578 8453 8496 8564 8640 8892 8925 8739 8846 8916 9175 9274 9317 9577 9848 9692 9979 10221
521743A0221NJ37K44J12J73L13L95J93M93N06M94O21Q34J060J791K250L219N224
$$ 10221 10226 10363 10607 10719 10892 11205 11600 11793 12286 12792 13286 13907 14741 15801 17592 19842 23061 28285
527964B8285O321J73r111q002l066o52m9J63K51K42K06J27L93O04Q23N67Q11Q61
$$ 28285 34606 34779 25668 17666 14600 13948 13899 14062 14313 14555 14761 14888 15281 15885 16708 17275 18086 18947
534100A8947R38J265J694K195K282L563N560P988Q178O176J0957Q309J617n546
$$ 18947 19885 21150 22844 25039 27321 30884 36444 44432 52610 58786 69743 78052 79669 74123
538903G4123j9918j6783o452l045j966j45K420M580j725n140k853n64l1R78J209
$$ 74123 54205 37422 30970 27925 25959 25814 28234 32814 31089 25949 23096 22532 22501 23479 24688
544048B4688J449J826K436L250L961N630Q298J3816J3728R193J2876J1993O014
$$ 24688 26137 27963 30399 33649 37610 43240 51538 65354 79082 88275 101151 113144 119158
548475A19158l851j7742j6942j3232p981m637n694l244O837m608q076l289m950
$$ 119158 115307 97565 80623 67391 59410 54773 49079 45835 52672 48064 39988 36699 31749
552936C1749n761j683j79M42J050J219K177K663L811N386P392J1837J3022J1077
$$ 31749 25988 24305 24126 24568 25618 26837 29014 31677 35488 40874 48266 60103 73125 84202
557655H4202J0233O257J769Q079o263j1400k038j0590j9415j3815n908L843k963
$$ 84202 94435 100692 102461 110540 104277 92877 90839 80249 60834 47019 41111 44954 41991
562116D1991o863l803n162n737j874j286m29K78M93N71J174J437K199K631L576
$$ 41991 35128 31325 26163 20426 18552 17266 16837 17115 17608 18179 19353 20790 22989 25620 29196
567226B9196N770O617M620J233N005J3667J3536p67q722j7902j7221j1269n449
$$ 29196 34966 41583 46203 47436 52441 66108 79644 78877 70155 52253 35032 23763 18314
571687A8314q46K365k54l995l095j682r24l46k51n8K6N8K17M00L88K26J75K97
$$ 18314 17468 19833 19579 15584 12489 10807 9883 9537 9286 9228 9254 9312 9529 9929 10317 10543 10718 11015
577824A1015O23J198J782K617L816O348O755n731j1815o344k001n28k81m22l29
$$ 11015 11638 12836 14618 17235 21051 27399 34154 28423 16608 10264 8263 7735 7454 7032 6703
582969F703k20j40K6K64j96p7or8j23O1O2qK4q0j63p8J1r8N6K30K9k63l9L4l3
$$ 6703 6483 6343 6369 6633 6437 6360 6354 6256 6133 6194 6256 6248 6272 6192 6029 5951 5962 5864 5920 6150 6179 5916 5877 5911 5878
591515E878RM6l18q7n2j45J09j0j3j8Nj63J10o6Q2r5M2q5k4r4J30J9j6Mn2nK0
$$ 5878 5887 5933 5615 5528 5476 5331 5440 5430 5417 5399 5404 5241 5351 5285 5367 5272 5314 5229 5205 5111 5241 5260 5244 5248 5196 5191 5211
600778E211j00NM8p4N5J44J06n3n1j49k18Q4o1M3J06P2K09j45Q1j6Jj1K06j89
$$ 5211 5111 5116 5164 5090 5145 5289 5395 5342 5291 5142 4924 5008 4947 4990 5096 5168 5377 5232 5313 5297 5298 5287 5493 5304
608932E304R1M2P5L3Q4Jq0l1J07J34l0J93R6K0q9J66j00M6m9J55P0J09j4j43K9
$$ 5304 5395 5437 5512 5545 5629 5630 5550 5519 5626 5760 5730 5923 6019 6039 5950 6116 6016 6062 6013 6168 6238 6347 6333 6190 6219
617512F219J76K71J0J26J54%M9n1J63l0J43J42j13K1L64O9J51M22M7K06J23Q5
$$ 6219 6395 6666 6676 6802 6956 6956 7005 6954 7117 7087 7230 7372 7259 7280 7644 7713 7864 8286 8333 8539 8662 8747
625067H747K42p6J57J21M5J51K14K79o8N16J96L35L99M08M64M43N29Q17Q01Q35
$$ 8747 8989 8913 9070 9191 9236 9387 9601 9880 9812 10328 10524 10859 11258 11666 12130 12573 13102 13919 14720 15555
631887A5555J406J832K720M635O781J0479J3331j38k152j6937j5939n329j363
$$ 15555 16961 18793 21513 26148 32929 43408 56739 56601 54449 37512 21573 16244 14881
636348A4881J9N71L08K89L23P43Q48J276J807P62K19J264K580L404N457P567R115
$$ 14881 14900 15471 15779 16068 16391 17134 17982 19258 21065 21827 22046 23310 25890 29294 34751 42318 51433
642142E1433n254j181K870Q552J6476K0183O132j328L966j5566j1183J0666j0024
$$ 51433 46179 44998 47868 56420 72896 93079 99211 97883 101849 86283 75100 85766 75742
646603G5742j8416k1059q749l720r14K25J540J277J296K142J164J334J409K764
$$ 75742 57326 36267 27518 23798 22884 23109 24649 25926 27222 29364 30528 31862 33271 36035
651372C6035N804R204J4010k974K746k872r83N954J4297K2685J3113L823Q539
$$ 36035 41839 51043 65053 62079 64825 61953 60970 66924 81221 103906 117019 120842 129381
655833A29381n172n777j4613l4983j6509j1953q809l471k675j628j285k31J200
$$ 129381 124209 118432 103819 68836 52327 40374 31565 28094 25419 23791 22506 22275 23475
660210B3475n59j116J261K963J494L095O037J1365m468n659k895J553N959J1145
$$ 23475 22916 21800 23061 26024 27518 30613 36650 48015 43547 37888 34993 36546 42505 53650
665013E3650J2704J0682J8056J2429n027l5841k3544j046j1540q726n127k261
$$ 53650 66354 77036 95092 107521 102494 66653 43109 42063 30523 21797 16670 14409
669132A4409j958j102j18M61P57J74j482j383k88O4K27M14O85N57P99J552K168
$$ 14409 12451 11349 11231 11692 12449 12623 11141 9758 9470 9534 9761 10175 10860 11417 12216 13768 15936
674927A5936L438N384Q117O080j480j626j2114j1261m102j237n83j12j28m00k76
$$ 15936 19374 24758 32875 38955 37475 35849 23735 12474 8372 7135 6552 6440 6312 5912 5636
680037E636k20j73j68j66j18j81j13M5p7o6j34p1q9O4J20l04K81j91L96m52J0
$$ 5636 5416 5243 5075 4909 4791 4610 4497 4542 4465 4399 4265 4194 4105 4169 4289 3985 4266 4075 4471 4019 4029
687284D029j41r3j78J98j54K30l94l29j38k91q7j49L0K4j67O7qN6m6k16q7J3j80
$$ 4029 3888 3795 3617 3815 3661 3891 3497 3168 3030 2739 2652 2503 2533 2557 2390 2457 2449 2505 2459 2243 2156 2169 1989
695096A989j29K49N0J7M38l37l69K78o34L96N63K86L3o60j020m06n31M43L55l11
$$ 1989 1860 2109 2159 2176 2614 2277 1908 2186 1552 1948 2511 2797 2830 2170 1150 744 213 656 1011 700
702000G00N50j62m66K91M0j32J36k47k83J36M4j83J31P9J60Q3o3j30k34J61j91
$$ 700 1250 1088 622 913 953 821 957 710 427 563 607 424 555 634 794 877 814 684 450 611 420
709129D20j49L42j86J19j46k36N5j28J43J93k13J84k41j00N0J39j27qj24j1J63
$$ 420 271 613 427 546 400 164 219 91 234 427 214 398 157 57 107 246 119 111 -13 -24 139
716291A39P4N15L09k97m47l87k34k94J6n0J77J75J69R5o8P2K09k6Lj30k26J84
$$ 139 213 728 1037 740 293 -94 -328 -622 -606 -656 -479 -304 -135 -40 -108 -36 173 147 150 20 -206 -22
723845b2j49L2N0l3j72r6oO7J02p7J49m3Q8r7q3N3o4J61J9LM0K4k1K47R0N6j02
$$ -22 -171 -139 -89 -122 -294 -390 -396 -329 -227 -304 -155 -198 -110 -207 -290 -237 -301 -140 -121 -118 -78 -54 -75 172 262 318 216
733075B16j33k3Q3j44N5q4j40N3n6j9n8M1J54j31J04m2R9r7R9L3mM6P1q3o4P5
$$ 216 83 60 143 -1 54 -30 -170 -117 -173 -192 -250 -209 -55 -186 -82 -124 -25 -122 -23 10 6 52 123 40 -24 51
741997E1K1O7J62R1o5l6pj00Q5k28j99M2Mj06N2l5q2k9OJ28o9j2O7M8P6l8M6j16
$$ 51 72 139 301 392 327 291 284 184 269 41 -158 -116 -112 -218 -166 -201 -283 -312 -306 -178 -247 -259 -192 -144 -68 -106 -60 -176
751569a76j46R8j24K17J11P5R4K11q0l41l1k01lJ21m8k71l3J93J36j33L9J6j0
$$ -176 -322 -224 -348 -131 -20 55 149 360 280 -61 -92 -293 -296 -175 -223 -494 -527 -334 -198 -331 -292 -276 -286
759414b86J9j40J49mp8j9P7J00j24mP5K05j60J42J97j15k14N3m5r1P2K07j40J05
$$ -286 -267 -407 -258 -262 -340 -359 -282 -182 -306 -310 -235 -30 -190 -48 149 34 -180 -127 -172 -263 -191 16 -124 -19
767568a9J5j32l6j2n5J47j43l3O7J5M6p0k2J96K6o3J33R6j45lo0J47j13J64r5
$$ -19 -4 -136 -172 -184 -239 -92 -235 -268 -201 -186 -140 -210 -232 -36 -10 -73 60 156 11 8 -52 95 -18 146 51
776115E1J22k1P5J05K6M6k46O3m9j36r4J21P4j69M0J96J1k5k0m7k5N6j67J98j52
$$ 51 173 152 227 332 358 404 158 221 172 36 -58 63 137 -32 8 204 215 190 170 123 98 154 -13 185 33
784695C3Q4n1J14N9M9q5K8J20J89J28Q7q5l1j35l6J10J64P1K52K48M46O14R80
$$ 33 117 66 180 239 288 203 231 351 540 668 755 670 639 504 468 578 742 813 1065 1313 1759 2373 3353
792591C353J27m4o56j41K31M82l21n65r60n49k39n2l1Q9J3m2j07Q3J01J35k0R1
$$ 3353 3480 3436 2780 2639 2870 3352 3031 2466 1506 957 718 666 635 724 737 695 588 671 772 907 887 978
800095I78R7J16q0j44J31j01n4J40j55M2N3Q9N2mL1m4lj6J40j32q0J80J76J81
$$ 978 1075 1191 1111 967 1098 997 943 1083 928 970 1023 1112 1164 1160 1191 1147 1144 1128 1268 1136 1056 1236 1412 1593
808249A593L37M94O79J331J070N68J06j877j013j469m44Q8j85J85p0P9J03r4L
$$ 1593 1930 2424 3103 4434 5504 6072 6178 4301 3288 1819 1375 1463 1278 1463 1393 1472 1575 1481 1484
814811A484O8Kj19n5J02qj07J70j66J27l31M2k35l9oJ54J18k9j6M3Nj4J96m1R5
$$ 1484 1552 1554 1435 1380 1482 1474 1367 1537 1371 1498 1167 1209 974 935 929 1083 1201 1172 1156 1199 1204 1190 1386 1345 1440
823357A440M8K25pL6L7N5p4m4j3Q5J08r6l4l1Nn5N4N0J59Q0J09Q8J38J38J35J12
$$ 1440 1488 1713 1706 1742 1779 1834 1760 1716 1703 1788 1896 1800 1766 1735 1740 1685 1739 1789 1948 2028 2137 2225 2363 2501 2636 2748
832195B748J97p0%m8k02j55K62o1L97L01K50K58N21j50K99p91m13m50m58J1q2
$$ 2748 2945 2875 2875 2827 2625 2470 2732 2671 3068 3369 3619 3877 4398 4248 4547 3756 3343 2893 2435 2446 2364
839357B364K07o4O5J23k38M8n8m4PJ35J9N9R5j12O3j1j31L75K46JJ92o8j09O3
$$ 2364 2571 2507 2572 2695 2457 2505 2447 2403 2410 2545 2564 2623 2718 2606 2669 2658 2527 2902 3148 3149 3341 3273 3164 3227
847595C227r5j98J04j31q3M3J53m7J01J85R5K32OK6kPJ44J15O7j13j0K7q4M6j18
$$ 3227 3132 2934 3038 2907 2824 2867 3020 2973 3074 3259 3354 3586 3592 3618 3616 3623 3767 3882 3949 3836 3826 3853 3769 3815 3697
856141C697J75j89K4j85j86q31Q2q69R48J69P53L37K76J18Q9O4PL0R2J67J21Q9
$$ 3697 3872 3683 3707 3522 3336 2505 2587 1718 2666 2835 3588 3925 4201 4319 4408 4472 4479 4509 4601 4768 4889 4978
863646D978J47J8K22J86J88J28M19K45L60N61P61R23J024O30L77j54j430p37j187
$$ 4978 5125 5143 5365 5551 5739 5867 6286 6531 6891 7452 8213 9136 10160 10790 11167 11013 9583 8846 7659
870208G659r9j56J27J53k2J71K64j0K42J70L20M67O76J878q09j871m91r0MJ74
$$ 7659 7560 7404 7531 7684 7662 7833 8097 8087 8329 8499 8819 9286 9962 11840 11031 9160 8669 8579 8583 8757
876994H757J84J40J86K16K98L76P8J76J58k3J96k0L9K68K81J84J62J57Q1K09K8
$$ 8757 8941 9081 9267 9483 9781 10157 10235 10411 10569 10546 10742 10722 10761 11029 11310 11494 11656 11813 11894 12103 12131
884157A2131J81L67q8K68O5K11L51M70K96M62r6K59J57O44R79J158M46k14m71
$$ 12131 12312 12679 12591 12859 12924 13135 13486 13956 14252 14714 14618 14877 15034 15678 16657 17815 18261 18047 17576
890719A7576M23K44J491P34J270J106J218J497J579K381K210L048M451L376N886
$$ 17576 17999 18243 19734 20468 21738 22844 24062 25559 27138 29519 31729 34777 39228 42604 48490
895830D8490J938M985N918Q760J7842K8557M8707P5920J16539K26648K31878R1658
$$ 48490 50428 55413 61331 70091 87933 116490 165197 241117 357656 584304 816182 907840
899949I07840R1504l50083j69095k87219r8688l0645r465m666k880o69j686j173
$$ 907840 999344 649261 480166 192947 94259 63614 54149 49483 46603 45934 44248 43075
903984D3075l217j746k882r85o44l33j02l25J6O1j86O72L8J141M30K500L429K174
$$ 43075 39858 38112 35230 34245 33601 33268 33166 32841 32857 32918 32732 33404 33442 34583 35013 37513 40942 43116
910205D3116j02k920l499j549j636r15j429o29q49p73m06l74k65K31J067l402
$$ 43116 43014 40094 36595 35046 33410 32495 31066 30437 29588 28815 28409 28035 27770 28001 29068 25666
915657B5666j678q35p01o51o28l22m58l26m61m23l78q7l76l62n01l45l02l59l66
$$ 25666 23988 23153 22452 21801 21173 20851 20393 20067 19606 19183 18805 18718 18342 17980 17479 17134 16832 16473 16107
922136A6107k05l61l99k24k70l39m70m23n16j63m27m34l2j56m18q1k26J6Q1J48
$$ 16107 15902 15541 15142 14918 14648 14309 13839 13416 12900 12737 12310 11876 11844 11688 11270 11189 10963 10979 11060 11208
928956A1208L23M3K11k8k05L58k34N16n08J84J38j99j39or5J32K22j41l4k97j01
$$ 11208 11531 11574 11785 11757 11552 11910 11676 12192 11684 11868 12006 11807 11668 11662 11567 11699 11921 11780 11746 11449 11348
936168A1348l36q3k93k80l2m7j88J01L8J45J63M64R40j50R00j966n08j291l48
$$ 11348 11012 10929 10636 10356 10324 10277 10089 10190 10228 10373 10536 11000 11940 11790 12690 10724 10216 8925 8577
942647H577j32M4q9J4N8N9j51k33jl30k52N0j20k35j43Pj64m2M1j81j45n8l26
$$ 8577 8445 8489 8400 8414 8472 8531 8380 8147 8146 7816 7564 7614 7494 7259 7116 7123 6959 6917 6958 6777 6632 6574 6248
950543F248j78j39l51q9l56j32j77r4j55Q5P7J40J1j20k77o2o4k6k6ON6j83q9
$$ 6248 6070 5931 5580 5491 5135 5003 4826 4732 4577 4662 4739 4879 4890 4770 4493 4431 4367 4341 4315 4321 4377 4194 4105
958389D105J2r9J22j18o8j39J22k49Q1K2J92j76M8k51j33j44J57M4O7k34L09j1
$$ 4105 4117 4018 4140 4022 3954 3815 3937 3688 3769 3791 3983 3807 3855 3604 3471 3327 3484 3528 3595 3361 3670 3659
965859C659j74J16r6m6K12k6N1J36j06J42L4J2o6j61K1j23n6J14j5J70o7J79K26
$$ 3659 3485 3601 3505 3459 3671 3645 3696 3832 3726 3868 3902 3914 3848 3687 3708 3585 3529 3643 3628 3798 3731 3910 4136
973755D136OJ18q7M2J56K57j32P2J53J01K2J27K9J96k4j80n5J41J20j44J57m38
$$ 4136 4142 4260 4173 4215 4371 4628 4496 4568 4721 4822 4844 4971 5000 5196 5172 4992 4937 5078 5198 5054 5211 4773
981310D773k64k07o4o7kJ33Q2O0Q2j5O0J03P4P8L28M51O77J380J197Q18L26j485
$$ 4773 4509 4302 4238 4171 4169 4302 4384 4444 4526 4511 4571 4674 4748 4826 5154 5605 6282 7662 8859 9677 10003 8518
988814H518j019j459m22p8Q9J84l8n4r3k46j34m9m1j13P1j04O5K34qj04q6K13
$$ 8518 7499 6040 5618 5540 5629 5813 5775 5721 5628 5382 5248 5199 5158 5045 5116 5012 5077 5311 5303 5199 5113 5326
996284E326N1P3J6O0k7Q7K8mm9L34J13J26J09J04K14J22R7m8j75J77O4L28J03
$$ 5326 5377 5450 5466 5526 5499 5586 5614 5610 5561 5895 6008 6134 6243 6347 6561 6683 6780 6732 6557 6734 6798 7126 7229
1004180G229K73KK27K48L21M13N28N50P60R06J151R94J429J627K414M013O791J1625
$$ 7229 7502 7504 7731 7979 8300 8713 9241 9791 10551 11457 12608 13602 15031 16658 19072 23085 29876 41501
1010317D1501J9138K6473L0276K6371R335r469k5879l4122k8352j9098r561l338
$$ 41501 60639 87112 117388 143759 153094 143625 117746 83624 55272 36174 26613 23275
1014436B3275j187k12m7P8p3O15N70J058J241Q45J735J408K889L722N113P674J1276
$$ 23275 22088 21876 21829 21907 21834 22449 23019 24077 25318 26163 27898 29306 32195 35917 41030 48704 59980
1020230E9980J6496K3044L1203L2842L8100K1203J2045j7605l3583m2663m2889
$$ 59980 76476 99520 130723 163565 201665 222868 234913 217308 183725 141062 98173
1024041I8173k8555j7858p973l613k261k616k225k215j948j046n77p6Q67L52Q14
$$ 98173 69618 51760 43787 40174 37913 35297 33072 30857 28909 27863 27286 27210 28077 28429 29243
1029152B9243L71Q83J277K884N519R828J6989K3767K6953K3857P810r182k3517
$$ 29243 29614 30497 31774 34658 40177 50005 66994 90761 117714 141571 149381 140199 116682
1033613A16682l1672k5498j8021r403l970k256j376j088j011q75p04q19p61n86
$$ 116682 85010 59512 41491 32088 28118 25862 24486 23398 22387 21512 20808 19989 19228 18642
1038416A8642l64l84m63l20n09pk66l07j58j33q4p8l3p0k27r2k96k81l53k55m37
$$ 18642 18278 17894 17431 17111 16602 16595 16329 16022 15864 15731 15647 15569 15536 15466 15239 15147 14851 14570 14217 13962 13525
1045544A3525l23j23k35n10j49l00j76k47k04l12k46j42j32k66p2M3k72p2n8P2
$$ 13525 13202 13079 12844 12334 12185 11885 11709 11462 11258 10946 10700 10558 10426 10160 10088 10131 9859 9787 9729 9801
1052364I801j3K16l09j56j57k31j94j65j06J2k38p4j86j22l6j05q7r0j07j06j65
$$ 9801 9788 10004 9695 9539 9382 9151 8957 8792 8686 8698 8460 8386 8200 8078 8042 7937 7850 7760 7653 7547 7382
1059577G382p3j24oK2q2m3j03R6J63J42p4O3j74k10j39k81k31r3M9j79j25J7j83
$$ 7382 7309 7185 7179 7201 7119 7076 6973 7069 7232 7374 7300 7363 7189 6979 6840 6559 6328 6235 6284 6105 5980 5997 5814
1067473E814pp5Lj45j04q0j17p2j13k1r2k5k8j98j6J49Q9J6j33p3j48k54r7k00
$$ 5814 5807 5732 5735 5590 5486 5406 5289 5217 5104 5083 4991 4966 4938 4740 4724 4873 4962 4978 4845 4772 4624 4370 4273 4073
1075627D073j46L6j91M7J8j7m2j37j17P0m8K8j15o8K5o5j91l0j21o3L6j23K85k16
$$ 4073 3927 3963 3772 3819 3837 3820 3778 3641 3524 3594 3546 3574 3459 3391 3416 3351 3160 3130 3009 2946 2982 2859 3144 2928
1083865B928m1J18k75J48k1l38J03P9N5Q9J9l26O4k02J80qP3J47j73K15l45N9j28
$$ 2928 2887 3005 2730 2878 2857 2519 2622 2701 2756 2845 2864 2538 2602 2400 2580 2572 2645 2792 2619 2834 2489 2548 2420
1091711B420Q8J18j78P4p8K6r3K1k2M0J55Q2p0K43j72R2L62j26L20J7j89om03l93
$$ 2420 2508 2626 2448 2522 2444 2470 2377 2398 2376 2416 2571 2653 2583 2826 2654 2746 3108 2982 3302 3319 3130 3124 2721 2328
1099949B328k64Q0l4k37O59l82J77J63l91K16n4j33Q1k7O6r3J08j4r1K56Q1J22
$$ 2328 2064 2144 2110 1873 2532 2150 2327 2490 2099 2315 2261 2128 2209 2182 2248 2155 2263 2249 2158 2414 2495 2617
1107419B617J59J12P1K21j75K6k48j76j58k45l5j80J32j75m3K0Qj05r5J21O4j4
$$ 2617 2776 2888 2959 3180 3005 3031 2783 2607 2449 2204 2169 1989 2121 1946 1903 1923 1931 1826 1731 1852 1916 1902
1114974A902j39J6q4j29K67l3j49J43K0J55M0P2k2J04L7k37r7m5q0q5p6p4J2j9
$$ 1902 1763 1779 1695 1566 1833 1800 1651 1794 1814 1969 2009 2081 2059 2163 2200 1963 1866 1821 1741 1656 1580 1506 1518 1499
1123128A499pM8o9jl9L6j04K6j31R3M0j42K5k2R4n3L1r1J16j1j95O1k0J9Q6p7j6
$$ 1499 1492 1540 1471 1470 1431 1467 1363 1389 1258 1351 1391 1249 1274 1252 1346 1293 1324 1233 1349 1338 1143 1204 1184 1203 1289 1212 1196
1132391A196r3J67n3j5N4j00J8l4KM9M1M0j62l0m7J27j38p8QQ3j39J66L1R9pm7
$$ 1196 1103 1270 1217 1202 1256 1156 1174 1140 1142 1191 1232 1272 1110 1080 1033 1160 1022 944 952 1035 896 1062 1093 1192 1185 1138
1141279A138j1q3o8K8j07N5J87m3R9J3j8k02j15K82k36j37K33j24qO7n9Q8P0j04
$$ 1138 1127 1044 976 1004 897 952 1139 1096 1195 1208 1190 988 873 1155 919 782 1015 891 883 950 891 979 1049 945
1149517I45j26N1j1P3L2m2k0j67Q7K8PO7r2J87p5m3R5Jj33O0m8k11nK31j21L3R5
$$ 945 819 870 859 932 964 922 902 735 822 850 857 924 832 1019 944 901 996 997 864 924 876 665 660 891 770 803 898
1158697H98p3J11Q0k41j21J67n8J0J6M8R8j04pM8P7o8p8k0j1J01j10LJ16O0k35
$$ 898 825 936 1016 775 654 821 763 773 789 837 935 831 824 872 949 881 803 783 772 873 763 766 882 942 707
1167277G07O3J24k88K6J97q3J4J32r2jj18J20k15J34L5J7J23m0J19q9j02n0l7K6
$$ 707 770 894 606 632 829 746 760 892 800 799 681 801 586 720 755 772 895 855 974 885 783 733 696 722
1175515G22q0L0R4j6O6j19J01l5m5Pp8P4M0L1j6K4j83m5Q3j0J4rK87k4j20p3q9
$$ 722 642 672 766 750 816 697 798 763 718 725 647 721 761 792 776 800 617 572 655 645 659 650 937 913 793 720 631
1184745F31O7n%r1J13mJ2l4O4O0q0l5L7j38J02J3j7J9j26R6n4j38J07j0Q5l8K8
$$ 631 698 693 693 602 715 711 723 689 753 813 733 698 735 597 699 712 695 714 588 684 630 492 599 589 674 636 664
1193925F64J45j40m8L9P3pO3J22j46q2N0o9o3k3QJ52o7j2O1l4j32P4J5J51M5j22
$$ 664 809 669 621 660 733 726 789 911 765 683 733 664 601 578 586 738 671 659 720 686 554 628 643 794 839 717
1202813G17J43l05J53N8k0j99M5N5J57L96L2Mm89k21o5L1J56l2j17J90m9K1J26
$$ 717 860 555 708 766 746 547 592 647 804 1200 1232 1236 747 526 461 492 648 616 499 689 640 661 787
1210659G87j12J9k6%k0j4o6k4J76J65k40J36m9l19oM73N47l8j33n94n65J09L33
$$ 787 675 694 668 668 648 634 568 544 720 885 645 781 732 413 407 880 1427 1389 1256 662 97 206 539
1218555E39K23j74L5K46k40J63J17
$$ 539 762 588 623 869 629 792 909
##END=
