##TITLE= 1-PHENYL-1,3-BUTANEDIONE
##JCAMP-DX= 5.00 $$From Command Line Converter 1.0
##DATA TYPE= NMR Spectrum
##DATA CLASS=  XYDATA

##ORIGIN= Exported from Command Line Converter 1.0
##OWNER= svb
##$URL= http://wwwchem.uwimona.edu.jm:1104/software/jcampdx.html
##SPECTROMETER/DATA SYSTEM= NUTS EXPORT
##.OBSERVE FREQUENCY= 75.480980
##.OBSERVE NUCLEUS= ^1H
##INSTRUMENTAL PARAMETERS= 1H
##XUNITS= PPM
##YUNITS= ARBITRARY UNITS
##XFACTOR= 0.0001956911
##YFACTOR= 13.0786930000
##FIRSTX=  10.414527
##FIRSTY= -9823.000000
##LASTX= 206.105700
##NPOINTS= 24201
##MAXY= 12872151.000000
##MINY= -206542.000000
##DELTAX=   0.008086
##XYDATA= (X++(Y..Y))
$$ [...]
$$ plain form
326153 -115 1326 2118 1529 886 270 -181 323 752 -44 -541 -422 641 1442 807 -649 -890 -537 58
326897 58 438 476 1260 2820 4293 4015 3391 4068 5375 5171 3088 2074 2425 3780 4352 4176 3872 3516
327641 3516 3841 4806 5872 6599 5020 2823 2570 2468 354 -1269 -677 1086 3006 4685 4966 2988
328301 2988 879 706 1270 1133 495 -518 -687 -343 873 3890 5843 5350 4612 5115 5828 5528 4879
329004 4879 3615 2470 1712 864 1000 2137 2566 1866 912 897 752 701 681 1358 1749 1469 1685 2590 4130
329789 4130 5260 4724 3208 3776 4952 5320 4718 3702 3128 3114 3193 2558 2187 2539 3341 4778 6140 6797
330533 6797 5312 2427 1052 920 1493 1715 1712 1243 -527 -516 780 1611 1068 226 589 1417 1620 2447
331277 2447 2741 458 -2570 -4878 -6416 -6860 -5987 -4003 -2233 -1291 -2021 -2394 -1680 -1042 -646 -325 60
$$ packed form
326153a15J441P92n89o43o16m51N04M29p96m97J19J063Q01o35j456k41L53N95
326897E8L80L8P84J560J473k78o24O77J307k04k083j014L51J355N72j76l04l56
327641C516L25R65J066P27j579k197k53j02k114j623N92J763J920J679K81j978
328301B988k109j73N64j37o38j013j69L44J216L017J953m93p38N03P13l00o49
329004D879j264j145p58q48J36J137M29p00r54j5j45n1k0O77L91k80K16R05J540
329789D130J130n36j516N68J176L68o02j016n74j4P9o35l71L52Q02J437J362O57
330533F797j485k885j375j32N73K22lm69j770J1J296Q31n43q42L63Q28K03Q27
331277B447K94k283l028k308j538m44Q73J984J770R42p30l73P14O38L96L21L85
$$ plain form
331979 60 -400 -1729 -2449 -1455 50 189 158 932 1505 1338 1178 1015 1433 2417 2947 2787 2211 2308 1651 -81
332806 -81 -701 284 355 123 545 249 -1291 -2634 -1757 -274 -36 -1748 -2753 -1842 -1638 -3509 -3932 -2260
333549 -2260 -1813 -1854 -1701 -1561 -2212 -2822 -1859 54 1967 3958 3724 1780 1159 869 -392 -2489 -2984
334252 -2984 -2446 -2041 -1463 -135 435 562 629 117 -5 849 1179 285 -395 -192 999 1150 1042 1570 1679
335037 1679 2067 2767 2587 2526 2574 3356 3460 2159 2158 2212 1010 284 -615 -3062 -3561 -646 2598 3250 1959
335822 1959 -869 -3045 -3374 -2817 -1096 1499 3140 3027 1750 756 53 -534 -359 1084 2404 2301
336483 2301 1662 1848 3244 5317 5426 4336 5569 5606 4805 5812 7713 8063 7780 6893 6397 6811 6879 5654
337227 5654 4520 2388 1124 522 -226 540 1728 2152 3063 3271 2106 388 -1239 -1897 -973 1431
$$ packed form
331979F0m60j329p20R94J505J39l1P74N73j67j60j63M18R84N30j60n76R7o57j732
332806h1o20R85P1k32M22k96j540j343Q77J483K38j712j005R11K04j871m23J672
333549b260M47m1J53J40o51o10R63J913J913J991k34j944o21k90j261k097m95
334252b984N38M05N78J328N70J27O7n12j22Q54L30q94o80K03J191J51j08N28J09
335037A679L88P00j80o1M8P82J04j301jN4j202p26q99k447m99K915L244O52j291
335822A959k828k176l29N57J721K595J641j13j277r94p03n87J75J443J320j03
336483B301o39J86J396K073J09j090J233L7q01J007J901L50k83q87m96M14O8j225
337227E654j134k132j264o02p48P66J188M24R11K08j165j718j627o58R24K404
$$ plain form
337888 1431 2834 3852 4814 5248 5627 5544 4513 3733 3516 3776 4890 5492 5189 4056 2667 2339 2359 1772
338632 1772 1619 1761 565 -1381 -1464 -117 2107 3492 3298 954 -931 -1175 -328 133 1393 3295
339293 3295 4752 4949 4580 5655 7271 7489 7679 7106 5210 2735 851 -111 -88 663 34 -380 150
339996 150 833 2002 2205 1659 1673 2051 1512 761 902 1706 2326 2602 1995 647 -778 -1453 -1618 -1115 -1268
340781 -1268 -1250 -41 1194 2950 5062 5059 4300 4010 4512 4847 5296 4506 2783 2143 1846 1534 1807 3065
341525 3065 3628 4259 3896 4087 6612 8069 7710 5471 2735 1238 673 121 -400 -418 -137 -922 -1468 -802
342269 -802 916 1740 937 -1128 -2252 -1623 -592 -412 -618 -765 206 434 406 1627 2969 2825 2165 1104
343012 1104 1075 2922 3080 2066 1394 857 399 -159 -973 -1792 -2100 -2241 -2424 -2754 -2407 -490 2502 5021
$$ packed form
337888A431J403J018R62M34L79q3j031p80k17K60J114O02l03j133j389l28K0n87
338632A772j53J42j196j946q3J347K224J385j94k344j885k44Q47M61J260J902
339293C295J457J97l69J075J616K18J90n73j896k475j884r62K3P51o29m14N30
339996A50O83J169K03n46J4L78n39p51J41Q04O20K76o07j348j425o75j65N03j53
340781a268J8J209J235J756K112lp59k90N02L35M49p90j723o40k97l12K73J258
341525C065N63O31l63J91K525J457l59k239k736j497n65n52n21j8K81p85n46O66
342269h02J718Q24q03k065j124O29J031J80k06j47R71K28k8J221J342j44o60j061
343012A104k9J847J58j014o72n37m58n58q14q19l08j41j83l30L47J917K992K519
$$ plain form
343756 5021 6029 4447 2226 753 127 -628 -1680 -2559 -2280 -1279 276 2471 4222 4627 5165 6067
344417 6067 5966 4717 4263 3613 3066 2479 2364 2545 2653 2525 1463 578 883 1743 2953 3854 2787 1302
345161 1302 738 968 1700 1511 830 405 82 317 1658 4206 5683 5360 5503 5613 6115 6363 5464 4613
345905 4613 3019 1403 498 187 -575 -1514 -1203 -744 -401 -98 554 2288 4419 6491 7992 7779 7481
346607 7481 7172 5497 2625 924 208 -1517 -2562 -1848 -190 2263 4248 5076 4009 3004 3147 3004
347268 3004 2327 3082 4910 4529 2884 1458 821 562 809 1624 2279 2275 1065 -76 498 2602 3206 3288
348012 3288 3343 2623 116 -3578 -4348 -2727 -388 1246 1431 2017 2993 3823 4080 4274 3366 1153 978
348715 978 2397 2679 892 -704 171 1692 2926 2561 2568 3180 4195 6295 7353 5828 3206 2467 3374
$$ packed form
343756E021J008j582k221j473o26p55j052q79K79J001J555K195J751M05N38R02
344417F067j01j249m54o50n47n87j15J81J08j28j062q85L05Q60J210R01j067j485
345161A302n64K30P32j89o81m25l23K35J341K548J477l23J43J10N02K48q99q51
345905D613j594j616r05l11p62r39L11M59L43L03O52J734K131K072J501k13k98
346607G481l09j675k872j701p16j725j045P14J658K453J985Q28j067j005J43j43
347268C004o77P55J828l81j645j426o37k59K47Q15O55mj210j141N74K104O04Q2
348012C288N5p20k507l694p70J621K339J634J85N86R76Q30K57J94r08k213j75
348715I78J419K82j787j596Q75J521J234l65PO12J015K100J058j525k622p39R07
$$ plain form
349417 3374 4263 4858 6894 8141 7892 7473 6586 5330 4253 3564 3527 3541 2249 1057 755 1831 2757
350120 2757 4112 5005 5020 3823 3481 3646 3188 2905 1920 395 -364 -1550 -4056 -5429 -4952 -2672 -429
350822 -429 2490 4885 5457 5313 5069 5636 5449 3001 -124 -1118 -1408 -2098 -2961 -3086 -2326 -1042 -125 451
351566 451 357 -215 -1099 -1939 -1345 -715 -513 -1136 -1399 -2172 -2144 -1221 -983 -603 -1252 -1913 -612 1844 4176
352351 4176 5145 4053 2102 1228 1314 1350 1561 1517 1719 1453 1748 2090 1675 1204 1147 1908 2671 2407 1367
353136 1367 -253 -1825 -2315 -1105 240 264 25 -1064 -1332 -316 1536 3510 3365 1458 -766 -1693
353797 -1693 -1962 -2435 -3726 -4902 -4268 -2626 -893 -1746 -3140 -3649 -3671 -3737 -5416 -6902 -7434 -6717 -5330
354500 -5330 -3702 -1518 58 380 1442 2059 1133 370 -742 -1102 -135 756 1297 628 1264 1600 2033
$$ packed form
349417C374Q89N95K036J247k49m19q87j256j077o89l7J4j292j192l02J076R26
350120B757J355Q93J5j197l42J65m58k83r85j525p59j186k506j373M77K280K243
350822d29K919K395N72j44k44N67j87k448l125r94k90o90q63j25P60J284R17N76
351566D51r4n72q84q40N94O30K02o23k63p73K8R23K38L80o49o61J301K456K332
352351D176R69j092j951q74Q6L6K11m4K02k66K95L42m15m71n7P61P63k64j040
353136A367j620j572m90J210J345K4k39j089k68J016J852J974j45j907k224r27
353797a693k69m73j291j176O34J642J733q53j394n09k2o6j679j486n32P17J387
354500e330J628K184J576L22J062O17r26p63j112l60R67Q91N41o69O36L36M33
$$ plain form
355202 2033 2527 2934 2147 2336 3228 2880 2441 1635 1034 853 472 552 814 265 281 831 1505 1856 1444 1247
356029 1247 2011 1736 1061 1238 1102 -55 -827 -322 437 393 767 2327 3103 3181 3157 3052 3923 4770 4598
356814 4598 4265 3076 2442 2588 3528 3727 2089 -163 -868 -578 -922 -749 462 1681 1153 -155 -1420
357517 -1420 -2113 -2374 -4172 -5060 -4230 -3564 -3179 -1884 210 1040 395 -569 -1385 355 3891 4288 3280
358219 3280 2875 2857 2647 1779 1481 1775 2383 2963 2524 2098 1637 453 603 947 102 -1546 -1435 -416
358963 -416 305 122 263 1543 3479 5133 5828 5377 3239 1142 1060 2828 4424 6068 7663 8209 7939
359665 7939 7156 6773 6387 5792 5283 3710 3575 5112 6266 6482 5270 4368 5264 6959 7050 5627 5272
360368 5272 4086 1923 505 -58 -133 1306 2870 3455 4244 6085 7075 7242 7312 6550 6765 6551 6081 6425
$$ packed form
355202B033M94M07p87J89Q92l48m39q06o01j81l81Q0K62n49J6N50O74L51m12j97
356029A247P64k75o75J77j36j157p72N05P59m4L74J560P76P8k4j05Q71Q47j72
356814D598l33j189o34J46R40J99j638k252p05K90l44J73J211J219n28j308j265
357517a420o93k61j798q88Q30O66L85J295K094Q30o45r64q16J740L536L97j008
358219C280m05j8k10q68k98K94O08N80m39m26m61j184J50L44q45j648J11J019
358963d16P21j83J41J280J936J654O95m51k138k097q2J768J596J644J595N46k70
359665G939p83l83l86n95n09j573j35J537J154K16j212r02Q96J695R1j423l55
360368E272j186k163j418n63p5J439J564N85P89J841R90J67P0p62K15k14m70L44
$$ plain form
361112 6425 7895 7517 4374 2522 2093 2341 3584 4352 4244 3736 2088 1127 -223 -1524 -2108 -2580 -1880
361814 -1880 -42 1628 2149 3545 4970 4782 3159 2452 3797 5696 5466 4472 3388 2514 1988 1508
362475 1508 1095 1891 2242 1753 1076 936 1345 1868 2593 3404 3335 4333 5308 4225 1857 161 -1273 -2565
363219 -2565 -3200 -2351 -1843 -2344 -3425 -3693 -2618 -1944 -2194 -1261 1119 2602 2265 758 -1043 -1039 -387 -1498
363963 -1498 -2710 -2459 -644 1239 2439 3392 5014 5515 2743 -650 -3601 -6030 -5714 -4689 -3952 -3827
364624 -3827 -3225 -2192 -647 523 209 -110 457 484 166 131 893 1457 1077 1131 1820 1215 -160 -1694
365368 -1694 -2206 -1846 -1373 -1012 -646 -120 -363 -659 -1086 -1479 -1334 -1174 -1562 -1278 -255 -474 -1730 -1356
366111 -1356 285 1272 1901 3148 4151 4382 5304 6505 6264 4907 3087 2555 2816 2849 3199 3431 4152
$$ packed form
361112F425J470l78l143j852m29K48J243P68j08n08j648r61j350j301n84m72P00
361814a880J838J670N21J396J425j88j623p07J345J899k30r94j084q74n26m80
362475A508m13P96L51m89o77j40M09N23P25Q11o9R98R75j083k368j696j434j292
363219b565o35Q49N08n01j081k68J075O74k50R33K380J483l37j507j801MO52j111
363963a498j212K51J815J883J200R53J622N01k772l393k951k429L16J025P37J25
364624c827O02J033J545J170l14l19N67K7l18l5P62N64l80N4O89o05j375j534
365368a694n12L60M73L61L66N26k43k96m27l93J45J60l88K84J023k19j256L74
366111a356J641R87O29J247J003K31R22J201k41j357j820n32K61L3L50K32P21
$$ plain form
366814 4152 4863 4686 4635 3938 2602 2070 1573 917 802 -169 -1351 -1874 -660 125 44 631 1315 2535
367558 2535 4773 6665 5294 2398 354 -1193 -1195 460 1280 1152 1668 3097 3143 1767 1559 2079 3415
368260 3415 5970 7378 8237 8280 7245 6847 6941 6224 4914 2936 1673 1299 1566 1790 1455 1097 175 -1414
369004 -1414 -760 805 965 577 186 738 2997 4528 3709 662 -710 344 1107 -21 -2319 -3059
369665 -3059 -1516 -533 269 1169 1737 1335 778 -137 -1589 -1913 -1600 -450 1549 3803 5149 4702 3163
370367 3163 2531 3368 4654 5826 6562 6517 5465 2784 426 210 847 914 312 769 1998 3499 3820
371070 3820 2629 2707 3572 2940 1059 -1993 -3842 -3159 -2167 -1359 127 1302 942 321 172 973 2874
371772 2874 3923 2728 -514 -2684 -3461 -2975 -2034 -883 657 1475 579 -11 -94 -717 -1484 -804 1894
$$ packed form
366814D152P11j77n1o97j336n32m97o56j15r71j182n23J214P85q1N87O84J220
367558B535K238J892j371k896k044j547kJ655Q20j28N16J429M6j376k08N20J336
368260C415K555J408Q59M3j035l98R4p17j310j978j263l74K67K24l35l58r22j589
369004a414O54J565J60l88l91N52K259J531q19l047j372J054P63j128k298p40
369665c059J543R83Q02R00N68m02n57r15j452l24L13J150J999K254J346m47j539
370367C163o32Q37J286J172P36m5j052k681k358k16O37O7o02M57J229J501L21
371070C820j191P8Q65o32j881l052j849O83R92Q08J486J175l60o21j49Q01J901
371772B874J049j195l242k170p77M86R41J151J540Q18q96n90q3o23p67O80K698
$$ plain form
372475 1894 3968 4586 5311 6302 7453 7458 7173 5855 3005 208 -1206 -2108 -4476 -6255 -5650 -4448 -3198
373178 -3198 -1433 332 1907 3783 4840 3317 1687 699 548 768 715 556 84 -242 -235 -592 -1674
373880 -1674 -2189 -1253 -427 -243 83 11 -1037 -1744 -1690 -1903 -1596 -926 -731 -733 -100 99 -773 -571 -1428 -2234
374707 -2234 -1295 -1191 -2355 -2906 -2919 -2254 -1696 -1730 -3151 -2916 4 2962 5173 7485 8570 8060 6466
375409 6466 4877 2761 1428 1493 1186 706 -877 -1370 77 1715 1370 -889 -2552 -2730 -2716 -2847 -1820
376112 -1820 -721 -1672 -2736 -3669 -4063 -4413 -3395 -1414 9 217 163 -470 -811 -2695 -4728 -6081 -7815
376814 -7815 -8433 -6931 -3533 -1077 -605 195 959 1461 2658 3753 3568 3487 3881 5147 6337 6167 5409
377517 5409 4453 2516 485 -1297 -1906 -186 2090 2753 2651 3364 3463 4316 4617 2753 815 620 2251
$$ packed form
372475A894K074O18P25R91J151Nk85j318k850k797j414r02k368j779O05J202J250
373178c198J765J765J575J876J057j523j630r88j51K20n3j59m72l26Pl57j082
373880a674n15R36Q26J84L26p2j048p07N4k13L07O70J95kO33J99q72K02q57q06
374707b234R39J04j164n51j3O65N58l4j421K35K920K958K211K312J085n10j594
375409F466j589k116j333O5l07m80j583m93J447J638l45k259j663j78J4j31J027
376112a820J099r51j064r33l94l50J018J981J423K08n4o33l41j884k033j353j734
376814g815o18J502L398K456M72Q00P64N02J197J095j85q1L94J266J190j70p58
377517E409r56j937k031j782o09J720K276O63j02P13R9Q53L01j864j938j95J631
$$ plain form
378219 2251 4297 4585 3009 3137 3672 2974 3203 4489 4797 3495 551 -1250 -1158 -373 71 131 344 432
378963 432 -372 -263 1763 4191 4681 3642 3334 4376 4103 2336 1759 1525 1423 3501 5894 7281 8465
379665 8465 8457 5853 3810 2533 1225 1640 1934 870 1368 2945 3365 2207 1109 2102 3960 5011
380326 5011 4700 3034 2180 3691 3651 1189 274 405 1668 3670 3374 2177 1802 2347 2766 2802 2902 2866
381070 2866 2740 3553 5187 4915 3082 1996 1498 -522 -1583 43 1329 363 -699 -1112 -219 1465
381731 1465 2021 2041 2328 806 -659 -287 -1089 -1872 -1550 -595 913 1319 -111 -2180 -2779 -1515 -1475 -3500
382475 -3500 -5382 -5860 -5381 -4352 -2328 -206 427 711 2342 3564 3381 2936 2427 2138 1676 880 193
383178 193 595 881 661 1062 886 526 1495 3506 3685 2476 2161 2063 3458 6060 7794 8261 8466 7190
$$ packed form
378219B251K046K88j576J28N35o98K29J286L08j302k944j801R2P85M44O0K13Q8
378963D32q04J09K026K428M90j039l08J042k73j767n77k34j02K078K393J387J184
379665H465qk604k043j277j308M15K94j064M98J577M20j158j098R93J858J051
380326E011l11j666q54J511m0k462r15J31J263K002k96j197l75N45M19L6J00l6
381070B866j26Q13J634k72j833j086m98k020j061J626J286r66j062m13Q93J684
381731A465N56K0K87j522j465L72q02p83L22R55J508M06j430k069n99J264M0k025
382475c500j882m78M79J029K024K122O33K84J631J222j83m45n09k89m62p96o87
383178A93M02K86k20M01j76l60R69K011J79j209l15r8J395K602J734M67K05j276
$$ plain form
383922 7190 5325 3848 1590 327 927 2250 3200 3188 2762 2542 2064 2398 2371 1847 2691 3280 4312 5650
384665 5650 4281 2344 2197 3565 4791 5311 5548 3930 2106 1269 1729 1192 238 257 1435 3074 4735
385368 4735 6151 6824 6634 5741 3937 2739 2772 2965 2471 1670 1436 1516 2374 3471 4058 4718 4595 4318
386111 4318 4547 4944 5850 6352 6289 5625 5089 4313 3007 2435 3897 7127 8151 7201 6634 8442 11287
386814 11287 12235 10183 7307 6021 5239 4763 4835 4031 3962 3789 4188 4561 3829 3640 4202 5281 6269 6113
387558 6113 5844 5419 4542 4930 6496 7605 6913 5939 5759 5676 6650 7518 7388 6855 5413 4706 4458 4275
388302 4275 4687 5896 6441 4544 2643 2770 3280 2318 2128 2997 3598 3914 5191 6043 4812 3690 3388
389004 3388 3372 4260 5998 6144 5253 6415 8243 8998 9548 10377 11947 13448 14581 14018 13791 14283 14087
$$ packed form
383922G190j865j477k258j263O00J323R50j2m26k20m78L34k7n24Q44N89J032J338
384665E650j369j937j47J368J226N20K37j618j824q37M60n37r54J9J178J639J661
385368D735J416O73j90q93j804j198L3J93m94q01k34Q0Q58J097N87O60j23k77
386111D318K29L97R06N02o3o64n36p76j306n72J462L230J024r50n67J808K845
386814A1287R48k052k876j286p82m76P2q04o9j73L99L73p32j89N62J079R88j56
387558F113k69m25q77L88J566J109o92r74j80q3R74Q68j30n33j442p07k48j83
388302D275M12J209N45j897j901J27N10r62j90Q69O01L16J277Q52j231j122l02
389004C388j6Q88J738J46q91J162J828P55N50Q29J570J501J133n63k27M92j96
$$ plain form
389707 14087 12268 9989 9826 11024 11817 11179 9816 8023 6261 7062 9317 11260 13429 14712 14794 13621
390367 13621 13141 12302 11270 11299 12477 13617 14224 15957 15716 14407 14866 17598 20671 22886 24274 24737
391029 24737 24625 25303 26520 29368 32872 35914 41044 49410 61437 78193 100619 132779 181060
391566 181060 248820 327292 386498 390900 345648 286145 234740 194491 162672 137219 115592
392021 115592 97524 83704 74478 68022 62418 56675 50879 45913 42216 39174 35118 30425 25028
392558 25028 21836 22274 23329 23844 24099 23778 22885 21488 20693 21639 24113 24773 24499 25313 26589 27361 27795
393260 27795 29146 31116 33400 36955 41369 48144 57073 69482 87772 114402 154254 213023 290488
393797 290488 364001 391235 361346 304512 249400 203761 168597 142115 121278 104599 92001
$$ packed form
389707A4087j819k279j63J198P93o38j363j793j762Q01K255J943K169J283Q2j173
390367A3621m80q39j032K9J178J140O07J733k41j309M59K732L073K215J388M63
391029B4737j12O78J217K848L504L042N130Q366J2027J6756K2426L2160M8281
391566A81060O7760P8472N9206M402m5252n9503n1405m0249l1819k5453k1627
392021A15592j8068j3820r226o456n604n743n796m966l697l042m056m693n397
392558B5028l192M38J055N15K55l21q93j397p95R46K474O60k74Q14J276P72M34
393260B7795J351J970K284L555M414O775Q929J2409J8290K6630L9852N8769P7465
393797B90488P3513K7234k9889n6834n5112m5639l5164k6482k0837j6679j2598
$$ plain form
394252 92001 82325 74402 68231 61583 54849 49213 43615 38268 32844 27330 22394 19711 19964 21402
394831 21402 21597 20664 20281 19433 17501 15270 14989 17601 19894 20319 19740 19544 19934 21186 22816 23975
395492 23975 25646 28168 32060 39092 48483 60258 76956 99523 132616 183898 254370 330857
395988 330857 378670 370061 320257 262213 212402 173005 141723 117765 100311 86196 76357 69963
396483 69963 63276 56253 49772 42860 36432 31206 25888 20281 16288 14320 13367 11000 8293 6234
397062 6234 4098 3302 3566 4264 4405 4032 2960 2014 1237 640 -350 -52 1646 1962 968 836 667 -167
397806 -167 -308 427 1196 2620 4730 3908 1377 -69 -250 -259 162 867 1113 54 -1839 -2313 -2234 -3643
398549 -3643 -4110 -2610 -552 1062 562 -630 -951 -1332 -1249 -1875 -2669 -2005 -327 2107 4614 3898 1355
$$ packed form
394252I2001r676p923o171o648o734n636n598n347n424n514m936k683K53J438
394831B1402J95r33l83q48j932k231k81K612K293M25n79j96L90J252J630J159
395492B3975J671K522L892P032R391J1775J6698K2567L3093N1282P0472P6487
395988C30857M7813q609m9804n8044m9811l9397l1282k3958j7454j4115r839o394
396483F9963o687p023o481o912o428n226n318n607l993j968r53k367k707k059
397062F234k136p96K64O98J41l73j072r46p77n97r90K98J698L16r94j32j69q34
397806a67j41P35P69J424K110q22k531j446j81rM21P05K46j059j893m74P9j409
398549c643m67J500K058J614n00j192l21l81Q3o26p94O64J678K434K507p16k543
$$ plain form
399252 1355 -248 -911 -1687 -892 86 -140 -306 20 298 446 1156 1880 2296 2549 2256 649 -1190 -1435
399996 -1435 -900 -514 -1103 -376 1546 3261 4222 3417 2280 2251 1970 426 -2835 -5389 -6256 -4162 -1432
400698 -1432 -2099 -4518 -5811 -5405 -4526 -2157 816 2941 3755 3049 1879 436 -2006 -3692 -4371 -4271
401359 -4271 -3796 -2402 -407 -192 -923 -1572 -1398 -380 1121 1569 1582 2480 3363 4828 5033 2964 775
402062 775 -466 -740 -409 -777 -1926 -2334 -1219 674 2460 2751 1710 -801 -3169 -4049 -3896 -2544
402723 -2544 -2614 -3349 -2561 -1493 -805 -5 -133 -298 598 893 682 330 -541 -2524 -3016 -1700 -1365 -1028
403467 -1028 880 1843 3345 4530 4030 3455 2729 995 372 547 98 -1399 -3586 -3660 -2719 -2130 -142
404169 -142 1024 1182 2570 4448 4959 4426 4161 3937 4040 5011 6995 7754 5870 2889 -59 -1980 -1254
$$ packed form
399252A355j603o63p76P95R78k26j66L26K78J48P10P24M16K53k93j607j839k45
399996a435N35L86n89P27J922J715R61q05j137k9k81j544l261k554q67K094K730
400698a432o67k419j293M06Q79K369K973K125Q14p06j170j443k442j686o79J00
401359d271M75J394J995K15p31o49J74J018J501M48J3Q98Q83J465K05k069k189
402062G75j241k74L31l68j149m08J115J893J786K91j041k511k368q80J53J352
402723b544p0p35P88J068O88Q00j28j65Q96K95k11l52q71j983m92J316L35L37
403467a028J908R63J502J185n00n75p26j734o23J75m49j497k187p4R41N89J988
404169a42J166J58J388J878N11n33k65k24J03R71J984P59j884k981k948j921P26
$$ plain form
404872 -1254 1126 1288 -75 218 295 -70 -702 -3010 -4803 -3576 -1183 255 1674 3212 4428 5086
405533 5086 5142 3618 2782 2620 2429 1151 57 571 1655 1656 971 -368 -3085 -5087 -6395 -7733 -7065
406235 -7065 -3795 -385 2366 4404 5012 4095 2082 385 -366 138 421 546 1726 3112 3599 4107
406897 4107 4170 4414 4290 2267 -129 -899 57 2726 4303 3258 1841 -192 -1611 -1750 -1323 -1749 -4020
407599 -4020 -5046 -4672 -3678 -2895 -2267 -710 43 -682 -866 -327 772 2022 2569 2379 2087 567 -996
408302 -996 -614 480 -261 -1270 -1204 -1526 -2674 -3617 -3703 -2130 -1034 -1315 -3358 -4911 -5095 -4694 -3740 -1532
409045 -1532 306 671 394 -630 -47 2545 4682 4870 3950 2169 1317 227 -2279 -3181 -2423 -2079 -656
409748 -656 1708 3431 4330 4681 3673 2390 1642 1233 334 591 1347 1165 266 560 1282 1516 1631 879
$$ packed form
404872a254K380J62j363K93P7l65o32k308j793J227K393J438J419J538J216O58
405533E086N6j524q36j62j91j278j094N14J084Jo85j339k717k002j308j338O68
406235g065L270L410K751K038O08r17k013j697p51N04K83J25J180J386M87N08
406897D107O3K44j24k023k396p70R56K669J577j045j417k033j419j39M27m26k271
407599d020j026L74R94P83O28J557P53p25j84N39J099J250N47j90k92j520j563
408302i96L82J094p41j009O6l22j148r43q6J573J096k81k043j553j84M01R54K208
409045a532J838L65k77j024N83K592K137J88r20j781q52j090k506r02P58L44J423
409748f56K364J723Q99L51j008j283p48m09q99K57P56j82q99K94P22K34J15p52
$$ plain form
410491 879 -121 -716 -2319 -4291 -4700 -4404 -3640 -1643 -65 210 1045 3168 4901 6125 6012 5170 4748
411194 4748 5106 6556 8667 9390 8429 7422 7074 5900 4209 2903 2134 1944 1578 541 -639 -1525
411855 -1525 -1685 -2019 -2833 -3108 -1396 702 1724 2109 3990 4777 2950 609 -921 -3037 -4305 -2799
412517 -2799 -434 1180 1660 2316 4067 4687 2679 582 -286 -448 -728 -692 -1123 -149 2746 5514 5251
413219 5251 4190 3172 2947 3411 3384 2268 1586 2787 3168 1992 989 965 1885 2174 1387 730 881 977
413963 977 545 1066 2423 2658 2386 2592 1752 543 1001 2724 2839 1473 -760 -3246 -4892 -5313 -5583
414665 -5583 -4582 -2571 -792 930 2474 2689 1649 741 685 93 -178 283 -152 51 963 1165 1696
415368 1696 2934 3683 2893 1441 728 -1231 -2721 -2491 -2772 -3707 -3852 -3138 -3234 -4028 -3429 -1860 -768
$$ packed form
410491H79j000n95j603j972m09K96P64J997J578K75Q35K123J733J224j13q42m22
411194D748L58J450K111P23r61j007l48j174j691j306p69j90l66j037j180q86
411855a525j60l34q14k75J712K098J022L85J881P87j827k341j530k116j268J506
412517b799K365J614M80O56J751O20k008k097q68j62k80L6m31R74K895K768k63
413219E251j061j018k25M64k7j116o82J201L81j176j003k4R20K89p87o57J51R6
413963I77m32N21J357K35k72K06q40j209M58J723J15j366k233k486j646m21k70
414665e583J001K011J779J722J544K15j040r08n6n92k71M61m35K03R12K02N31
415368A696J238P49p90j452p13j959j490K30k81r35j45P14r6p94N99J569J092
$$ plain form
416070 -768 87 -540 -961 -1182 -2839 -4676 -4362 -2931 -1062 156 264 444 -281 -2194 -4423 -4693 -3205
416773 -3205 -1890 13 1424 812 -1397 -3621 -3225 -1120 -438 -509 -495 -310 -323 516 1470 1164 1883 3722
417516 3722 4329 3845 2042 101 543 1310 1130 1392 1710 333 -1600 -1611 213 663 -422 -1489 -1638
418219 -1638 -1168 -658 -482 -765 -1243 -1717 -1151 346 1393 2413 4772 6545 5428 3108 2215 963
418880 963 -476 -1309 -1917 -2761 -4156 -5649 -5606 -5062 -4271 -3683 -4630 -6802 -7606 -6152 -5665 -7073 -7533 -6109
419624 -6109 -4221 -2382 -1027 -2838 -5025 -5023 -3365 -1183 -63 -550 -1772 -2019 -249 1515 1103 -536
420285 -536 -487 -40 147 885 2390 3646 4229 4413 4484 3597 1513 -924 -2769 -3183 -1879 -731 -69 753
421029 753 227 -330 -279 -1604 -2383 -2014 -447 458 -1413 -3422 -3142 -3404 -4608 -4179 -2863 -1643 -932
$$ packed form
416070g68Q55o27m21k21j657j837L14J431J869J218J08J80p25j913k229k70J488
416773c205J315J903J411o12k209k224L96K105O82p1J4J85j3Q39R54l06P19J839
417516C722O07m84j803j941M42P67j80K62L18j377j933j1J824M50j085j067j49
418219a638M70N10J76k83m78m74N66J497J047J020K359J773j117k320q93j252
418880I63j439q33o08q44j395j493M3N44P91N88r47k172q04J454M87j408m60J424
419624f109J888J839J355j811k187KJ658K182J120m87j222k47J770J764m12j639
420285e36M9M47J87P38J505J256N83J84P1q87k084k437j845m14J304J148O62Q22
421029G53n26n57N1j325p79L69J567R05j871k009K80k62j204M29J316J220P11
$$ plain form
421732 -932 -909 -328 783 1937 2833 3526 4115 4119 2906 2241 1237 -1107 -1986 -94 1341 1047 518 206
422475 206 -116 696 1565 -41 -3062 -5069 -5283 -3606 -2427 -2257 -1635 -1117 -1535 -2101 -1739 -801 -747 110
423219 110 1699 3383 3604 3417 3177 2809 2350 1529 -1002 -3320 -3963 -4471 -4747 -3516 -2629 -3048 -4316
423921 -4316 -4988 -5679 -4739 -2810 -1732 -1402 -1061 -1315 -2196 -2440 -2128 -2433 -2826 -3449 -2504 -1184 -516 -919
424665 -919 -2374 -3747 -4940 -5241 -5460 -4316 -3032 -2490 -1801 -1151 -1416 -2355 -3761 -4691 -4540 -3539 -1025
425367 -1025 1686 2155 638 -212 -61 542 2806 4516 4663 3556 2710 2205 2612 3660 3885 2984 1670
426070 1670 1635 2555 2617 2543 2355 1833 1224 1843 3406 4517 4602 3096 737 -1216 -2994 -3484 -2566 -1824
426814 -1824 -2705 -4314 -6075 -6562 -4770 -729 2619 3068 1245 554 -3 -767 -1193 98 1783 2701
$$ packed form
421732i32K3N81J111J154Q96O93N89Mj213o65j004k344q79J892J435k94n29l12
422475B06l22Q12Q69j606l021k007k14J677J179J70O22N18m18n66L62R38N4Q57
423219A10J589J684K21j87k40l68m59q21k531k318o43n08k76J231Q87m19j268
423921d316o72o91R40J929J078L30L41k54q81k44L12l05l93o23R45J320O68m03
424665i19j455j373j193l01k19J144J284N42O89O50k65r39j406r30J51J001K514
425367a025K711M69j517q50J51O03K264J710J47j107q46n05M07J048K25r01j314
426070A670l5R20O2p4j88n22o09O19J563J111Q5j506k359j953j778m90R18P42
426814a824q81j609j761m87J792M041L348M49j823o91n57p64m26J291J685R18
$$ plain form
427475 2701 2182 1131 2040 3642 4441 4272 4036 4076 4968 4971 3335 2099 2047 2581 3501 5196 6384 5232
428219 5232 3721 3173 2956 2468 1743 1186 1235 2033 2346 1557 366 -612 -994 -634 411 1416 1627 1672
428963 1672 3452 5733 5101 3174 1154 -549 86 2039 3083 2640 2723 2430 1210 1436 3169 4112
429624 4112 3648 3281 3392 2984 2667 2511 2160 1407 -15 -2160 -3505 -3031 -908 1475 3850 5384 5126
430326 5126 4133 2060 -914 -2133 -1843 -960 381 1497 1068 -754 -2340 -1451 563 1536 791 341
430988 341 1009 1998 1913 446 45 101 -563 -749 -1286 -2374 -2674 -2089 -1890 -1618 -839 -88 87 845 1969
431773 1969 1289 1049 1827 2956 4332 5049 5902 6422 6401 6142 4738 2017 -308 -145 1008 7 -1582
432475 -1582 -2425 -2719 -2291 -1889 -1432 -1135 -1638 -2603 -3555 -3687 -2142 -1369 -1740 -1809 -1116 39 327 829 1569
$$ packed form
427475B701n19j051R09J602P99j69k36M0Q92Lj636j236n2N34R20J695J188j152
428219E232j511n48k17m88p25n57M9P98L13p89j191r78l82L60J045J005K11M5
428963A672J780K281o32j927k020j703O35J953J044m43Q3k93j220K26J733R43
429624D112m64l67J11m08l17j56l51p53j422k145j345M74K123K383K375J534k58
430326E126r93k073k974j219K90Q83J341J116m29j822j586Q89K014R73p45m50
430988C41O68R89q5j467m01N6o64j86n37j088l00N85J99K72P79P51J75P58J124
431773A969o80k40P78J129J376P17Q53N20k1k59j404k721k325J63J153j001j589
432475a582q43k94M28M02M57K97n03r65r52j32J545P73l71o9O93J155K88N02P40
$$ plain form
433260 1569 2151 2564 2439 1695 1553 2550 2318 569 411 654 223 144 390 983 2254 2459 931 -112
434004 -112 -2201 -4829 -5751 -5044 -4701 -4873 -5792 -5264 -2762 484 2025 2406 3110 4063 4563 4185 3516 2334
434748 2334 878 -23 1530 3302 3246 3267 3878 3200 1138 -313 -1144 -2758 -2487 -136 1727 2561 2442
435450 2442 2081 844 115 -1087 -2576 -2888 -2884 -2552 -933 906 2188 3523 4733 5898 4745 1384
436111 1384 -1539 -1781 86 753 1397 3371 4038 2779 456 -1233 -827 247 576 129 -1315 -2136
436773 -2136 -1494 -976 -690 -280 113 217 -4 -798 -875 -561 -518 -1118 -1447 -1303 -868 -1605 -2340 -1986 -1297 -275
437599 -275 1329 3472 4744 4700 4938 5742 4110 157 -3200 -3964 -2430 -902 -542 -928 419 2758
438260 2758 4404 5178 4340 2684 1516 1051 -426 -1201 -731 262 687 446 -149 -118 2556 4175 2480
$$ packed form
433260A569N82M13j25p44j42R97k32j749j58K43m31p9K46N93J271K05j528j043
434004a12k089k628r22P07L43j72r19N28K502L246J541L81P04R53N00l78o69j182
434748B334j456r01J553J772n6K1O11o78k062j451q31j614K71K351J863Q34j19
435450B442l61j237p29j202j489l12ML32J619J839J282J335J210J165j153l361
436111A384k923k42J867O67O44J974O67j259k323j689M06J074L29m47j444q21
436773b136O42N18K86M10L93J04k21p94p7L14M3o00l29J44M35p37p35L54O89J022
437599b75J604K143J272m4K38Q04j632l953l357p64J534J528L60l86J347K339
438260B758J646P74q38j656j168m65j477p75M70R93M25k41n95L1K674J619j695
$$ plain form
438963 2480 736 -729 -1449 -1348 -318 1629 3755 5605 5870 5623 5154 4281 5177 6710 4803 1605
439624 1605 -288 -542 -718 -1156 -1075 66 216 -738 -977 -780 -2550 -5014 -5619 -5171 -5426 -5844 -5148 -2472
440368 -2472 535 729 -659 -2760 -2872 -563 731 437 -49 603 977 1776 3172 4692 4093 2307
441029 2307 952 -719 -2131 -2543 -1448 -15 334 -904 -2386 -3155 -3368 -2901 -1609 -803 -755 -273 832
441732 832 710 -688 -236 667 1456 1964 1463 802 -414 -2972 -4872 -5625 -4633 -3279 -3040 -3459 -4681
442434 -4681 -4108 -1613 -1518 -2955 -2124 -360 -347 -1859 -2545 -2418 -3016 -4122 -5118 -4423 -2269 -173 1357
443136 1357 1423 1700 2953 4281 4017 2282 1526 1713 -1 -2171 -1039 1053 2329 3390 3670 2960
443797 2960 2756 4012 4842 5227 4823 4479 4700 4315 3322 2092 1478 2830 4306 3603 2854 1782 -715
$$ packed form
438963B480j744j465p20J01J030J947K126J850K65k47m69q73Q96J533j907l198
439624A605j893k54j76m38Q1J141J50r54k39J97j770k464o05M48k55m18O96K676
440368b472L007J94j388k101j12K309J294k94m86O52L74P99J396J520n99j786
441029B307j355j671j412m12J095J433L49j238j482p69k13M67J292Q06M8M82J105
441732H32j22j398M52R03P89N08n01o61j216k558j900p53R92J354K39m19j222
442434d681N73K495R5j437Q31J764J3j512o86J27n98j106r96O95K154K096J530
443136A357O6K77J253J328k64j735p56J87j714k170J132K092J276J061K80p10
443797B960k04J256Q30L85m04l44K21l85r93j230o14J352J476p03p49j072k497
$$ plain form
444500 -715 -3331 -4996 -3772 -1633 -495 -1276 -2300 -2323 -2996 -3392 -3055 -1693 -1544 -2443 -4349 -4915 -5042
445202 -5042 -6311 -5967 -5008 -4165 -3786 -3622 -3279 -2343 541 3468 4342 1905 -1463 -3981 -5223 -5891 -6171
445905 -6171 -5128 -4619 -5262 -5172 -5570 -6217 -5506 -4182 -568 2840 2793 2395 1129 603 1060 357 -801 -1223
446649 -1223 -1453 -1110 -471 902 2109 2323 849 -386 -15 1644 3694 5009 5387 4001 3616 4250
447310 4250 4123 4290 3800 2775 3509 3894 2804 3201 5445 6988 5435 2979 1214 1737 2514 3413 4917
448012 4917 5440 4269 2605 1436 703 -359 -1216 -1027 -331 19 -488 72 2559 3960 3443 1646 -1421
448715 -1421 -3205 -2497 -1662 -857 97 457 -169 -1507 -1699 -3383 -5097 -5883 -6295 -6179 -5393 -3932 -3402
449417 -3402 -2534 -2235 -2598 163 3671 2893 471 310 2744 3501 2591 1694 3300 5527 7052 7230 6344
$$ packed form
444500g15k616j665J224K139J138p81j024k3o73l96L37J362J49q99j906n66j27
445202e042j269L44R59Q43L79J64L43R36K884K927Q74k437l368k518j242o68k80
445905f171J043N09o43R0l98o47P11J324L614L408m7l98j266n26M57p03j158m22
446649a223k30L43O39J373J207K14j474j235L71J659K050J315L78j386l85O34
447310D250j27J67m90j025P34L85j090L97K244J543j553k456j765N23P77Q99J504
448012D917N23j171j664j169p33j062q57J89O96L50n07N60K487J401n17j797l067
448715a421j784P08Q35Q05R54L60o26j338j92j684j714p86m12J16P86J461N30
449417c402Q68K99l63K761L508p78k422j61K434P57r10q97J606K227J525J78q86
$$ plain form
450120 6344 6046 6465 7037 6832 5455 3456 1368 740 990 832 131 -672 -233 755 884 -538 -2186
450822 -2186 -4341 -4839 -2772 58 2276 4015 5440 5589 4301 3497 3060 2011 983 550 1619 1825
451483 1825 979 -261 -91 1997 3377 2326 586 -145 -508 -1217 -798 374 8 -970 -597 685 1329
452186 1329 672 -1109 -2541 -2320 -1587 -907 -141 -387 -1113 -1208 -2094 -2677 -2167 -863 707 1511 1819 673
452930 673 -1954 -3791 -3720 -3412 -3053 -1454 -192 311 1488 2756 2969 1598 1153 2024 1961 31 -862
453632 -862 -1818 -2659 -3380 -3976 -2928 -1058 -988 -2119 -3430 -3783 -2789 -1442 -1103 -361 1299 2557 1926
454335 1926 116 -1690 -2499 -1418 -97 731 1107 1153 1115 1149 1242 1571 1751 429 -966 -1153 -27 729
455079 729 1206 446 260 551 117 417 2201 4545 6680 8170 7985 6633 6648 7334 6559 4240 2941
$$ packed form
450120F344k98M19N72k05j377j999k088o28K50j58p01q03M39R88J29j422j648
450822b186k155m98K067K830K218J739J425J49j288q04m37j049j028m33J069K06
451483A825q46j240J70K088J380j051j740p31l63p09M19J172l66r78L73J282O44
452186A329o57j781j432K21P33O80P66k46p26r5q86n83N10J304J570Q04L08j146
452930F73k627j837P1L08L59J599J262N03J177J268K13j371m45Q71o3j930q93
453632h62r56q41p21n96J048J870P0j131j311l53R94J347L39P42J660J258o31
454335A926j810j806q09J081J321Q28L76M6l8L4R3L29J80j322j395j87J126P56
455079G29M77p60j86K91m34L00J784K344K135J490j85j352J5O86p75k319j299
$$ plain form
455781 2941 2601 3540 4562 4516 4409 4757 4323 3277 1778 161 -852 -1450 -1988 -1805 -996 -1739 -3288
456484 -3288 -3592 -3148 -1411 64 1885 3427 4197 4492 5104 6271 7109 7216 6476 4367 3066 3319 3485
457186 3485 3226 2507 1351 543 306 322 891 1573 2316 2270 1218 -558 -1608 -1057 -346 -128 679 1850
457930 1850 2845 3173 3703 3661 3733 3267 2320 1426 422 -379 -348 701 189 -755 -84 1535 3775 3611 1077
458715 1077 -1352 -2179 -2102 -2478 -2457 -1199 -38 56 -226 -499 -1046 -1168 -1188 -2097 -2808 -4520 -6680 -7076 -5393
459500 -5393 -3707 -3413 -5383 -6324 -5933 -5208 -4632 -4683 -5229 -6704 -7066 -4983 -3235 -3278 -2145 -480 17
460202 17 -631 -2508 -3490 -2984 -3202 -2445 -560 573 1794 2750 2260 2666 3863 4149 3654 3152 3080 2891
460946 2891 1146 -743 -1683 -1909 -3175 -5108 -5515 -4750 -3162 -2121 -2550 -2954 -2047 -1653 -2870 -5667
$$ packed form
455781B941l40R39J022m6j07L48m34j046j499j617j013n98n38J83Q09p43j549
456484c288l04M44J737J475J821J542P70K95O12J167Q38J07p40k109j301K53J66
457186C485k59p19j156q08k37J6N69O82P43m6j052j776j050N51P11K18Q07J171
457930A850R95L28N30m2P2m66r47q94j004q01L1J049n12r44O71J619K240j64k534
458715A077k429q27P7l76K1J258J161R4k82k73n47j22k0r09p11j712k160l96J683
459500e393J686K94j970r41L91P25N76n1n46j475l62K083J748m3J133J665M97
460202A7o48j877r82N06k18P57J885J133J221R56m90M06J197K86m95n02p2j89
460946B891j745j889r40k26j266j933m07P65J588J041m29m04R07L94j217k797
$$ plain form
461607 -5667 -7722 -7028 -4393 -3302 -4103 -3911 -3395 -2528 -419 1953 2565 2203 1678 1307 1781 2410 2548
462310 2548 2561 1842 2322 3594 5002 5134 3395 3506 4754 4043 3196 2266 2127 2595 2001 501 -997
463012 -997 -1459 -1162 19 1818 2190 1100 -44 587 1820 2035 2267 3215 4302 4939 4617 2652 1568
463715 1568 2229 2676 3509 4160 2522 828 213 602 -329 -1037 -401 495 148 -1855 -4033 -5187 -4606
464417 -4606 -3001 -899 1993 4402 4547 4113 4192 3032 3048 3800 3374 3211 4410 5023 4757 4755 5752 5274
465161 5274 4133 4133 4157 5119 6108 7151 7436 6269 4999 3215 1546 1331 2860 3833 3533 3525 4018 3932 3469
465946 3469 3154 3569 4026 2992 2020 1945 2581 1556 308 -150 -1684 -1547 641 1908 3038 2941 3240
466649 3240 4794 5577 5531 5255 4086 2194 1731 1603 1588 2457 3018 3447 3881 4236 3206 1880 -557 -2513
$$ packed form
461607e667k055O94K635J091q01J92N16Q67K109K372O12l62n25l71M74O29J38
462310B548J3p19M80J272J408J32j739J11J248p11q47r30j39M68n94j500j498
463012i97m62K97J181J799L72j090j144O31J233K15K32R48J087O37l22j965j084
463715A568O61M47Q33O51j638j694o15L89r31p08O36Q96l47k003k178j154N81
464417d606J605K102K892K409J45m34P9j160J6P52m26j63J199O13k66kR97m78
465161E274j141%K4R62R89J043K85j167j270j784j669k15J529R73l00qM93q6m63
465946C469l15M15M57j034r72p5O36j025j248m58j534J37K188J267J130r7K99
466649C240J554P83m6k76j169j892m63j28j5Q69N61M29M34L55j030j326k437j956
$$ plain form
467393 -2513 -2639 -1549 -968 455 1161 477 -10 -179 -675 -336 -334 -879 -510 1076 2602 2707 2230 1780
468136 1780 2014 2405 2761 1977 -446 -2132 -1235 -635 -854 -1272 -1041 -900 -1644 -2053 -1332 -1004 -455 495
468880 495 1552 1193 -125 792 1848 1071 -206 -145 542 1772 1790 -131 -2071 -2445 -1357 -225 -347
469582 -347 -519 170 793 1393 1519 545 -769 -504 190 42 786 1536 490 -317 -989 -2167 -2284 -1444
470326 -1444 -1349 -565 447 881 412 -743 -1610 -2195 -3624 -3913 -3695 -3519 -2893 -3038 -2836 -645 2251 4622
471070 4622 5117 4261 3369 2052 266 -681 -395 446 2180 3032 2108 314 -957 -885 -1164 -2443 -2114
471773 -2114 -161 522 1261 2245 3440 3867 3223 1888 1359 1825 2042 976 -646 -1273 -1736 -1806 -838 915
472516 915 1441 1327 1849 1836 1836 1743 1664 1802 2203 2235 2111 2541 2594 2627 2165 1050 488 1075 2890 4279 3422
$$ packed form
467393b513j26J090N81J423P06o84m87j69m96L39Kn45L69J586J526J05m77m50
468136A780K34L91L56p84k423j686Q97O00k19m18K31J41p44m09P21L28N49R50
468880D95J057l59j318R17J056p77j277O1O87J230J8j921j940l74J088J132j22
469582c47j72O89O23O00J26r74j314K65O94j48P44P50j046q07o72j178j17Q40
470326a444R5P84J012M34m69j155q67n85j429k89K18J76O26j45K02K191K896K371
471070D622M95q56q92j317j786r47K86Q41J734Q52r24j794j271P2k79j279L29
471773b114J953O83P39R84J195M27o44j335n29M66K17j066j622o27m63p0R68J753
472516I15N26j14N22j3%r3p9J38M01L2j24M30N3L3m62j115n62N87J815J389q57
$$ plain form
473384 3422 2272 1772 1133 1116 1536 2276 2574 1895 1355 614 -52 -292 -742 -698 301 1077 -17 -1806 -2201
474169 -2201 -540 1492 2763 2887 3129 4011 4531 4517 4185 2579 1161 2065 3250 3484 2524 1815 2488
474872 2488 4804 5540 3640 2213 2873 3700 1946 -132 -876 -533 295 -317 -1336 -621 1004 2599
475533 2599 4118 4253 2759 1651 2511 3213 1342 -771 -837 1092 3053 3012 1226 -433 -246 2061
476194 2061 4775 6136 7387 8681 8160 5700 3573 1534 94 30 -106 128 570 1179 1296 -157
476855 -157 -1098 -879 459 1394 647 212 -653 -2641 -2117 -34 223 -1032 -3707 -5858 -7855 -7583 -5985
477558 -5985 -3502 114 2560 3052 2345 1640 1007 -808 -3028 -2733 -1579 -333 568 51 -592 -457 1210
478260 1210 2176 2235 1700 -111 -2523 -4327 -4346 -3363 -2357 -1415 -574 138 1716 3181 3002 2099 1989 1203
$$ packed form
473384C422j150n00o39j7M20P40K98o79n40p41o66k40m50M4R99P76j094j789l95
474169b201J661K032J271J24K42Q82N20j4l32j606j418R04J185K34r60p09O73
474872B488K316P36j900j427O60Q27j754k078p44L43Q28o12j019P15J625J595
475533B599J519J35j494j108Q60P02j871k113o6J929J961m1j786j659J87K307
476194B061K714J361J251J294n21k460k127k039j440o4j36K34M42O09J17j453
476855a57r41K19J338R35p47m35q65j988N24K083K57j255k675k151j997K72J598
477558e985K483L616K446M92p07p05o33j815k220K95J154J246R01n17o43J35J667
478260A210R66N9n35j811k412j804j9R83J006R42Q41P12J578J465j79r03j10p86
$$ plain form
479004 1203 340 803 762 -272 -683 367 1881 3636 6222 8036 7397 4797 1773 -906 -2422 -3324
479665 -3324 -3404 -2198 -126 753 562 305 1661 2231 933 1579 4021 5161 5856 6516 6470 4667 1117
480367 1117 -1502 -1628 -747 588 1747 1660 -365 -2711 -4712 -5599 -4344 -2259 -621 1797 3528 2949
481029 2949 2538 4336 5658 5699 5422 4448 2617 595 -522 -680 -1013 -1589 -1495 -1016 335 2177 2396
481731 2396 1840 1015 -19 40 401 685 427 -1036 -2477 -2954 -1438 369 934 2172 3668 4003 3430
482434 3430 2292 893 -47 -92 690 1818 1993 1414 1973 3184 3789 3987 3326 3874 5224 4404 3362
483136 3362 2987 2020 1404 1219 503 7 -64 -670 -642 -1843 -4639 -5962 -4900 -2403 1082 5362 7175
483839 7175 6407 4755 924 -3262 -5394 -5063 -3326 -1714 -979 -890 -482 411 1116 1227 1293 2124 2464 1029
$$ packed form
479004A203q63M63m1j034m11J050J514J755K586J814o39k600l024k679j516r02
479665c324q0J206K072Q79j91k57J356N70j298O46K442J140O95O60m6j803l550
480367A117k619j26Q81J335J159q7k025k346k001q87J255K085J638K418J731n79
481029B949m11J798J322M1k77r74j831k022j117j58l33n76R4M79J351J842K19
481731B396n56q25j034N9L61K84k58j463j441m77J516J807N65J238J496L35n73
482434C430j138j399r40m5P82J128J75n79N59J211O05J98o61N48J350q20j042
483136C362l75r67o16j85p16m96p1o06K8j201k796j323J062K497L485M280J813
483839G175p68j652l831m186k132L31J737J612P35Q9M08Q93P05J11O6Q31L40j435
$$ plain form
484583 1029 -923 -2272 -2939 -2467 -1239 157 1102 756 -1514 -4498 -5584 -4913 -2420 -135 1804 3205
485244 3205 3136 2156 1382 539 -81 -546 -1029 -1499 -1925 -2683 -2308 -649 421 1741 2401 2499 2325 2635 3744
486029 3744 3135 2181 3488 4932 4498 3598 3300 3545 2957 3060 2719 2441 3129 4972 6199 6735 7027 6325
486773 6325 5270 4281 2743 1647 1128 1068 814 754 487 -1799 -4008 -3998 -3399 -2733 -1329 310 620 -1230
487517 -1230 -1314 1744 3560 3109 2261 1512 258 -848 -1762 -2479 -3387 -3579 -3061 -3259 -4571 -5511 -6576
488219 -6576 -6906 -6239 -5517 -4217 -2068 -535 -467 -743 -72 1730 2512 1095 -1459 -4902 -4442 -1363 622
488922 622 971 1145 1885 2038 2008 2781 2801 1823 1388 1119 2316 2585 887 -64 847 1721 1672 2064 2355 1897
489748 1897 -464 -1637 -551 1049 2687 3777 4929 5257 4993 6342 7884 6756 4300 3069 3043
$$ packed form
484583A029j952j349o67M72J228J396R45l46k270k984j086O71K493K285J939J401
485244C205o9r80p74q43o20m65m83m70m26p58L75J659J070J320O60R8j74L10J109
486029C744o09r54J307J444m34r00k98K45n88J03l41k78O88J843J227N36K92p02
486773F325j055r89j538j096n19o0k54o0k67k286k209J0N99O66J404J639L10j850
487517a230q4L058J816m51q48p49j254j106r14p17r08j92N18j98j312r40j065
488219f576l30O67P22J300K149J533O8k76O71J802P82j417k554l443M60L079J985
488922F22L49J74P40J53l0P73K0r78m35k69J197K69j698r51R11Q74m9L92K91m58
489748A897k361j173J086J600J638J090J152L28k64J349J542j128k456j231k6
$$ plain form
490368 3043 1829 1365 2104 2138 760 464 890 217 -1779 -3616 -4040 -3231 -2002 -1589 -1522 -1130 -1951 -3270
491111 -3270 -4070 -4127 -3638 -3504 -4713 -4250 -3774 -3453 -2025 -110 1534 2648 4025 4984 5859 5395 3329
491814 3329 1894 1288 1483 1054 153 -1091 -1864 -1269 -1474 -1055 -137 -272 -978 -1928 -3131 -3984 -2798 -91
492558 -91 1515 1705 2705 3764 4332 5922 7262 6682 5364 3892 2161 1953 3032 3538 2899 1746
493219 1746 1719 3170 5045 6342 6548 5700 5591 8271 11354 12753 14836 19286 25124 31963 39963 49917
493880 49917 63603 85903 127319 208535 347200 473148 448236 337971 247201 189129 150166
494335 150166 121466 99332 81595 69825 62468 54410 45520 38509 32056 26045 20819 17663 16628
494872 16628 15684 13550 9920 6646 5594 6146 6102 4574 3820 4392 4986 4190 3377 2360 2328 2133 2020
$$ packed form
490368C043j214m64P39L4j378k96M26o73j996j837m24Q09J229M13O7L92q21j319
491111c270q00n7M89J34j209M63M76L21J428J915J644J114J377R59Q75m64k066
491814C329j435o06J95m29r01j244p73N95k05M19R18j35p06r50j203q53J186K707
492558i1J606J90J000J059N68J590J340n80j318j472j731k08J079N06o39j153
493219A746k7J451J875J297K06q48j09K680L083J399K083M450N838O839Q000R954
493880D9917J3686K2300M1416Q1216J38665J25948k4912j10265r0770n8072l8963
494335A50166k8700k2134j7737j1770p357q058q890p011o453o011n226l156j035
494872A6628r44k134l630l274j052N52m4j528p54N72N94p96q13j017l2j95j13
$$ plain form
495574 2020 3057 4415 5904 6458 6162 5257 3960 1482 484 1808 4283 6784 8486 8421 7436 6181
496235 6181 4632 3390 2723 1679 506 1054 2092 1168 -283 -1564 -1033 701 563 233 927 1498
496897 1498 1742 1524 1262 1146 -190 -491 1471 3298 4126 3722 2422 1375 -740 -3585 -5392 -5954
497558 -5954 -7519 -8118 -6726 -3536 -373 1007 893 305 -1671 -2939 -2131 -828 -39 622 3160 5729
498219 5729 6125 5106 4144 4100 3521 2757 2841 2136 622 -151 -975 -1378 -329 1252 1415 1288 2361 3606
498963 3606 4464 4549 4462 3797 3090 3698 4168 3749 3733 4174 4652 4654 3762 2598 3371 4632 4329 4095 4326 5122
499789 5122 5876 4741 3464 2997 1579 222 543 740 -271 -1199 -760 -774 -2177 -3453 -4277 -4853 -6005
500491 -6005 -5871 -4181 -1288 428 895 101 -1771 -1992 286 2096 2882 3358 4522 3636 1799 556
$$ packed form
495574B020J037J358J489N54k96r05j297k478r98J324K475K501J702o5r85j255
496235F181j549j242o67j044j173N48J038r24j451j281N31J734j38l30O94N71
496897A498K44k18k62j16j336l01J962J827Q28m04j300j047k115k845j807n62
497558e954j565n99J392L190L163J380j14n88j976j268Q08J303P89O61K538K569
498219E729L96j019r62m4n79p64Q4p05j514p73q24m03J049J581J63j27J073J245
498963C606Q58Q5q7o65p07O08M70m19j6M41M78Kq92j164P73J261l03k34K31P96
499789E122P54j135j277m67j418j357L21J97j011r28M39j4j403j276q24n76j152
500491f005J34J690K893J716M67p94j872k21K278J810P86M76J164q86j837j243
$$ plain form
501153 556 1000 167 -853 -206 626 1260 2267 3064 3398 4070 4618 3862 2836 2369 2759 2786 695 -1703
501896 -1703 -2920 -1531 263 854 -656 -2136 -1578 -198 -89 -464 441 3186 5686 6186 5208 3408
502558 3408 3102 4549 5237 3255 782 -472 -730 -376 -639 -1202 -1323 -727 1298 3728 4775 3898 2519
503260 2519 1317 -230 -1049 1602 5548 5959 3917 2104 657 862 1103 -459 -3376 -4908 -4770 -4882
503921 -4882 -5156 -3058 -151 2103 2014 1235 -6 -1461 -2529 -4199 -5340 -4744 -2424 -783 1536 2428
504582 2428 2143 1529 659 411 892 1930 2333 1339 211 -502 -1899 -3678 -3772 -2132 -583 -546 -1518 -1282
505326 -1282 -34 677 266 -737 -1403 -1382 -1864 -1487 -618 -1025 -2415 -4231 -5166 -3248 -743 804 -61
506029 -61 -2287 -3567 -3789 -3642 -4251 -4355 -3323 -2112 -1095 -844 -1732 -2445 -2832 -3221 -2614 -886 39 -269
$$ packed form
501153E56M44q33j020O47Q32O34J007P97L34O72N48p56j026m67L90K7k091k398
501896a703j217J389J794N91j510j480N58J380J09l75R05K745K500N00r78j800
502558C408l06J447O88j982k473j254k58L54k63n63j21N96K025K430J047q77j379
503260B519j202j547q19K651L946M11k042j813j447K05K41j562k917j532J38j12
503921d882k74K098K907K254q9p79j241j455j068j670j141N96K320J641K319Q92
504582B428k85o14q70k48M81J038M03r94j128p13j397j779r4J640J549L7r72K36
505326a282J248P11m11j003o66K1m82L77Q69m07j390j816r35J918K505J547q65
506029f1k226j280k22J47o09j04J032J211J017K51q88p13l87l89O07J728R25l08
$$ plain form
506773 -269 -104 809 1827 2412 1948 1156 1947 3571 4608 4164 3476 3604 6196 8604 8471 6319 5621
507475 5621 5691 5080 3841 2718 1385 941 2140 1481 649 1298 1515 864 1106 1413 899 -916 -1845 -614
508219 -614 1844 4314 4867 3524 1853 494 258 1334 3511 5464 7205 8220 7091 5038 3328
508839 3328 2020 876 800 1441 1452 1343 473 269 1252 3624 5516 6375 6876 7176 8408 7868 4486 1072
509582 1072 -1039 -2535 -2029 -351 1292 3160 4949 5057 4026 2013 674 318 198 832 149 -263
510244 -263 913 1023 883 26 -35 818 1579 1620 1964 1523 -42 -2794 -4527 -3716 -1995 -496 484 1855
510987 1855 3215 2365 172 -557 152 841 1325 1922 2732 3795 4790 5771 5866 5398 4841 4928 4739 3725
511732 3725 1618 -837 -2447 -3073 -3024 -1590 -767 -1259 -1725 -1295 -1774 -1981 -1638 -2298 -3718 -3992 -4405 -4658
$$ packed form
506773b69J65R13J018N85m64p92P91J624J037m44o88J28K592K408j33k152o98
507475E621P0o11j239j123j333m44J199o59q32O49K17o51K42L07n14j815r29J231
508219f14K458K470N53j343j671j359k36J076K177J953J741J015j129k053j710
508839C328j308j144p6O41J1j09q70k04R83K372J892Q59N01L00J232n40l382l414
509582A072k111j496N06J678J643J868J789J08j031k013j339l56j20O34o83m12
510244b63J176J10j40q57o1Q53P61M1L44m41j565k752j733Q11J721J499R80J371
510987A855J360q50k193p29P09O89M84N97Q10J063R95R81R5m68n57Q7j89j014
511732C725k107k455j610o26M9J434Q23m92m66M30m79k07L43o60j420k74m13k53
$$ plain form
512475 -4658 -4725 -3415 -1215 748 1195 -365 -2099 -3089 -3917 -4007 -3087 -2078 -1399 -772 -857 -819 -302 -546
513219 -546 -424 783 1041 -501 -845 54 10 -904 -1415 -506 1478 3353 3809 3722 2644 450 -375 -147
513963 -147 -346 164 1196 2576 3250 3014 2501 3742 5116 4299 2731 662 -1415 -2620 -3054 -2501 -163
514665 -163 1141 -523 -1057 -273 525 715 605 481 16 914 4113 6001 4729 1669 74 949 2432
515367 2432 3004 2345 496 -1853 -3372 -4050 -4362 -4486 -3999 -3577 -3155 -3232 -4258 -5556 -4831 -3812 -4122
516070 -4122 -5261 -6697 -6559 -4200 -1790 -268 107 -548 -861 -724 -723 357 1067 770 -44 -266 -20 900
516814 900 1332 -275 -1560 -1490 -979 -1652 -3349 -3784 -1677 -80 276 1465 1393 -565 -3658 -5449 -4999
517516 -4999 -4392 -4409 -3927 -3014 -1698 -741 50 1093 761 114 -77 98 923 2505 3372 3094 2609 2192
$$ packed form
512475d658o7J310K200J963M47j560j734r90q28r0R20J009O79O27q5L8N17k44
513219e46J22J207K58j542l44Q99m4r14n11R09J984J875M56q7j078k194q25K28
513963a47j99N10J032J380O74k36n13J241J374q17j568k069k077j205m34N53K338
514665a63J304j664n34P84P98J90j10j24m65Q98L199J888j272l060j595Q75J483
515367B432N72o59j849k349j519o78l12j24M87M22M22p7j026j298P25J019l10
516070d122j139j436J38K359K410J522L75o55l13J37JJ080P10k97q14k22K46R20
516814I00M32j607j285P0N11o73j697m35K107J597L56J189p2j958l093j791M50
517516d999O07j7M82R13J316R57P91J043l32o47j91J75Q25J582Q67k78m85m17
$$ plain form
518260 2192 1676 950 -55 -528 -613 -552 82 99 -979 -2302 -2636 -2265 -2139 -2814 -2838 -1697 -2057 -3247 -3408
519045 -3408 -3211 -3064 -2931 -3560 -4435 -4548 -4419 -3797 -2908 -1966 -1779 -2156 -1822 -1565 -1908 -2149 -1019 669
519789 669 1050 -420 -3232 -5278 -5159 -4071 -2574 331 3317 4320 4195 3432 3372 4999 5306 6147 6699
520492 6699 6302 5919 4772 3904 3634 2926 3325 4491 4861 4138 2100 766 913 1710 2903 3816 3311
521194 3311 2896 3312 3957 3445 2860 3429 3858 3847 3352 2357 1631 1033 115 392 1551 2992 2646 523
521938 523 -1453 -1871 -387 783 1701 2214 2174 2799 3399 2105 962 265 -326 281 1192 1074 801 1461
522682 1461 1490 1921 2853 3404 3904 4522 4072 2804 2287 2859 2984 2066 2077 2466 2926 3511 3519 3396 3999 4976
523508 4976 6202 6733 6720 6058 5476 4483 3454 4158 4121 2025 -17 -1226 -2285 -1831 -318 1043 2581
$$ packed form
518260B192n16p26j005m73q5O1O34J7j078j323l34L71J26o75k4J141l60j190j61
519045c408J97J47J33o29q75j13J29O22Q89R42J87l77L34K57l43k41J130J688
519789F69L81j470k812k046J19J088J497K905K986J003j25p63o0J627L07Q41N52
520492F699l97l83j147q68k70p08L99J166L70p23k038j334J47P97J193R13n05
521194C311m15M16O45n12n85N69M29j1m95r95p26n98r18K77J159J441l46k123
521938E23j976m18J484J170R18N13m0O25O00j294j143o97n91O07R11j18k73O60
522682A461K9M31R32N51N00O18m50j268n17N72J25r18J1L89M60N85Qj23O03R77
523508D976J226N31j3o62n82r93j029P04l7k096k042j209j059M54J513J361J538
$$ plain form
524211 2581 4848 4828 2913 836 -617 -447 2324 2952 1391 -215 -2093 -3364 -2184 472 829 323
524872 323 -216 -1277 -1093 880 1828 1674 1308 1358 2520 3681 4011 4791 5042 3593 1925 1674 2303 2690
525616 2690 2627 2113 828 -529 -1003 -1192 -1271 -1447 -2161 -2559 -2566 -596 2327 3431 4165 6172 7758 7619
526360 7619 5623 3355 1394 -1 -614 -650 -823 -1498 -1522 -243 209 -545 -722 937 2421 2077 1785
527062 1785 2647 4287 4820 4600 4312 3284 1520 672 292 396 938 2625 4360 4580 3791 3691 3597 2934
527806 2934 1568 998 1765 3194 3304 713 -1684 -1506 -473 -1005 -276 1317 2087 1871 1635 3283 5294
528508 5294 6847 6996 6115 5904 5062 2878 506 -1753 -3138 -3785 -4258 -4051 -2623 -520 686 144
529169 144 -1154 -2424 -3780 -3833 -4469 -5268 -5143 -5686 -6497 -5144 -2739 -1995 -2740 -2383 -1113 444 1971
$$ packed form
524211B581K267k0j915k077j453J70K771O28j561j606j878j271J180K656L57n06
524872C23n39j061J84J973R48j54l66N0J162J161L30P80K51j449j668k51O29L87
525616B690o3n14j285j357m74j89p9j76p14l98pJ970K923J104P34K007J586j39
526360G619j996k268j961j395o13l6j73o75k4J279M52p54j77J659J484l44k92
527062A785Q62J640N33k20k88j028j764q48l80J04N42J687J735K20p89j00r4o63
527806B934j366n70P67J429J10k591k397J78J033n32P29J593P70k16k36J648K011
528508E294J553J49q81k11q42k184k372k259j385o47m73K07J428K103J206n42
529169A44j298j270j356n3o36p99J25n43q11J353K405P44p45L57J270J557J527
$$ plain form
529872 1971 3786 4339 3362 2462 1953 2506 4438 4630 2493 -370 -2184 -691 1566 2160 2430 3593
530533 3593 5112 6400 5792 4172 3194 1656 -462 -1748 -1260 -2229 -4088 -4283 -3361 -2588 -1606 -757 -1211
531235 -1211 -1239 -23 1740 2783 2502 2459 1864 -336 -1162 165 1357 943 -152 -204 -278 -293 -547 -1611
531979 -1611 -2754 -3153 -735 1385 1537 776 927 1174 1342 1684 1132 -998 -1742 -2414 -3137 -3050 -2875 -2185
532723 -2185 -540 820 1023 1174 1099 770 320 105 2174 4498 4773 4891 5887 5320 3415 1690 362
533426 362 632 693 595 701 712 -351 -1621 -1991 -1666 -1391 157 1770 1575 144 -385 -1436 -1625 46
534169 46 1338 1480 1273 311 -921 -877 360 508 767 1445 1252 1453 1743 457 -2587 -5819 -5957 -4219
534913 -4219 -2432 -1167 -65 -210 63 496 858 2065 1605 714 1467 3378 5600 6173 5289 4096 3255
$$ packed form
529872A971J815N53r77r00n09N53J932J92k137k863j814J493K257N94K70J163
530533C593J519J288o08j620r78j538k118j286M88r69j859j95R22P73R82Q49m54
531235a211k8J216J763J043k81m3n95k200q26J327J192m14j095n2p4j5k54j064
531979a611j143l99K418K120J52p61J51K47J68L42n52k130p44o72p23Q7J75O90
532723b185J645J360K03J51p5l29m50k15K069K324K75J18R96n67j905j725j328
533426C62K70O1r8J06J1j063j270l70L25K75J548J613j95j431n29j051j89J671
534169D6J292J42k07r62j232M4J237J48K59O78j93K01K90j286l044l232j38J738
534913d219J787J265J102j45K73M33L62J207m60q91P53J911K222N73q84j193q41
$$ plain form
535615 3255 3528 3641 2747 1200 89 -534 -954 -1279 -1672 -558 26 -668 -1228 -1098 -171 -700 -1373 -1088
536359 -1088 -381 89 1729 4864 7580 8150 7213 4868 1770 -720 -2375 -2678 -3560 -3534 -3198 -3578 -3492
537062 -3492 -3460 -2796 -1187 649 2668 3152 2523 1473 337 105 287 494 891 1164 274 -1492 -2480
537764 -2480 -2767 -3114 -2526 -1799 -568 818 1743 2327 1936 1291 2207 3257 4151 3426 2202 3433 5648
538467 5648 6922 7790 8040 8266 7516 7233 7968 7977 7792 7865 6782 4439 3209 2397 2083 2413 3135 3937 3275
539252 3275 2110 1996 1268 -307 -1333 -1325 -1419 -1294 -744 -986 -1713 -2550 -2439 -1991 -1224 -1340 -2092 -2929 -3570
540037 -3570 -3916 -3849 -3436 -3272 -3463 -3888 -4259 -4788 -4577 -3090 -1202 -352 1113 2681 3311 2423 1438 2803
540781 2803 4480 5078 4422 2572 1218 404 124 -693 -1284 -971 346 1216 2382 3931 3370 1254 -557
$$ packed form
535615C255K73J13q94j547j111o23m20l25l93J114N84o94n60J30R27n29o73K85
536359a088P07M70J640L135K716N70r37k345l098k490j655l03q82K6L36l80Q6
537062c492L2O64J609J836K019M84o29j050j136k32J82K07L97K73q90j766r88
537764b480k87l47N88P27J231J386R25N84l91o45R16J050Q94p25j224J231K215
538467E648J274Q68K50K26p50k83P35Rj85P3j083k343j230q12l14L30P22Q02o62
539252C275j165j14p28j575j026Qr4J25N50k42p27q37J11M48P67j16p52q37o41
540037c570l46O7M13J64j91m25l71n29K11J487J888Q50J465J568O30q88r85J365
540781B803J677N98o56j850j354q14k80q17n91L13J317Q70J166J549n61k116j811
$$ plain form
541484 -557 -558 1576 4316 5246 4362 2552 1986 2209 2765 2651 1242 177 -411 -1491 -2166 -2989 -4055 -4112
542227 -4112 -3167 -1730 -727 -524 -999 30 2318 3188 3209 1469 -885 -1829 -1766 -531 1785 3619 3939
542930 3939 3368 2521 2245 1941 659 -1134 -2521 -2153 -488 1166 690 -2292 -5217 -5922 -4510 -1965
543591 -1965 482 1187 626 1026 2240 3678 4388 4348 3668 2269 532 -650 -429 -181 -297 -1468 -2246
544293 -2246 -2350 -2733 -1461 -106 1086 3074 4773 5681 5736 4848 4035 3945 3723 2420 -477 -3654 -4098
544996 -4098 -3101 -3082 -3947 -2669 -246 161 -773 -1583 -3434 -5539 -6017 -4445 -2427 -233 1154 933 1249
545698 1249 2514 3382 3035 1298 85 -537 -1747 -2185 -1666 -2323 -3102 -2220 13 1096 1004 1165 1627
546401 1627 1977 1745 1683 2191 1158 -753 -364 1859 3524 4213 3632 2810 2394 3069 3901 2238 -75
$$ packed form
541484e57jK134K740R30q84j810n66K23N56j14j409j065n88j080o75q23j066n7
542227d112R45J437J003K03m75J029K288Q70K1j740k354r44O3J235K316J834L20
542930C939n71q47k76l04j282j793j387L68J665J654m76k982k925p05J412K545
543591a965K447P05n61M00J214J438P10m0o80j399j737j182K21K48j16j171p78
544293b246j04l83J272J355J192J988J699R08N5q88q13r0k22j303k897l177m44
544996d098R97J9q65J278K423M07r34q10j851k105m78J572K018K194J387k21L16
545698A249J265Q68l47j737j213o22j210m38N19o57p79Q82K233J083r2J61M62
546401A627L50k32o2N08j033j911L89K223J665O89n81q22m16O75Q32j663k313
$$ plain form
547103 -75 -1322 -2030 -1812 -1963 -2750 -2650 -2361 -2046 -2276 -3003 -3000 -2169 -1134 509 2295 4245 4889 3412
547847 3412 2397 1749 2054 1971 1640 1384 1877 2240 2177 1908 1377 -24 -1814 -3120 -2753 -518 2045 2556
548591 2556 920 -1373 -1457 -423 313 1431 2569 2816 1730 -318 -989 -301 1223 2533 2853 2743
549252 2743 3149 2376 1015 2647 5252 4836 4074 4108 3497 2507 2004 2683 2974 2660 1499 74 -228 184
549996 184 930 1121 271 -4 -89 -1783 -2774 -1928 -660 -25 -1017 -2241 -2237 -2273 -2849 -2114 585 2502 3436
550781 3436 4076 5022 6348 5868 3234 1161 630 1192 2666 4320 4503 3027 1335 1579 2240 2800 2652
551483 2652 2512 3898 4911 4665 4859 5215 4501 3187 2149 2734 4395 5414 5608 6051 5731 5130 4890
552186 4890 4989 4909 6363 7781 7244 5689 4277 3874 5563 7051 6732 5925 4586 2966 2951 2462 2020
$$ packed form
547103g5j247p08K18j51p87J00K89L15k30p27LQ31J035J643J786J950O44j477
547847C412j015o48L05q3l31k56M93L63o3k69n31j401j790j306L67K235K563N11
548591B556j636k293q4J034P36J118J138K47j086k048o71O88J524J310L20j10
549252B743M06p73j361J632K605m16p62L4o11r90n03O79K91l14j161j425l02M12
549996A84P46J91q50k75q5j694r91Q46J268O35r92j224Ml6n76P35K699J917R34
550781C436O40R46J326m80k634k073n31N62J474J654J83j476j692K44O61N60j48
551483B652j40J386J013k46J94L56p14j314j038N85J661J019J94M43l20o01k40
552186D890R9q0J454J418n37j555j412m03J689J488l19q07j339j620j5m89m42
$$ plain form
552888 2020 1000 -1757 -3588 -2774 -1741 -2536 -3385 -3321 -3327 -4271 -4749 -4414 -3997 -3413 -4768 -7669 -8742 -7049
553632 -7049 -3840 -1255 -935 -352 2432 6070 7055 5253 4162 4222 4242 4778 6112 6706 5871 3374 1446
554334 1446 1219 1206 870 761 1306 1867 1799 1573 1931 3255 4184 3009 379 -438 -1683 -3041 -3683 -4705
555078 -4705 -6710 -7179 -5490 -4079 -3597 -1575 682 1685 2048 2285 2256 2563 1524 -63 -231 102 -192
555781 -192 -923 -587 -9 126 58 1346 2187 2399 3161 3097 1209 -730 -1994 -2784 -2832 -3537 -4914 -4344 -2084
556566 -2084 533 2509 2723 2137 1543 1476 1410 922 -5 -268 -1135 -1251 973 2702 1684 -202 -528 -166
557310 -166 385 1044 1383 1540 2598 4762 6887 6818 5424 4119 3400 3405 3927 4713 5126 5447 5616 5010 4894
558095 4894 5585 6648 7867 6571 4968 5091 5057 5069 5666 6076 4897 3284 2373 331 -1384 -1299 -1075
$$ packed form
552888B020j020k757j831Q14J033p95q49O4or44m78L35M17N84j355k901j073J693
553632g049L209K585L20N83K784L638R85j802j091O0K0N36J334N94q35k497j928
554334A446k27j3l36j09N45N61o8k26L58J324R29j175k630q17j245j358o42j022
555078d705k005m69J689J411M82K022K257J003L63K37k9L07j039j587j68L33k94
555781a92p31L36N78J35o8J288Q41K12P62o4j888j939j264p90m8p05j377N70K260
556566b084K617J976K14n86n94o7o6m88r27k63q67j16K224J729j018j886l26L62
557310a66N51O59L39J57J058K164K125o9j394j305p19NN22P86M13L21J69o06j16
558095D894O91J063J219j296j603J23l4J2N97M10j179j613r11k042j715Q5K24
$$ plain form
558798 -1075 -1161 -902 -6 727 -686 -1531 -1096 -277 -605 -944 0 338 -587 -1973 -1903 -1173 -1169 -1746 -2007 -2248
559624 -2248 -1702 -826 -1404 -3184 -4869 -5619 -4567 -3921 -3696 -1892 -457 -255 -420 -21 -124 133 -1137
560326 -1137 -1827 -1526 -1271 -895 66 1611 4424 6038 6387 5416 4217 3490 2252 1917 995 -473 -731
561029 -731 -1040 -2069 -2400 -2473 -2270 -1082 1237 2755 3366 4449 5267 4676 4041 4920 6710 7124 5469
561731 5469 3901 1865 -745 -1872 -1680 578 2327 2814 3337 3397 3504 2318 -403 -1524 -22 1341
562392 1341 331 -2591 -4701 -4027 -2605 -1584 4 1447 2508 2179 1882 2151 3163 4680 5126 3488
563054 3488 1508 1829 2107 1812 2272 2361 1245 -551 -1812 -2575 -2900 -2661 -1590 -555 925 2203 2630
563756 2630 2682 3087 3935 4876 5030 3605 862 -1178 -1010 85 1667 3089 3586 3151 2750 2831 3351 2236
$$ packed form
558798a075q6K59Q96P33j413q45M35Q19l28l39R44L38r25j386P0P30Mn77k61k41
559624b248N46Q76n78j780j685p50J052O46K25J804J435K02j65L99j03K57j270
560326a137o90L01K55L76R61J545K813J614L49r71j199p27j238l35r22j468k58
561029g31l09j029l31p3K03J188K319J518O11J083Q18n91o35Q79J790M14j655
561731E469j568k036k610j127J92K258J749M87N23O0J07j186k721j121J502J363
562392A341j010k922k110O74J422J021J588J443J061l29k97K69J012J517M46j638
563054C488j980L21K78k95M60Q9j116j796j261p63l25K39J071J035J480J278M27
563756B630N2M05Q48R41J54j425k743k040J68J095J582J422M97m35m01Q1N20j115
$$ plain form
564500 2236 -541 -3079 -3922 -4672 -4221 -1359 1330 2006 1866 1948 2677 3913 4541 3087 1804 2332 3458
565202 3458 3536 2402 1654 1999 2004 900 102 -883 -2633 -2284 -1627 -1519 -1714 -869 -563 -1039 -2038 -2756 -3492
565987 -3492 -4194 -3978 -3081 -3833 -4797 -3759 -3240 -4564 -5377 -5030 -3555 -262 2741 3710 2812 1259 -1402
566690 -1402 -2513 -1708 -815 -892 -996 192 1577 2143 422 -1575 -1232 234 30 -544 456 1318 1607
567392 1607 1081 194 889 1875 1512 840 2464 4775 4960 3264 1696 1103 598 763 1233 2097 1825 1178
568136 1178 35 -854 -296 953 1646 447 -756 -765 -1503 -2519 -2687 -3057 -4795 -5748 -5276 -4716 -4645 -4889
568880 -4889 -5509 -5621 -5209 -5206 -4810 -4052 -2950 -1530 -1082 -1992 -2650 -3415 -3326 -2359 -1997 -2417 -3703 -3426 -915
569665 -915 497 977 465 -41 -1355 -3412 -5431 -7454 -7804 -5957 -3424 -1654 -923 209 1679 1368
$$ packed form
564500B236k777k538q43p50M51K862K689O76j40Q2P29J236O28j454j283N28J126
565202C458P8j134p48L45Nj104p98r85j750L49O57J08j95Q45L06m76r99p18p36
565987c492p02K16Q97p52r64J038N19j324q13L47J475L293L003R69q98j553k661
566690a402j111Q05Q93p7j04J188J385N66j721j997L43J466k04n74J000Q62K89
567392A607n26q87O95R86l63o72J624K311J85j696j568n93n05J65M70Q64k72o47
568136A178j143q89N58J249O93j199j203rp38j016j68l70j738r53M72N60P1k44
568880d889o20j12M12LL96P58J102J420M48r10o58p65Q9R67L62m20j286K77K511
569665i15J412M80n12n06j314k057k019k023l50J847K533J770P31J132J470l11
$$ plain form
570326 1368 -1032 -3440 -4298 -3688 -1650 1279 2642 975 9 795 799 608 1479 1269 280 -710 -1150 291
571070 291 2108 3562 4775 4545 2931 1501 2281 3862 4417 4205 3205 1409 -15 -227 -1302 -1245
571731 -1245 932 2537 2933 1753 -295 -640 -520 -1772 -3275 -3681 -3936 -4062 -3239 -2732 -1676 846
572393 846 1691 1135 558 815 773 -301 -1305 -3050 -4131 -4331 -4431 -3923 -2677 -2020 -1034 -113 -1015 -1850
573136 -1850 -1483 -560 858 1414 750 479 359 -218 -550 -833 -1499 -2169 -3794 -6177 -7403 -7095 -7148 -8110
573880 -8110 -8482 -7912 -7152 -6033 -6125 -7511 -7899 -7044 -4539 -1882 -1488 -3684 -4992 -5060 -5003 -5273 -5061 -4804
574624 -4804 -5499 -5250 -4929 -5320 -5064 -4760 -4644 -3001 -716 422 -1053 -2367 -1863 -188 1714 2091 1711
575326 1711 2238 2578 2764 2265 764 654 3045 3672 2304 749 -879 -2488 -3872 -4799 -4676 -3885 -2713
$$ packed form
570326A368k400k408q58O10K038K929J363j667r66P86Mj91Q71k10r89r90m40J441
571070B91J817J454J213k30j614j430P80J581N55k12j000j796j424k12j075N7
571731a245K177J605L96j180k048l45J20j252j503m06k55j26Q23N07J056K522
572393H46Q45n56n77K57m2j074j004j745j081k00j00N08J246O57R86R21r02q35
573136a850L67R23J418N56o64k71j20n77l32k83o66o70j625k383j226L08n3r62
573880h110l72N70P60J119r2j386l88Q55K505K657L94k196j308o8N7k70K12K57
574624d804o95K49L21l91K56L04J16J643K285J138j475j314N04J675J902L77l80
575326A711N27L40J86m99j501j10K391O27j368j555j628j609j384r27J23P91J172
$$ plain form
576029 -2713 -2758 -3074 -1672 704 3395 4853 5615 6476 6551 5843 5857 5960 6000 7165 8022 7025 6358 5354
576773 5354 2133 -1572 -2961 -2952 -3526 -4124 -3690 -2703 -1192 -128 226 746 825 1534 1229 61 -1119 -2360
577517 -2360 -4442 -5339 -4118 -3217 -2766 -1626 -835 -1358 -1200 -582 -234 -657 -961 -593 -328 -176 1068 1946
578260 1946 1016 -437 -461 695 2472 5053 6930 6512 4537 1863 662 213 -614 -1845 -3671 -4339
578922 -4339 -3569 -1887 -936 -1191 -1892 -2442 -1383 -139 372 122 -569 -335 -307 -705 -1596 -1737 -436 -1252
579665 -1252 -3214 -2823 -1069 402 877 1384 1915 1927 2563 3313 4194 4582 4064 1942 807 566 559 814
580409 814 1460 1653 1955 1470 496 -910 -351 2416 3557 3585 2577 1222 283 -471 -887 -1943 -3616
581111 -3616 -5433 -6484 -6475 -5164 -3934 -3011 -2179 -3055 -5291 -7730 -7287 -4713 -3108 -3001 -3381 -2848 -1360
$$ packed form
576029b713m5l16J402K376K691J458P62Q61P5p08J4J03M0J165Q57r97o67j004
576773E354l221l705j389Rn74n98M34R87J511J064L54N20P9P09l05j168j180j241
577517b360k082q97J221R01M51J140P91n23J58O18L48m23l04L68K65J52J244Q78
578260A946r30j453k4J156J777K581J877m18j975k674j201m49q27j231j826o68
578922d339P70J682R51k55p01n50J059J244N11k50o91K34K8l98q91j41J301q16
579665a252j962L91J754J471M75N07N31J2O36P50Q81L88n18k122j135k41pK55
580409H14O46J93L02m85r74j406N59K767J141K8j008j355r39p54m16j056j673
581111c616j817j051RJ311J230R23Q32q76k236k439M43K574J605J07l80N33J488
$$ plain form
581814 -1360 103 271 -782 -1404 -172 2270 2529 899 -181 -961 -1189 -1081 738 2391 1586 1010
582475 1010 1368 2340 2054 1036 -340 -2234 -3660 -2958 -1812 -16 594 -1813 -4699 -5908 -4684 -2990
583136 -2990 -1503 -1040 -1119 -1097 -1448 -2356 -3353 -4680 -5734 -5039 -2625 -524 -645 -1997 -3134 -3973 -4225
583839 -4225 -3316 -2584 -1909 -1677 -1425 -2756 -2956 43 2480 2725 1704 -335 -1345 -590 921 1715 1915
584541 1915 1736 597 640 1614 1898 2912 4899 5287 4243 3470 1605 96 -903 -1265 791 3351 5156
585243 5156 4597 4077 4486 5092 4412 2106 2116 3898 6411 9168 10066 7869 4566 2456 1332 1680 2786
585946 2786 3349 3325 2616 1541 1808 2601 3122 2235 48 -1910 -2155 -506 409 604 2372 3777 4625
586649 4625 4847 3691 2003 1351 1880 2837 2892 2005 361 -742 -665 -377 -397 -1660 -2434 -3788 -5119 -4386
$$ packed form
581814a360J463J68j053o22J232K442K59j630j080p80k28J08J819J653q05n76
582475A010L58R72k86j018j376j894j426P02J146J796O10k407k886j209J224J694
583136b990J487M63p9K2l51r08r97j327j054O95K414K101j21j352j137q39k52
583839d225R09P32O75K32K52j331k00K999K437K45j021k039j010P55J511P94K00
584541A915j79j139M3R74K84J014J987L88j044p73j865j509r99l62K056K560J805
585243E156n59n20M09O06o80k306J0J782K513K757Q98k197l303k110j124L48J106
585946B786N63k4p09j075K67P93N21q87k187j958k45J649R15J95J768J405Q48
586649D625K22j156j688o52N29R57N5q87j644j103P7K88k0j263p74j354j331P33
$$ plain form
587392 -4386 -2782 -1576 781 2556 1921 776 384 -330 -564 -223 -578 -1467 -3039 -4945 -6467 -7147
588053 -7147 -5419 -2212 608 1308 1193 2691 4615 5065 4357 2921 1857 1629 -161 -2608 -3241 -2817
588715 -2817 -2738 -2068 -1462 360 3111 3065 151 -1642 -1550 -942 -827 -1374 -1722 -712 84 -174 -453 -229
589459 -229 -83 -217 -152 313 1659 3399 4022 4217 4354 2806 260 -1560 -1747 -986 847 1037 559 335
590202 335 -643 -1725 -1599 -539 1009 2457 3054 2098 1817 2358 1912 1212 1408 1452 1225 1088 740 -64
590946 -64 -533 -26 1431 208 -3342 -5840 -6050 -5375 -4473 -3455 -598 2705 3430 1735 992 1951 1538
591649 1538 418 -399 -1420 -1326 -451 596 733 -330 -1829 -1827 -864 355 482 319 186 -401 -2021 -2809
592393 -2809 -2200 -2109 -1684 -143 2073 4049 4569 4190 2689 2469 3428 4994 5551 4400 2195 -94 -1199
$$ packed form
587392d386J604J206K357J775o35j145l92p14k34L41l55q89j572j906j522o80
588053g147J728L207K820P00j15J498J924M50p08j436j064k28j790k447o33M24
588715b817P9O70O06J822K751m6k914j793R2O08J15n47l48J010P96k58k79K24
589459b29J46j34O5M65J346J740O23J95J37j548k546j820j87P61J833J90m78k24
590202C35r78j082J26J060J548J448N97r56k81N41m46p00J96M4k27j37l48q04
590946f4m69N07J457j223l550k498k10O75R02J018K857L303P25j695p43R59m13
591649A538j120q17j021R4Q75J047J37j063j499KR63J219J27j63j33n87j620p88
592393b809O09R1M25J541K216J976N20l79j501k20R59J566N57j151k205k289j105
$$ plain form
593095 -1199 -1673 -1120 139 625 939 1696 1559 881 1626 2009 1753 1084 -1313 -3659 -4190 -4023 -3883 -3956
593839 -3956 -3519 -1373 922 1184 546 1198 1986 1500 -315 -2659 -2949 -1834 -2328 -2537 -1901 -1592 -2520
594541 -2520 -4042 -3407 -2754 -2361 -1642 -1875 -1835 -1712 -1694 -1143 -724 -902 -1283 -1418 -1651 -2337 -1969 -98 775
595326 775 526 909 1684 2442 3615 4058 3010 1042 -71 630 3039 3670 2054 -487 -2298 -2151 -174
596029 -174 1514 2659 2564 1041 -319 -1299 -1546 113 1582 1648 1857 2254 2135 2100 1304 2604 3758 4236
596773 4236 5263 4581 3056 2069 1308 958 631 816 1761 3389 4885 4596 3944 2215 -1058 -3514 -3425
597475 -3425 -2911 -1866 -1004 -1327 -2710 -2821 -1134 -333 107 1367 1853 -306 -1905 -1890 -1394 357 1848
598178 1848 2322 1508 1736 3246 2794 1659 924 815 1414 3021 3941 3089 601 -631 191 1724 811
$$ packed form
593095a199m74N53J259M86L14P57j37o78P45L83k56o69k397k346n31J67J40p3
593839c956M37K146K295K62o38O52P88m86j815k344k90J115m94k09O36L09r28
594541b520j522O35O53L93P19k33M0J23J8N51M19j78l81j35k33o86L68J871Q73
595326G75k49L83P75P58J173M43j048j968j113P01K409O31j616k541j811J47J977
596029a74J688J145r5j523j360r80k47J659J469O6K09L97j19l5p96J300J154M78
596773D236J027o82j525r87p61l50l27J85R45J628J496k89o52j729l273k456Q9
597475c425N14J045Q62l23j383j11J687Q01M40J260M86k159j599J5M96J751J491
598178A848M74q14K28J510m52j135p35j09N99J607R20q52k488j232Q22J533r13
$$ plain form
598880 811 -1674 -3277 -3886 -3473 -1738 625 2192 2173 1551 2637 3680 4223 4472 4539 4335 4036 3181 2515
599624 2515 1624 860 275 21 -321 -802 -1045 -1098 -265 1967 3652 2870 1493 1600 2049 3246 4335 3030
600368 3030 1433 1624 1351 692 137 -573 -493 151 -510 -2413 -3513 -2640 -643 16 363 1880 4531
601070 4531 7250 7649 6861 5006 3193 2635 2912 2741 2554 2836 1208 614 -2 -2108 -3968 -5455 -5845
601773 -5845 -5785 -4875 -3380 -1824 -537 1099 1626 1406 561 73 527 720 164 599 1152 1326 2087 1327
602516 1327 -860 -1592 -1595 -1973 -1276 701 1647 1378 1611 2387 2571 1218 -440 -846 218 1411 1669 292
603260 292 -1320 -2528 -2745 -2523 -2655 -4028 -4871 -4766 -4628 -2941 -883 -1275 -3460 -5803 -7047 -4721
603921 -4721 -1450 -800 -1602 -1983 -2421 -3419 -3239 -2121 -2004 -2553 -2759 -2092 -2326 -3301 -3937 -3750 -2702 -348
$$ packed form
598880H11k485j603o09M13J735K363J567j9o22J086J043N43K49O7k04k99q55o66
599624B515q91p64n85k54l42m81k43n3Q33K232J685p82j377J07M49J197J089j305
600368C030j597J91k73o59n55p10Q0O44o61j903j100Q73J997O59L47J517K651
601070D531K719L99p88j855j813n58K77j71j87K82j628n94o16k106j860j487l90
601773e845O0R10J495J556J287J636N27k20q45m88M54J93n56M35N53J74P61p60
602516A327k187p32ll78O97J977R46k69K33P76J84j353j658m06J064J193K58j377
603260B92j612j208k17K22j32j373q43J05J38J687K058l92k185k343j244K326
603921d721L271O50q02l81m38r98J80J118J17n49k06O67k34r75o36J87J048K354
$$ plain form
604665 -348 510 -1159 -1916 -1948 -1512 -862 -1919 -1977 -1027 -1120 -1305 -1914 -3579 -2850 -7 2508 2594 2089 2364
605450 2364 1810 601 -72 127 1197 574 -1422 -3207 -4443 -3759 -3282 -3386 -2758 -2044 -1600 -948 466
606153 466 1645 2736 4363 5412 6169 5824 4087 1459 -1278 -1910 -2579 -3855 -4011 -3602 -2981 -1858
606814 -1858 -1118 -311 1463 1920 515 -954 -1597 -2468 -2731 -3047 -2607 -1879 -1831 -1027 1971 4421 3942 2325
607558 2325 1575 1798 1604 2943 3635 2349 694 337 1513 3254 4201 3433 3005 3578 4244 3812 2010
608260 2010 -156 -1632 -3130 -3695 -2751 -1306 -481 -841 328 2223 2098 -312 -2469 -3694 -4389 -4829
608921 -4829 -4572 -4122 -4381 -4385 -3748 -2395 -499 1861 3419 3668 2041 -367 -1624 12 1630 2758
609583 2758 3218 3524 3406 2468 1577 82 -1942 -3263 -2322 -331 -56 -1437 -4225 -6074 -5697 -4957 -4786
$$ packed form
604665c48Q58j669p57l2M36O50j057n8R50r3j85o09j665P29K843K515Q6n05K75
605450B364n54j209o73J99J070o23j996j785j236O84M77j04O28P14M44O52J414
606153D66J179J091J627J049P57l45j737k628k737o32o69j276j56M09O21J123
606814a858P40Q07J774M57j405j469o43q71k63l16M40P28M8Q04K998K450m79j617
607558B325p50K23j94J339O92j286j655l57J176J741R47p68m28N73O66m32j802
608260B010k166j476j498n65R44J445Q25l60J169J895j25k410k157j225o95m40
608921d829K57M50k59mO37J353J896K360J558K49j627k408j257J636J618J128
609583B758M60L06j18r38q91j495k024j321R41J991K75j381k788j849L77P40J71
$$ plain form
610285 -4786 -4812 -4944 -4748 -5402 -5308 -3969 -1843 4 2020 3604 1625 -1675 -3858 -4835 -4769 -3382 -2194
610988 -2194 -3314 -5461 -7369 -7260 -5484 -3301 -1593 -1700 -1780 -1439 -3288 -6258 -7111 -6683 -6827 -6179 -3993
611690 -3993 -3421 -3629 -2966 -2458 -2057 -395 1568 698 -1689 -2570 -2368 -1033 346 1305 1623 1780 2416
612393 2416 2985 2279 730 420 88 -1149 -2554 -3178 -2441 -57 1604 2021 2560 1584 -419 -1598 -1320
613095 -1320 -2173 -3651 -3047 -1566 -1140 -1650 -2198 -3288 -4052 -3454 -2639 -2163 -1889 -3030 -3918 -3941 -870 3154
613839 3154 3762 1525 -1377 -2218 -1152 -492 -1332 -2216 -3146 -3965 -4021 -2309 -952 -803 -960 -1781 -3285
614541 -3285 -5092 -5422 -4340 -3931 -4980 -5332 -4561 -4550 -5343 -5450 -4910 -3293 -797 578 1671 2724 2517
615244 2517 1852 1531 649 -1409 -3346 -2837 -1809 -2635 -4303 -4367 -2331 -1179 -1054 -910 -45 822 717
$$ packed form
610285d786k6j32J96o54R4J339K126J847K016J584j979l300k183r77O6J387J188
610988b194j120k147j908J09J776K183J708j07q0L41j849k970q53M28j44O48K186
611690c993N72k08O63N08M01J662J963q70k387q81K02J335J379R59L18J57O36
612393B416N69p06j549l10l32j237j405o24P37K384J661M17N39r76k003j179K78
613095a320q53j478O04J481M26n10n48j090p64N98Q15M76K74j141q88k3L071M024
613839C154O08k237k902q41J066O60q40q84r30q19n6J712J357J49j57q21j504
614541c285j807l30J082M09j049l52P71J1p93j07N40J617K496J375J093J053k07
615244B517o65l21q82k058j937N09J028q26j668o4K036J152J25J44Q65Q67j05
$$ plain form
615946 717 167 -155 146 -396 -1447 -1678 -381 -913 -2672 -3942 -4979 -4709 -3489 -3230 -3322 -3664 -3691 -2666
616690 -2666 -249 583 786 1280 2501 3047 2300 968 -89 -1322 -2695 -3651 -5331 -6993 -6351 -4023
617351 -4023 -2542 -1554 713 3563 4806 4874 2220 -1389 -4007 -4542 -4855 -4465 -2054 96 1069 268
618012 268 -1257 -2628 -3862 -5540 -5887 -4647 -5263 -7101 -6475 -4485 -3999 -5944 -9200 -10092 -8743 -5518
618673 -5518 -2744 -3272 -4742 -5265 -5786 -5678 -5701 -5745 -5520 -5034 -5173 -4996 -4313 -3071 -808 452 1434 2521
619417 2521 2075 -67 -1968 -3283 -4101 -4901 -3529 -480 2599 3904 3498 3028 2338 1674 2223 2685 1825
620120 1825 776 505 21 -1040 -860 331 -135 -1834 -2326 -2020 -1728 -1391 -2299 -2980 -3971 -5383 -5754
620822 -5754 -4983 -3376 -1932 -1096 -366 916 1331 876 421 -88 -328 -381 23 170 417 1124 84 -372
$$ packed form
615946G17n50l22L01n42j051k31J297n32j759j270j037K70J220K59r2l42k7J025
616690b666K417Q32K03M94J221N46p47j332j057j233j373r56j680j662O42K328
617351d023J481R88K267K850J243O8k654l609k618n35l13L90K411K150R73q01
618012B68j525j371j234j678l47J240o16j838O26J990M86j945l256q92J349L225
618673e518K774n28j470n23n21J08k3m4K25M86j39J77O83J242K263J260R82J087
619417B521m46k142j901j315q18q00J372L049L079J305m06m70o90o64N49M62q60
620120A825j049k71m84j061J80J191m66j699m92L06K92L37r08o81r91j412l71
620822e754P71J607J444Q36P30J282M15m55m55n09k40n3M04J47K47P07j040m56
$$ plain form
621566 -372 743 1113 -194 -1354 -1977 -1046 992 1273 -89 1201 3546 3928 4159 4821 3653 704
622227 704 -1366 -2051 -1826 -422 252 -1154 -4189 -5577 -5427 -4460 -2434 -1623 -2035 -1771 -699 -595 -913
622929 -913 -403 -600 -1251 -2004 -2621 -3346 -4076 -2970 -1305 406 1835 1680 2317 3336 2495 745 225
623632 225 465 -1048 -3207 -3659 -2914 -1981 -2199 -3058 -4809 -4999 -2853 -2084 -2311 -2711 -2813 -2420 -1765 -352
624376 -352 1621 2492 1268 158 162 -121 -793 -1184 -1973 -2793 -2593 -2647 -3356 -3174 -2718 -1851 -550 -1062 -1775
625161 -1775 -393 236 -1352 -4023 -5421 -4495 -3981 -4772 -5300 -4761 -2785 -1468 -1429 -1069 -1202 -866 -1378
625864 -1378 -4341 -7726 -8130 -6308 -4052 -1436 485 102 -1689 -3056 -2479 -1312 -1145 -1293 -403 -121
626525 -121 -1413 -2460 -2297 -2347 -3501 -4882 -4301 -1860 323 1026 530 -214 156 508 -50 -1030 -3073
$$ packed form
621566c72J115L70j307j160o23R31K038K81j362J290K345L82K31O62j168k949
622227G04k070o85K25J404O74j406l035j388J50R67K026Q11m12K64J072J04l18
622929i13N10j97o51p53o17p25p30J106J665J711J429j55O37J019q41j750n20
623632B25K40j513k159m52P45R33k18q59j751j90K146P69k27m00j02L93O55J413
624376c52J973Q71j224j110Mk83o72l91p89q20K00n4p09J82M56Q67J301n12p13
625161a775J382O29j588k671j398R26N14p91n28N39J976J317L9L60j33L36n12
625864a378k963l385m04J822K256K616J921l83j791j367N77J167J67j48Q90K82
626525a21j292j047J63n0j154j381N81K441K183P03m96p44L70L52n58r80k043
$$ plain form
627227 -3073 -4307 -4951 -6271 -7394 -7501 -7237 -7567 -8464 -8991 -8610 -7014 -5977 -6246 -6667 -7428 -7651 -5845
627930 -5845 -3414 -1762 -2230 -3766 -4557 -4568 -4465 -5060 -6157 -5399 -3119 -1442 -1269 -1741 -2188 -2334 -85
628632 -85 2661 3013 2051 52 -1469 -1322 -1798 -2915 -2803 -2157 -1969 -1212 -306 -1252 -2625 -4337 -6266
629334 -6266 -6795 -6641 -6221 -5495 -4960 -3495 -2291 -2023 -2352 -1589 611 1709 861 -210 -6 1352 1559
630037 1559 2 -1657 -1586 -289 44 -834 -528 143 139 432 1226 1967 2904 3634 3620 3626 3515 2259 770
630822 770 46 376 841 510 371 -737 -3824 -6636 -7762 -6673 -5108 -5776 -5661 -4608 -3571 -3006 -3291
631525 -3291 -4314 -2354 -373 -756 -693 -1676 -4114 -5283 -3414 -514 115 -781 -624 1583 3651 4143
632186 4143 2985 2382 1716 263 -963 -947 317 66 -2525 -4620 -4304 -3833 -4011 -3792 -3060 -2127 -614
$$ packed form
627227c073j234o44j320j123j07K64l30q97n27L81J596J037k69m21p61k23J806
627930e845K431J652m68j536p91j1J03n95j097P58K280J677J73m72m47j46K249
628632h5K746L52r62j999j521J47m76j117J12O46J88P57R06r46j373j712j929
629334f266n29J54M20P26N35J465J204K68l29P63K200J098q48j071K04J358K07
630037A559j557j659P1J297L33q78L06O71mK93P94P41R37P30j4Oj11j256j489
630822G70p24L30M65l31j39j108l087k812j126J089J565o68J15J053J037N65k85
631525c291j023J960J981l83O3r83k438j169J869K900O29q96J57K207K068M92
632186D143j158o03o66j453j226J6J264k51k591k095L16M71j78K19P32R33J513
$$ plain form
632888 -614 524 1780 1770 1049 1498 1866 382 -1073 -943 -977 -1891 -990 1736 2198 803 196 1427 1421
633632 1421 1006 2279 4779 6193 5976 6968 6623 4970 3086 2251 2500 3876 4544 4314 4153 4023 2571
634335 2571 497 -1572 -3190 -4690 -5575 -5087 -4814 -5120 -5211 -4198 -1362 1792 3397 3820 2475 827
634996 827 -498 -2526 -4395 -5760 -6801 -7195 -7129 -7704 -8984 -8490 -6440 -4427 -3170 -3185 -3865 -3835 -3980
635698 -3980 -4410 -4792 -4997 -4611 -3718 -1284 597 -476 -2522 -3582 -3443 -2139 -542 1617 2832 2611
636360 2611 1725 1242 1106 2176 2401 884 -254 -563 -622 1281 3258 2142 -1521 -4090 -4674 -5293 -5329
637062 -5329 -4910 -4168 -3699 -4318 -4341 -3839 -4130 -5077 -5383 -5205 -5511 -5577 -4080 -1628 -309 -1319 -4286 -5204
637806 -5204 -4655 -3776 -3205 -2874 -1660 -2026 -3226 -3941 -4202 -4993 -4984 -4791 -6672 -8032 -8306 -8472 -8592 -8221
$$ packed form
632888f14J138J256j0p21M49L68j484j455J30l4r14R01K726M62j395o07J231o
633632A421m15J273K500J414k17R92l45j653j884q35K49J376O68k30j61j30j452
634335B571k074k069j618j500q85M88K73l06r1J013K836L154J605M23j345j648
634996H27j325k028j869j365j041l94O6n75j280M94K050K013J257j5o80L0j45
635698c980m30l82k05L86Q93K434J881j073k046j060J39J304J597K159J215k21
636360B611q86m83j36J070K25j517j138l09n9J903J977j116l663k569n84o19l6
637062e329M19P42M69o19k3N02k91r47l06J78l06o6J497K452J319j010k967r18
637806e204N49Q79N71L31J214l66j200p15k61p91RJ93j881j360k74j66j20L71
$$ plain form
638549 -8221 -6817 -4838 -4359 -4391 -3949 -3709 -3687 -3839 -3946 -4357 -5622 -6984 -6785 -4267 -2012 -1672 -1995 -1131
639293 -1131 297 -274 -1480 -1597 -722 444 1280 1651 2075 1875 900 524 1076 1097 -1032 -2208 -1214 -1333
640037 -1333 -3078 -3797 -3112 -3033 -3571 -4417 -5850 -7051 -7066 -5075 -2954 -2829 -3187 -3056 -2799 -2028 -1517 -2520
640781 -2520 -3690 -5704 -7630 -8621 -8087 -5600 -4260 -3877 -3375 -4046 -5633 -6221 -5964 -5372 -5081 -4165 -2553
641483 -2553 -2451 -3738 -4741 -4628 -3386 -312 1940 2241 1504 1067 1263 1333 493 -24 -1037 -1525 -615
642186 -615 -175 -1058 -1264 -1080 -1528 -2154 -3066 -3723 -3341 -2968 -2623 -3229 -3196 -2543 -2088 -2634 -3231 -3449 -3341 -3268
643012 -3268 -2910 -3609 -5617 -6345 -5543 -4303 -3433 -4001 -5705 -7308 -8476 -8338 -7520 -5712 -2694 -112
643673 -112 633 -1243 -3470 -3923 -2745 -2464 -3589 -4043 -3886 -4091 -4441 -4100 -3246 -4585 -6420 -7671 -6811
$$ packed form
638549h221J404J979M79l2M42K40K2j52j07m11j265j362J99K518K255L40l23Q64
639293a131J428n71j206j17Q75J166Q36L71M24k00r75l76N52K1k129j176R94j19
640037a333j745p19O85P9n38q46j433j201j5J991K121J25l58J31K57P71N11j003
640781b520j170k014j926r91N34K487J340L83N02o71j587n88K57N92K91R16J612
641483b553J02j287j003J13J242L074K252L01p37m37J96P0q40n17j013m88R10
642186f15M40q83k06J84m48o26r12o57L82L73L45o06L3O53M55n46n97k18J08P3
643012c268L58o99k008p28Q02J240Q70n68j704j603j168J38Q18J808L018K582
643673a12P45j876k227m53J178K81j125m54J57k05l50L41Q54j339j835j251Q60
$$ plain form
644376 -6811 -5575 -5831 -6938 -8474 -8269 -7554 -7736 -5980 -4537 -5286 -5717 -5420 -6302 -7898 -7989 -5848 -3387
645078 -3387 -1407 -252 -1791 -3724 -6002 -8696 -10219 -9638 -7326 -5304 -5053 -5201 -4506 -2368 -110
645698 -110 -864 -3522 -5932 -7092 -8205 -8388 -7777 -8344 -9132 -7939 -5372 -4907 -6074 -6856 -7584 -8154 -7530
646401 -7530 -6875 -5627 -3009 -518 1811 2000 -1619 -5271 -6894 -5490 -2849 -3044 -5156 -6391 -5352
647020 -5352 -4051 -3572 -4008 -5570 -5680 -4932 -4700 -5167 -5737 -5876 -6207 -5759 -4645 -5375 -7162 -8567 -9566
647723 -9566 -10563 -11343 -10806 -9137 -8354 -8446 -7928 -7832 -7965 -7667 -8371 -10014 -10911 -11352 -12054 -13690 -13841 -12811
648467 -12811 -10215 -5544 976 8696 17820 29424 44057 65032 102204 173938 316849 585559
648963 585559 927847 964684 745857 560677 433939 344517 280678 233409 197768 169868
$$ packed form
644376f811J236k56j107j536K05P15j82J756J443p49m31K97q82j596r1K141K461
645078c387J980J155j539j933k278k694j523N81K312K022K51j48O95K138K258
645698a10p54k658k410j160j113j83O11n67p88J193K567M65j167p82p28n70O24
646401g530O55J248K618K491K329J89l619l652j623J404K641j95k112j235J039
647020e352J301M79m36j562j10P48K32m67n70j39l31M48J114p30j787j405r99
647723i566r97p80N37J669P83r2N18R6j33K98p04j643q97m41p02j636j51J030
648467a2811K596M671O520P720R124J1604J4633K0975L7172P1734J42911K68710
648963E85559L42288L6837k18827j85180j26738q9422o3839m7269l5641k7900
$$ plain form
649376 169868 149296 132675 117174 103934 92384 80659 69294 60484 52562 45880 41119 37796
649872 37796 33999 28651 23326 19760 20731 24031 25237 23924 21429 20545 20883 21739 20956 17799 15154
650492 15154 13995 13364 13333 12107 9746 9256 11564 12988 12975 12432 11706 10906 8990 7888 7445 7001 6974
651194 6974 6927 5221 2961 2500 2717 3061 3909 4496 3772 1984 718 79 -173 341 1043 1761 2292 4456
651938 4456 7477 8921 7711 6034 6017 6563 5671 2843 600 -66 -510 -1581 -3262 -3979 -3841 -3155 -2002
652641 -2002 106 2254 3360 2836 1557 205 -904 -907 -1359 -3827 -6360 -6375 -5032 -4344 -4426 -4452 -3024
653343 -3024 -1113 -411 620 1940 2419 1816 903 351 -326 -922 -717 -404 -757 -1380 -1877 -2357 -2248 -1404
654087 -1404 267 1178 1707 1416 -260 -2080 -3927 -6019 -7507 -6175 -2573 -6 84 -1955 -3115 -2938
$$ packed form
649376A69868k0572j6621j5501j3240j1550j1725j1365q810p922o682m761l323
649872C7796l797n348n325l566R71L300J206j313k495q84L38Q56p83l157k645
650492A5154j159o31l1j226k361m90K308J424j3n43p26q00j916j102m43m44k7
651194F974m7j706k260m61K17L44Q48N87p24j788j266o39k52N14P02P18N31K164
651938D456L021J444j210j677j7N46q92k828k243o66m44j071j681p17J38O86J153
652641b002K108K148J106n24j279j352j109lm52k468k533j5J343O88q2k6J428
653343c024J911P02J031J320M79o03r13n52o77n96K05L13l53o23m97m80J09Q44
654087a404J671R11N29k91j676j820j847k092j488J332L602K567R0k039j160J77
$$ plain form
654748 -2938 -2974 -2982 -1704 -722 -98 561 1228 839 134 193 665 -45 -300 -551 -1989 -3198 -2722 274 3675
655533 3675 6029 6050 3845 1068 -1641 -3975 -4691 -4410 -4366 -4604 -5141 -5709 -6140 -5818 -5347 -6629 -8514
656235 -8514 -10480 -12367 -13780 -13390 -12129 -11742 -11362 -10862 -9139 -7689 -6702 -5558 -3289 1188 9782 22111
656897 22111 37661 62778 110920 205675 399092 730126 984207 924674 751821 617517
657310 617517 500364 401341 325202 268596 227157 195491 171079 152346 135838 120955 107294
657764 107294 93821 82949 75258 68898 63888 59104 56279 56850 59859 66909 84117 109189 115513
658302 115513 98974 80124 65110 54329 48962 46174 42986 39967 38187 36908 35878 34097 29065
658839 29065 24004 21182 20388 20611 20807 20629 20465 20914 20787 20903 21736 22607 23156 22955 22085 20984 20059 17223
$$ packed form
654748b938l6qJ278R82O24O59O67l89p05N9M72p10k55k51j438j209M76K996L401
655533C675K354K1k205k777k709k334p16K81M4k38n37n68m31L22M71j282j885
656235h514j966j887j413L90J261L87L80N00J723J450R87J144K269M477Q594J2329
656897B2111J5550K5117M8142R4755J93417L31034K54081n9533j72853j34304
657310F17517j17153r9023p6139n6606m1439l1666k4412j8733j6508j4883j3661
657764A07294j3473j0872p691o360n010m784k825N71L009P050J7208K5072O324
658302A15513j6539j8850j5014j0781n367k788l188l019j780j279j030j781n032
658839B9065n061k822p94K23J96j78j64M49j27J16Q33Q71N49k01q70j101r25k836
$$ plain form
659583 17223 13602 11900 11774 11697 12448 12703 11352 8909 8353 9943 11362 12957 14334 14258 13157 11475
660244 11475 9552 7536 7036 8090 9017 10587 11584 11095 9048 7119 5927 5383 5733 6402 6605 6837
660905 6837 7845 9559 10455 10019 9522 9840 10159 10268 9864 9473 8144 6313 6035 5859 6136 6435 6573 6188
661649 6188 6039 6833 6982 6229 6080 6087 5248 3693 3468 4530 3929 2387 1982 2209 3301 4417 5686 6110
662393 6110 7191 8187 8103 6861 5798 4619 3813 3354 3375 4431 5634 4174 663 -2242 -2617 -567
663053 -567 958 -509 -1535 -1094 -251 939 2012 2572 3007 4930 6067 5612 5079 6345 9195 11159
663715 11159 10993 9294 8552 9058 9109 9224 9322 9043 8021 6443 5538 4731 3588 2295 635 -445 -96
664417 -96 1391 2005 3167 4711 5747 6697 7115 6229 4535 2666 1819 2414 3724 4275 3812 3675 4319
$$ packed form
659583A7223l621j702j26p7P51K55j351k443n56J590J419J595J377p6j101j682
660244A1475j923k016n00J054R27J570R97m89k047j929j192n44L50O69K03K32
660905F837J008J714Q96m36m97L18L19J09m04l91j329j831k78j76K77K99J38l85
661649F188j49P94J49p53j49Pq39j555k25J062o01j542m05K27J092J116J269M24
662393F110J081R96q4j242j063j179q06m59K1J056J203j460l511k905l75K050
663053e67J525j467j026M41Q43J190J073N60M35J923J137m55n33J266K850J964
663715A1159j66j699p42N06N1J15R8k79j022j578r05q07j143j293j660j080L49
664417i6J487O14J162J544J036R50M18q86j694j869q47N95J310N51m63j37O44
$$ plain form
665120 4319 5019 5532 6390 7079 6335 6699 8366 9805 9845 8016 6215 5638 5825 6157 5382 5724 6596 5537
665863 5537 3445 2776 2966 4014 4864 4131 4253 4504 3468 3090 2651 1285 -174 165 -321 -614 598
666566 598 2686 3559 3966 5756 6562 6846 5912 4533 3089 2537 3731 4755 5124 6024 5991 3635 1949
667269 1949 1907 1744 1789 3546 5171 5225 5367 4147 1637 -561 -2102 -1943 -955 683 2146 3567 5256
667971 5256 6095 5855 5256 5506 5247 3236 1888 1438 1922 1850 1030 1106 1680 1292 1907 3459 4133 4536 4443
668756 4443 3943 3747 4464 5417 5102 4494 4715 3793 3047 3286 4531 5448 5938 6571 7712 7673 6102 4352
669500 4352 4131 4738 4202 2833 658 -684 -1873 -2099 308 3880 5440 5234 5440 5596 4888 2796
670161 2796 -201 -2129 -1757 -162 994 253 -836 -715 -833 -3352 -6073 -5912 -3769 -2289 -1077 -317
$$ packed form
665120D319P00N13Q58O89p44L64J667J439M0j829j801n77J87L32p75L42Q72j059
665863E537k092o69J90J048Q50p33J22K51j036l78m39j366j459L39m86k93J212
666566E98K088Q73M07J790Q06K84r34j379j444n52J194J024L69R00l3k356j686
667269A949m2j63M5J757J625N4J42j220k510k198j541J59R88J638J463J421J689
667971E256Q39k40n99K50k59k011j348m50M84p2q20P6N74l88O15J552O74M03r3
668756D443n00j96P17R53l15o08K21r22p46K39J245R17M90O33J141l9j571j750
669500D352k21O07n36j369k175j342j189k26K407L572J560k06K06J56p08k092
670161B796k997j928L72J595J156p41j089J21j18k519k721J61K143J480J212P60
$$ plain form
670822 -317 -1145 -2857 -3599 -3647 -3905 -3848 -2168 -463 465 898 466 232 279 602 1458 2611 2674 2092 2635
671608 2635 2874 1536 -610 -2160 -1788 -397 365 903 1233 -6 -1910 -3525 -5221 -5635 -3645 -1623
672268 -1623 -1764 -2139 -2428 -2627 -2571 -1368 -197 398 558 -184 -739 553 3595 6029 5341 3602 2152
672971 2152 1053 150 -1198 -1950 -2001 -2709 -4571 -6573 -7662 -6747 -4682 -2586 -1115 -1249 -2860 -4108
673632 -4108 -5372 -4031 -1801 -454 -1493 -3303 -4492 -4600 -3222 -429 1456 665 -1736 -4420 -8254
674252 -8254 -10829 -11010 -10658 -9330 -7275 -6124 -5567 -4715 -3260 -932 1188 1366 1326 939 764 344 -215
674954 -215 -1778 -2541 -2502 -4057 -5411 -4813 -2357 738 2269 1859 848 2069 4940 8095 12751 20601
675616 20601 32535 54573 101684 197574 346027 451653 455234 390453 309082 245339 199299
$$ packed form
670822c17q28j712p42m8k58N7J680J705R28M33m32k34M7L23Q56J153O3n82N43
671608B635K39j338k146j550L72J391P62N38L30j239j904j615j696m14J990K022
672268a623j41l75k89j99N6J203J171N95J60p42n55J292L042K434o88j739j450
672971B152j099r03j348p52n1p08j862k002j089R15K065K096J471j34j611j248
673632d108j264J341K230J347j039j810j189j08J378K793J885p91k401k684l834
674252h254k575j81L52J328K055J151N57Q52J455K328K120J78m0l87j75m20n59
674954b15j563p63L9j555j354N98K456L095J531m10j011J221K871L155M656P850
675616B0601J1934K2038M7111R5890J48453J05626L581o4781q1371o3743m6040
$$ plain form
676070 199299 164829 139429 119320 101775 88698 78520 70947 64770 57750 50884 46400 43825
676566 43825 42187 40483 36823 31378 27025 24414 22509 20571 19203 18498 17979 17492 16733 14681 13054
677186 13054 12283 12605 13720 14806 15874 16035 15450 14456 11463 8598 8632 10489 11462 12016 13707 15628
677847 15628 16398 15723 14565 12767 10470 10482 13159 14589 13699 10605 7230 5073 3787 4312 5882 6840
678508 6840 7264 7504 6754 6105 6794 7503 7729 6560 5296 3852 2071 1972 2569 2916 4342 5339 5491 6345
679252 6345 6873 6731 6866 6650 5567 5492 5911 5380 4963 4806 4017 3179 3194 3780 4987 6650 7261 6946 5901
680037 5901 4528 4069 3762 3527 3977 4395 4215 5194 6350 5664 4145 3693 4575 5529 6976 8141 8900
680740 8900 9339 10112 8495 5734 4928 5248 4339 2914 2038 1060 1429 2567 2913 4671 6824 8438 8661
$$ packed form
676070A99299l4470k5400k0109j7545j3077j0178p573o177p020o866m484k575
676566D3825j638j704l660n445m353k611j905j938j368p05n19m87p59k052j627
677186A3054p71L22J115J086J068J61n85r94k993k865L4J857R73N54J691J921
677847A5628P70o75j158j798k297J2K677J430q90l094l375k157j286N25J570R58
678508F840M24K40p50o49O89P09K26j169j264j444j781r9N97L47J426R97J52Q54
679252F345N28j42J35k16j083p5M19n31m17j57p89q38J5N86J207J663O11l15j045
680037E901j373m59l07k35M50M18j80R79J156o86j519m52Q82R54J447J165P59
680740H900M39P73j617k761q06L20r09j425q76r78L69J138L46J758K153J614K23
$$ plain form
681442 8661 7222 5121 4201 3800 3026 3014 3536 3432 2620 2765 2885 1713 370 1145 3090 3177 2199 1591
682186 1591 474 -1155 -1719 -475 964 593 1799 3860 3497 1209 1027 2482 2825 1112 -812 -367
682847 -367 3440 7154 8410 8694 9206 9455 8724 7801 6807 6288 5493 4488 4783 6508 7932 12270 22160
683549 22160 35553 42282 41536 37753 32383 25694 19468 14908 11966 8930 6550 6465 7873 8401 8413
684169 8413 7279 5819 3992 2097 1144 1150 1542 1979 1880 1763 1061 -46 259 1952 2137 1311 1406 712
684913 712 600 1456 2130 1661 -82 -509 842 2961 5654 7839 8438 8441 8415 8964 8984 7296 5082 3298
685657 3298 1652 333 767 1988 3125 4662 6181 7308 8228 7759 6409 6886 7796 7531 6828 4769
686318 4769 2154 998 1005 2082 2889 2088 -319 -3216 -4924 -5278 -4558 -1449 1552 1311 -366 -1531
$$ packed form
681442H661j439k101r20m01p74j2N22j04q12J45J20j172j343P75J945Q7r78o08
682186A591j117j629n64J244J439l71J206K061l63k288j82J455L43j713j924M45
682847c67L807L714J256K84N12K49p31r23r94n19p95j005K95J725J424M338R890
683549B2160J3393O729p46l783n370o689o226m560k942l036k380q5J408N28J2
684169H413j134j460j827j895r53OL92M37r9j17p02j107L05J693J85q26R5o94
684913G12j12Q56O74m69j743m27J351K119K693K185N99Lk6N49K0j688k214j784
685657C298j646j319M34J221J137J537J519J127R20m69j350M77R10k65p03k059
686318D769k615j156PJ077Q07q01k407k897j708l54P20L109L001k41j677j165
$$ plain form
686979 -1531 -1126 125 1076 1290 910 227 -39 -405 -850 -1661 -1837 -956 -833 -421 910 2392 2212 1649
687723 1649 1816 2569 2824 1803 1071 2353 3145 2476 1622 997 28 -1000 -1081 -145 788 2530 3751 3920
688467 3920 3788 4971 7068 7803 6147 3397 1666 2097 2313 1041 807 1477 3488 4757 4662 4455 3860
689169 3860 2497 1209 2424 4917 8313 16150 32675 60953 94624 121666 126606 104771 80739
689706 80739 63219 50134 41846 36931 33078 28512 23157 19839 17885 15601 15273 16143 15792 15586 14998
690327 14998 13171 10895 9273 8554 9157 9442 9175 8716 7541 6268 4628 3520 3415 3398 4062 5626
690987 5626 7473 8738 8103 6514 4076 2447 2534 3633 4958 5312 4256 3139 3225 5075 7158 9436
691649 9436 11080 11297 10436 9696 8089 6866 6489 6020 5230 5353 5621 6217 6833 6126 6066 7206 7444 5736
$$ packed form
686979a531M05J251R51K14l80o83k66l66m45q11j76Q81J23M12J331J482j80n63
687723A649J67P53K55j021p32J282P92o69q54o25r69j028q1R36R33J742J221J69
688467C920j32J183K097P35j656k750j731M31K16j272k34O70K011J269r5k07n95
689169C860j363j288J215K493L396P837J6525K8278L3671K7042M940k1835k4032
689706H0739j7520j3085q288m915l853m566n355l318j954k284l28Q70l51k06n88
690327A4998j827k276j622p19O03K85k67m59j175j273j640j108j05j7O64J564
690987E626J847J265o35j589k438j629Q7J099J325L54j056j117Q6J850K083K278
691649I436J644K17q61p40j607j223l77m69p90J23K68N96O16p07o0J140K38j708
$$ plain form
692392 5736 2415 208 86 97 254 2506 5451 5462 3731 2105 191 -1304 -1543 -337 2059 3295
693054 3295 2812 756 -67 1434 4098 6198 7711 7505 6892 7187 6111 4356 2780 2014 3195 5703
693715 5703 7914 9856 9647 8142 6193 5194 6495 7001 5038 3321 3433 4688 6082 6369 5329 3264
694376 3264 1446 837 320 151 343 -199 -1360 -2043 -3124 -3543 -2758 -2280 -1879 -2008 -2580 -2234 175 1230
695120 1230 1475 3334 4912 4338 3503 2608 2391 2655 2370 1658 2001 3839 4356 2686 436 -433 -1232
695822 -1232 -1238 -856 -158 1070 1288 1313 2577 2280 1554 2885 4831 5849 5882 6283 8045 10054 11673 13047
696566 13047 15474 16133 12950 9702 7346 6315 6156 5874 5793 5741 7256 9776 9706 8546 7457 7631 7836
697269 7836 7967 7396 6477 5605 3935 2887 2658 1405 1142 1591 3312 5074 2874 -369 -1405 -640
$$ packed form
692392E736l321k207j22J1J57K252K945J1j731j626j914j495k39J206K396J236
693054C295m83k056q23J501K664K100J513k06o13K95j076j755j576p66J181K508
693715E703K211J942k09j505j949r99J301N06j963j717J12J255J394K87j040k065
694376C264j818o09n17j69J92n42j161o83j081m19P85M78M01j29n72L46K409J055
695120A230K45J859J578n74q35q95k17K64k85p12L43J838N17j670k250q69p99
695822a232oL82O98J228K18K5J264k97p26J331J946J018L3M01J762K009J619J374
696566A3047K427O59l183l248k356j031j59k82q1n2J515K520p0j160j089J74K05
697269G836J31n71r19q72j670j048k29j253k63M49J721J762k200l243j036P65
$$ plain form
697930 -640 235 827 2148 4038 4435 3614 1910 922 926 1908 3875 4743 3410 1938 1302 2260 3209 3134
698674 3134 2321 783 310 1253 1387 1905 3780 4519 3509 2424 2351 3327 5192 5332 4248 2487 394
699376 394 71 1025 1549 2508 2389 2136 1890 1069 406 488 1041 1716 2476 2259 1931 1970 2264 2543 3009 3427
700202 3427 3852 4287 4223 4426 6169 6960 4801 1983 715 1522 3157 3130 3605 5007 5174 3682 2314
700905 2314 710 121 198 1251 2614 2622 1461 -93 187 1315 2132 1713 794 1075 1729 1645 1915 1851 -400
701690 -400 -3147 -4043 -3354 -2359 -1898 -2582 -2866 -2859 -3433 -3526 -1627 1748 4116 4831 4583 5981 8395 9765
702434 9765 9599 8411 7581 6418 4372 3270 4723 6292 5565 3811 3135 3633 3052 1377 625 1604
703095 1604 2491 2356 1961 1250 953 45 -1100 31 2275 4371 6095 6367 5352 4923 4542 4563 4912
$$ packed form
697930f40Q75N92J321J890L97q21j704r88MR82J967Q68j333j472o36R58R49p5
698674C134q13j538m73R43J34N18J875P39j010j085p3R76J865J40j084j761k093
699376C94l23R54N24R59j19k53k46q21o63Q2N53O75P60k17l28L9K94K79M66M18
700202C427M25M35o4K03J743P91k159k818j268Q07J635k7M75J402J67j492j368
700905B314j604n89P7J053J363Qj161j554K80J128Q17m19r19K81O54q4K70o4k251
701690d00k747q96O89R95M61o84k84Pn74r3J899L375K368P15k48J398K414J370
702434I765j66j188q30j163k046j102J453J569p27j754o76M98n81j675p52R79
703095A604Q87j35l95p11k97r08j145J131K244K096J724K72j015m29l81K1L49
$$ plain form
703798 4912 3998 2661 2715 2269 1467 256 -1673 -2231 -767 346 292 -278 -485 -353 -757 -892 -195 601
704541 601 919 301 -350 296 1360 2376 3677 4758 4269 3815 4256 5199 5884 5967 4637 2493 2060 1593
705285 1593 -551 -2239 -2242 -2057 -2792 -3816 -3263 -932 347 253 -697 -1765 -3142 -4616 -4071 -1232 -611
705987 -611 -1663 -1548 405 2114 2271 2996 4838 6356 7300 7210 4913 1024 -1121 -467 372 15 -10
706690 -10 378 922 2220 2721 2898 2280 977 864 806 356 -185 -632 483 2236 3063 4002 3382 2218
707434 2218 1181 -625 -2008 -1785 -985 -1010 -1456 -2243 -3400 -3577 -3931 -4761 -5761 -6237 -3839 -800 640
708136 640 623 189 94 263 278 786 904 296 -562 -1737 -2421 -1679 -144 718 1724 2725 1952 844 1775
708922 1775 4348 5937 6075 5320 4301 3285 1242 -740 -2177 -3354 -3093 -1499 -1149 -1622 -1466 -1765
$$ packed form
703798D912r14j337N4m46q02j211j929n58J464J113n4n70k07J32m04j35O97P96
704541F01L18o18o51O46J064J016J301J081m89m54M41R43O85Q3j330k144m33m67
705285A593k144j688lJ85p35j024N53K331J279r4r50j068j377j474N45K839O21
705987f11j052J15J953J709J57P25J842J518R44r0k297l889k145O54Q39l57k5
706690a0L88N44J298N01J77o18j303j13n8m50n41m47J115J753Q27R39o20j164
707434B218j037j806j383K23Q00k5m46p87j157j77l54q30j000m76K398L039J440
708136F40j7m34r5J69J5N08J18o08q58j175o84P42J535Q62J006J001p73j108R31
708922A775K573J589J38p55j019j016k043j982j437j177K61J594L50m73J56k99
$$ plain form
709583 -1765 -2737 -3076 -2945 -2948 -2684 -3111 -3684 -2640 -359 1952 3038 3107 2600 1475 650 953 2049 2392
710327 2392 1893 2286 2946 3279 4797 6585 7255 7076 5417 2831 1707 1379 1500 2741 3695 3915 2741
711029 2741 1342 198 -105 -57 992 3495 6249 6554 5315 3873 2607 1361 0 -772 -429 1309
711690 1309 2536 2743 2936 4392 5489 4011 1976 1246 2111 3067 2166 2351 4123 4282 2210 -304
712351 -304 -1819 -2600 -2025 -624 -124 872 2814 3240 2033 -460 -2753 -3229 -3663 -4800 -5246 -3989 -1211
713053 -1211 1367 2312 1654 622 83 -94 -700 -1048 -984 -698 134 1153 1191 1602 3065 4103 3850 3142
713797 3142 2845 3144 3355 3820 4970 4471 2651 1619 2452 3946 4753 4307 4323 3736 2090 1713 1293 757
714541 757 1599 2855 3829 3085 1533 863 673 1494 1846 1577 1551 2411 2440 1187 1495 2719 3211 4061 4571
$$ packed form
709583a765r72l39J31lK64m27n73J044K281K311J086O9n07j125q25L03J096L43
710327B392m99L93O60L33J518J788O70j79j659k586j124l28J21J241R54K20j174
711029B741j399j144l03M8J049K503K754L05j239j442j266j246j361p72L43J738
711690A309J227K07J93J456J097j478k035p30Q65R56r01J85J772J59k072k514
712351c04j515p81N75J401N00R96J942M26j207k493k293m76m34j137m46J257K778
713053a211K578R45o58j032n39j77o06l48O4K86Q32J019L8M11J463J038k53p08
713797C142k97K99K11M65J150m99j820j032Q33J494Q07m46J6n87j646l77m20n36
714541G57Q42J256R74p44j552o70j90Q21L52k69k6Q60K9j253L08J224M92Q50N10
$$ plain form
715326 4571 4406 2910 1253 853 570 1164 2518 3738 2652 -589 -2243 -752 534 -325 -2372 -3865
715988 -3865 -4852 -5247 -5592 -4827 -1863 106 -37 -481 -211 -229 -1222 -2735 -4429 -4691 -3938 -3000 -2983 -3401
716731 -3401 -2829 -1798 194 2329 3014 1741 577 682 1723 2131 2793 2812 2646 3281 3111 1742 810
717434 810 974 1106 -228 -1173 -1634 -1246 -2220 -3196 -2505 -454 1215 1307 565 -546 -1739 -2738 -2992 -1977
718177 -1977 -428 1288 2570 3510 2885 889 -72 514 1362 2672 3179 2589 1902 1573 1174 -1015 -2434
718880 -2434 -2491 -3420 -3930 -1993 701 2001 2454 2830 1915 880 922 1559 1437 237 -871 -2154 -2687
719583 -2687 -1646 74 1949 1850 -665 -805 1035 1075 962 1935 2759 2350 3081 5080 5496 4916 4816 4429
720326 4429 2958 3483 5911 6852 6169 3966 1377 -287 38 376 -93 -1341 -1774 -1096 -468 625 2038
$$ packed form
715326D571j65j496j657m00k83N94J354J220j086l241j654J491J286q59k047j493
715988c865r87l95l45P65K964J969j43m44K70j8r93j513j694k62P53R38J7m18
716731c401N72J031J992K135O85j273j164J05J041M08O62J9j66O35j70j369r32
717434H10J64J32j334r45m61L88r74r76O91K051J669R2p42j111j193r99k54J015
718177a977J549J716J282R40o25j996r61N86Q48J310N07n90o87l29l99k189j419
718880b434n7r29n10J937K694J300M53L76r15j035M2O37j22j200j108j283n33
719583b687J041J720J875r9k515j40J840M0j13R73Q24m09P31J999M16n80j00l87
720326D429j471N25K428R41o83k203k589j664L25L38m69j248m33O78O28J093J413
$$ plain form
721029 2038 2123 -728 -3681 -4524 -3181 -1410 -218 238 -344 -2361 -3529 -2259 -1175 -1332 -1633 -1189
721690 -1189 -794 -2185 -3854 -4428 -3963 -2730 -1350 -553 -1283 -2833 -3847 -5067 -6037 -5472 -3726 -2862
722351 -2862 -2064 -486 1923 3296 2544 892 -1433 -3364 -2934 -1330 -40 -27 -121 -374 -276 -341 392 723
723095 723 320 1325 3177 3856 2849 1340 769 406 -1370 -2581 -1171 1781 4452 6218 5124 1693
723756 1693 -732 -1512 -1652 -827 380 1506 2129 2635 1815 462 -739 -1058 -1591 -1325 597 1546 356
724459 356 -803 -275 999 1129 1702 1446 1982 3544 3493 896 -1848 -3966 -4807 -4042 -3017 -2370 -1650
725161 -1650 -786 -886 -2344 -3359 -3529 -3317 -2426 -815 -797 -1704 -2756 -3598 -4139 -3395 -1857 -1207 -1083 -1064
725905 -1064 -1116 -698 236 -884 -2770 -3284 -3153 -2926 -2524 -2845 -2629 -1367 -1029 -1310 -2070 -3010 -3312 -3975
$$ packed form
721029B038Q5k851k953q43J343J771J192M56n82k017j168J270J084j57l01M44
721690a189L95j391j669n74M65J233J380P97p30j550j014j220r70N65J746Q64
722351b862P98J578K409J373p52j652k325j931M30J604J290J3r4k53R8o5P33L31
723095G23m03J005J852O79j007j509n71l63j776j211J410K952K671J766j094l431
723756A693k425p80j40Q25J207J126O23N06q20j353j201l19n33K66J922R49j190
724459C56j159N28J274J30N73k56N36J562n1k597k744k118q41P65J025O47P20
725161a650Q64j00j458j015j70K12Q91J611J8r07j052q42n41P44J538O50J24J9
725905a064n2M18R34j120j886n14J31K27M02l21K16J262L38k81p60r40l02o63
$$ plain form
726649 -3975 -3693 -2101 -1264 -2530 -3447 -3787 -3210 -1406 -130 258 623 1204 2662 3932 3655 4052 3789
727351 3789 2824 2192 1738 1664 1636 2195 3083 2679 2567 3432 4780 6050 5991 4610 2154 -43 -1895 -4303
728095 -4303 -5403 -3599 -1648 -230 865 618 -98 936 3017 4077 4741 5684 5232 3910 3004 2253
728756 2253 1811 786 -87 -291 -817 -1543 -1403 -793 -418 3 -20 752 716 -876 -2413 -1974 592 2475
729500 2475 3140 3407 3502 2625 290 -1085 -214 1571 4090 6882 7605 6556 5583 5390 6897 8271 8113
730202 8113 7623 7025 5534 2652 237 508 2442 3461 1869 96 234 1746 2445 1991 1611 1220
730864 1220 936 659 824 1062 1538 2191 3017 4248 4636 3867 1622 1765 4102 6676 7436 6838 6506 5633
731607 5633 3690 2234 3227 4131 3427 2617 2823 3626 5068 5507 4336 3350 2980 3034 2893 3350 4422 3676
$$ packed form
726649c975K82J592Q37j266r17l40N77J804J276L88L65N81J458J270k77L97k63
727351C789r65o32m54p4k8N59Q88m04j12Q65J348J270n9j381k456k197j852k408
728095d303j100J804J951J418J095k47p16J034K081J060O64R43m52j322r06p51
728756B253m42j025q73k04n26p26J40O10L75M21k3P72l6j592j537M39K566J883
729500B475O65K67R5q77k335j375Q71J785K519K792P23j049r73j93J507J374j58
730202H113m90n98j491k882k415K71J934J019j592j773J38J512O99m54l80l91
730864A220k84k77J65K38M76O53Q26J231L88p69k245J43K337K574P60n98l32q73
731607E633j943j456R93R04p04q10K06Q03J442M39j171r86l70N4j41M57J072p46
$$ plain form
732351 3676 2138 545 -1281 -2207 -1510 13 -59 -1389 -2138 -2301 -1469 -102 1426 2271 2316 2133 1910
733054 1910 594 -903 -815 -937 -1427 -522 712 431 219 -88 289 1641 2444 1758 -602 -2464 -2996
733756 -2996 -3093 -3045 -3618 -4058 -3827 -1408 1798 2255 784 -755 -1365 -1908 -2165 -1465 -346 -101 -442 -1136
734500 -1136 -61 2383 3711 3826 3676 3158 2005 482 -180 629 1463 1524 1731 1937 843 -1336 -3299
735202 -3299 -4045 -4076 -2362 -324 -369 -1168 -1295 -35 1135 1442 1285 1100 1347 1154 1000 1365 1459 1252 -79
735988 -79 -1489 -3178 -4055 -3710 -1885 1051 1685 1317 1198 758 660 608 507 690 1727 3603 4293 4771
736731 4771 4438 3707 2783 2626 4677 6371 6849 5309 3380 2332 519 -64 -25 -922 -2419 -3203 -3076
737434 -3076 -2496 -1691 -1544 -2063 -2089 -2071 -961 352 -603 -1881 -1581 -1179 -250 897 1319 651 505 1667
$$ packed form
732351C676j538j593j826r26O97J523p2j330p49j63Q32J367J528Q45M5j83k23
733054A910j316j497Q8j22m90R05J234k81k12l07L77J352Q03o86k360j862n32
733756b996r7M8n73m40K31K419L206M57j471j539o10n43k57P00J119K45l41o94
734500a136J075K444J328J15j50n18j153j523o62Q09Q34O1K07K06j094k179j963
735202c299p46l1J714K038m5p99j27J260J170L07j57j85K47j93j54L65R4k07j331
735988g9j410j689q77L45J825K936O34l68j19m40r8n2j01J83J037J876O90M78
736731D771l33p31r24j57K051J694M78j540j929j048j813n83L9q97j497p84J27
737434c076N80Q05J47n19k6J8J110J313r55j278L00M02R29J147M22o68j46J162
$$ plain form
738177 1667 2545 3480 2926 1095 810 1307 534 -708 -2095 -2304 -2898 -3610 -2755 -1861 161 2259 1284
738880 1284 -1770 -3644 -3773 -3504 -2699 -1073 650 2334 1783 -777 -1903 -1342 -1275 -1477 -432 758
739541 758 1745 2975 2729 567 -854 -1680 -2937 -4488 -5039 -5527 -4379 -1757 -8 661 913 32 -429
740244 -429 -443 140 565 300 1049 2572 3518 4001 4881 5632 4980 3364 1603 1690 2107 2075 3202 3847 2399
741029 2399 1635 2526 1296 -786 -1503 -2930 -3096 -2844 -3614 -4118 -3368 -2295 -2485 -3308 -2653 -1289 -518
741731 -518 -256 597 2103 3391 3643 2319 790 -669 -1939 -1978 -1631 -1437 -1474 -2206 -2705 -2145 -13 1237
742475 1237 1060 752 -281 -667 -138 -287 -1441 -2135 -1834 -2008 -2463 -2566 -2063 -1763 -1691 -1074 -918 -1892 -2787
743260 -2787 -3117 -2064 231 1406 1347 1869 1584 459 -1513 -3322 -3537 -2020 -1174 -1877 -3524 -2988 -3077
$$ packed form
738177A667Q78R35n54j831k85M97p73j242j387k09n94p12Q55Q94K022K098r75
738880A284l054j874j29K69Q05J626J723J684n51k560j126N61O7k02J045J190
739541G58R87J230k46k162j421q26j257j551n51m88J148K622J749O69K52q81m61
740244d29j4N83M25k65P49J523R46M83Q80P51o52j616j761Q7M17l2J127O45j448
741029B399p64Q91j230k082p17j427j66K52p70n04P50J073j90q23O55J364P71
741731e18K62Q53J506J288K52j324j529j459j270l9L47J94l7p32m99N60K132J250
742475A237j77l08j033l86N29j49j154o94L01j74m55j03N03L00P2O17J56r74q95
743260b787l30J053K295J175n9N22k85j125j972j809k15J517Q46p03j647N36q9
$$ plain form
743963 -3077 -4012 -3835 -1384 983 1244 -387 -2191 -2447 -2146 -1519 -685 428 1169 1536 1771 2282 1807
744665 1807 1411 2317 3275 2817 2547 2424 2292 1589 378 521 2877 5097 5478 4363 2677 1027 428
745368 428 1262 2292 2763 2614 2494 3139 3446 3707 4774 5123 4667 3155 2241 2521 2348 1621 919 541
746111 541 1341 2208 2530 1010 -945 -981 592 3018 4716 5018 5537 5894 4150 2448 1433 798 630
746814 630 1260 1235 1848 3170 3846 2622 2163 3610 4423 4396 3452 1257 -255 563 1264 478 -428 -434 -179
747599 -179 -415 -330 340 275 559 732 -421 -1256 -2092 -2351 -2034 -2079 -957 1058 2452 2415 2283 1841 1417
748384 1417 425 -418 -1377 -2645 -3270 -3538 -3757 -3004 -1726 -403 88 -133 134 -105 -1615 -3253 -3096
749087 -3096 -881 125 -303 -438 1030 2455 2365 1693 1739 2408 4107 5353 5341 5646 4920 2702 893
$$ packed form
743963c077r35J77K451K367K61j631j804k56L01O27Q34J113P41L67K35N11m75
744665A807l96R06R58m58k70j23j32p03j211J43K356K220L81j115j686j650n99
745368D28Q34J030M71j49j20O45L07K61J067L49m56j512r14K80j73p27p02l78
746111E41Q00Q67L22j520j955l6J573K426J698L02N19L57j744j702j015o35j68
746814F30O30k5O13J322O76j224m59J447Q13k7r44k195j512Q18P01p86r06oK55
747599a79k36Q5O70o5K84J73j153q35q36k59L17m5J122K015J394l7j32m42m24
748384A417r92q43r59j268o25k68k19P53J278J323M91k21K67k39j510j638J57
749087c096K215J006m28j35J468J425r0o72M6O69J699J246j2L05p26k218j809
$$ plain form
749789 893 -1531 -3800 -4296 -2153 -1104 -1714 -2330 -1174 294 584 540 -601 -1028 1196 3631 4818
750450 4818 4358 3245 3435 3638 4974 5789 4516 1919 -559 -1593 -593 1238 1609 136 -2931 -5530
751112 -5530 -5136 -2995 -1615 -431 -494 -2557 -4490 -5294 -4542 -3108 -2278 -2135 -1888 -488 747 276 -1066
751814 -1066 -429 2528 3167 1769 1348 2256 3071 2109 -28 -1550 -1780 -1388 109 1640 1152 52 574
752516 574 2353 2984 4110 4495 2685 -534 -3400 -4357 -2650 -397 310 -52 59 1437 2714 2821
753177 2821 2777 1274 -752 -442 744 881 1781 2269 1758 2354 3029 2796 1944 775 130 525 173 -776
753921 -776 -795 -1507 -1092 1446 3368 3536 1688 -219 -796 -848 -21 -432 -1831 -1751 -1349 11 1791 2042
754665 2042 2047 1465 -208 -1800 -2813 -1661 841 3248 4934 6058 5888 4999 4161 3024 1628 773
$$ packed form
749789H93k424k269m96K143J049o10o16J156J468K90m4j141m27K224K435J187
750450D818m60j113J90K03J336Q15j273k597k478j034J000J831L71j473l067k599
751112e530L94K141J380J184o3k063j933q04P52J434Q30J43K47J400J235m71j342
751814a066O37K957O39j398m21R08Q15r62k137j522k30L92J497J531m88j100N22
752516E74J779O31J126L85j810l219k866r57J707K253P07l62J11J378J277J07
753177B821m4j503k026L10J186J37R00M88n11N96O75k33q52j169o45L95l52r49
753921g76j9p12M15K538J922J68j848j907n77n2Q27m11j399Q0M02J360J780K51
754665B042Nn82j673j592j013J152K502K407J686J124j70q89q38j137j396q55
$$ plain form
755326 773 770 1335 1068 167 341 519 539 1752 2764 2924 3100 3302 4186 4966 4200 2665 2089 2552 3836
756112 3836 5549 6747 6786 5806 4249 2857 2235 2266 2093 905 -1661 -4398 -5056 -3520 -1963 -1458 -1335
756814 -1335 -1920 -2453 -3442 -5239 -6505 -7310 -6345 -3546 -1790 -1800 -1749 -2310 -2701 -2546 -3349 -3245 -2759 -2327
757558 -2327 -2091 -1334 -810 -1108 -1493 -1534 -786 182 460 -648 -1303 -1274 -1175 1102 3625 4233 4101 2835 993
758343 993 57 -714 -1686 -2142 -1655 -1547 -2250 -2440 -2943 -2022 280 1868 1662 145 -843 -554 614 2201
759087 2201 2410 978 -1028 -2336 -2625 -1538 -494 -28 477 633 -1238 -3709 -4050 -3016 -782 1485
759748 1485 2467 3240 4119 3658 4054 5483 6031 5188 5262 6270 5766 5123 6113 5565 3920 3331 2589 335
760492 335 -195 183 188 1179 2242 1181 -177 -478 -95 -461 -1500 -2964 -3737 -4055 -4116 -3877 -2855 -1646
$$ packed form
755326G73lN65k67r01J74J78K0J213J012J60J76K02Q84P80p66j535n76M63J284
756112C836J713J198L9r80j557j392o22L1j73j188k566k737o58J536J557N05J23
756814a335n85n33r89j797j266q05R65K799J756j0N1n61l91J55q03J04M86M32
757558b327K36P57N24k98l85m1P48R68K78j108o55K9R9K277K523O08j32j266j842
758343I93r36p71r72m56M87J08p03j90n03R21K302J588k06j517r88K89J168J587
759087B201K09j432k006j308k89J087J044M66N05J56j871k471l41J034K234K267
759748A485R82P73Q79m61L96J429N48q43P4J008n04o43R90n48j645n89p42k254
760492C35n30L78NR91J063j061j358l01L83l66j039j464p73l18o1K39J022J209
$$ plain form
761236 -1646 -883 -646 730 2251 2222 1127 658 376 -32 -401 -591 -5 560 846 347 66 5 -1071
761979 -1071 -1530 -531 -607 -2064 -1514 1010 3095 4542 4599 2732 1158 587 1586 2365 2394 903 -1128
762682 -1128 -2621 -2710 -1427 -999 -1762 -2690 -3549 -3949 -3680 -2936 -1839 -368 -330 -801 -599 -191 26 263
763425 263 1297 2846 4580 5908 4789 2328 1160 754 1049 2194 2746 1638 -461 -405 964 1442
764087 1442 2250 2725 1540 988 1533 1691 2250 2825 2733 2812 2851 1265 6 64 1716 4442 6135 4586
764830 4586 1488 247 521 866 834 593 -923 -3020 -3870 -2774 -1640 -2263 -3302 -4646 -5063 -3123
765492 -3123 176 2514 4142 4630 3665 3056 3377 4292 3225 540 -2182 -3615 -4289 -3912 -2641 -2284
766153 -2284 -1882 -922 542 1631 2412 3005 2943 1964 350 -542 63 1244 2559 2981 3146 1507 -427
$$ packed form
761236a646P63K37J376J521k9j095m69k82m08l69j90N86N65K86m99k81o1j076
761979a071m59R99p6j457N50K524K085J447N7j867j574n71R99P79K9j491k031
762682a128j493q9J283M28p63r28q59m00K69P44J097J471L8m71K02M08K17K37
763425B63J034J549J734J328j119k461j168m06K95J145N52j108k099N6J369M78
764087A442Q08M75j185n52N45J58N59N75r2P9L9j586j259N8J652K726J693j549
764830D586l098j241K74L45l2k41j516k097q50J096J134o23j039j344m17J940
765492c123L299K338J628M88r65o09L21R15j067k685k722j433o74L77J271L57
766153b284M02R60J464J089P81N93o2r79j614q92O05J181J315M22J65j639j934
$$ plain form
766856 -427 -1205 -539 721 931 945 141 -1854 -2397 -528 2206 3371 3386 3954 4536 4517 4486 4650 4244 3913
767640 3913 3738 3867 3763 2924 1933 2156 2523 1669 1318 1192 1060 1557 1657 1467 1642 1694 868 -258 -599
768426 -599 -168 -20 296 346 -857 -2212 -2206 -1251 -750 -413 370 1206 1504 1312 1302 3012 4073 3946 3319
769210 3319 2720 2335 2984 4625 5541 5459 4983 3366 1277 401 818 2104 3340 3095 767 -638 1466
769913 1466 4192 5570 4912 4473 5400 4821 3947 3403 2077 998 872 1603 1299 -506 -1570 -1519 -472
770616 -472 733 1823 2867 2697 2317 1857 2174 2733 2051 210 -1242 -2980 -3927 -4399 -3153 -1783 -1954
771318 -1954 -3139 -5045 -7272 -8543 -7777 -6624 -6532 -5018 -2785 -1393 -323 343 -223 -1093 -965 313
771979 313 1603 1849 1319 2321 3291 925 -1338 -1452 -843 -1417 -1446 430 2476 2198 1375 1094 1505 1596
$$ packed form
766856d27p78O66J260K10J4q04j995n43J869K734J165J5N68N82j9l1J64m06l31
767640C913j75J29j04q39r91K23L67q54l51j26j32M97J00j90J75N2q26j126l41
768426e99M31J48L16N0j203j355OR55N01L37P83Q36K98j92j0J710J061j27o27
769210C319n99l85O49J641R16q2m76j617k089q76M17J286J236k45k328j405K104
769913A466K726J378o58m39R27n79q74n44j326j079j26P31l04j805j064N1J047
770616d72J205J090J044j70l80m60L17N59o82j841j452j738r47m72J246J370j71
771318a954j185j906k227j271P66J153R2J514K233J392J070O66n66q70J28J278
771979C13J290K46n30J002R70k366k263j14O09n74k9J876K046k78q23k81M11R1
$$ plain form
772723 1596 1308 917 521 1546 3571 4211 3564 1438 -334 -1428 -2210 -1558 -261 870 1775 1339 1422
773426 1422 1398 325 -190 -536 -81 1505 4199 5363 4892 4088 2766 652 -401 377 967 850 1569
774128 1569 2774 4058 3879 2756 2342 2903 3776 3824 3463 3153 2996 4250 5441 4684 3399 4201 4807
774831 4807 4323 3358 2440 2812 4387 5781 3953 626 -763 -193 268 -1129 -2185 -1345 -132 70
775492 70 -521 -1113 -1132 -1666 -2110 -2491 -2205 -890 -105 -679 -2380 -3228 -3434 -3014 -2375 -1413 -737 -875 -317
776277 -317 218 92 1145 3126 3013 1726 1455 2476 3242 3170 2519 872 -600 335 1329 1520 1891 1978
777021 1978 2155 2545 2515 1730 2415 4053 4689 4224 2666 1246 2488 5028 4943 2584 1525 1243 576
777723 576 -213 795 3204 4939 5226 5362 6006 4920 2576 635 830 2101 2855 2691 1910 1738 2713
$$ packed form
772723A596k88l91l96J025K025O40o47k126j772j094p82O52J297J131R05m36Q3
773426A422k4j073n15l46M55J586K694J164m71q04j322k114j053P78N90j17P19
774128A569J205J284j79j123m14N61Q73M8l61l10j57J254J191p57j285Q02O06
774831D807m84r65r18L72J575J394j828l327j389N70M61j397j056Q40J213K02
775492G0n91n92j9n34m44l81K86J315P85n74j701q48k06M20O39R62O76j38N58
776277c17N35j26J053J981j13j287k71J021P66p2o51j647j472R35R94J91L71Q7
777021A978J77L90l0p85O85J638O36m65j558j420J242K540q5k359j059k82o67
777723E76p89J008K409J735K87J36O44j086k344j941J95J271P54j64p81j72R75
$$ plain form
778425 2713 3560 3300 2124 -280 -3357 -4301 -3390 -2874 -2539 -2320 -3329 -4618 -5930 -7100 -6071 -4379
779087 -4379 -4468 -5208 -5777 -6470 -5889 -3431 -594 1879 2341 2034 1845 1012 343 -394 -402 -39 928 2746 3272
779872 3272 3114 3466 2875 1243 1040 2598 2028 -11 -1222 -1097 1514 4462 5847 5166 2990 258
780533 258 -2552 -3630 -3213 -1754 -633 -883 -631 916 1915 48 -1959 -2180 -2685 -4332 -5271 -4853 -4306
781235 -4306 -4615 -4348 -2684 -2338 -4317 -5238 -3922 -2474 -1740 -1807 -1647 -470 395 273 -330 177 976 -19
781979 -19 -1557 -1738 -1355 -813 -965 -1758 -2741 -3497 -2363 34 1929 2948 4021 4413 4061 3050 1306
782682 1306 322 -899 -859 353 967 391 -1395 -2466 -2184 -1262 -407 -124 445 938 1929 1669 372 -1145
783426 -1145 -2772 -2394 -524 253 -592 -1384 229 3511 5410 4134 1404 -997 -1908 -1852 -461 1797
$$ packed form
778425B713Q47k60j176k404l077r44R11N16L35K19j009j289j312j170J029J692
779087d379q9p40n69o93N81K458K837K473M62l07j89q33o69p37qL63R67J818N26
779872C272j58L52n91j632k03J558n70k039j211J25K611K948J385o81k176k732
780533B58k810j078M17J459J121k50K52J547R99j867k007k21n05j647r39M18N47
781235d306l09K67J664L46j979r21J316J448P34o7J60J177Q65j22o03N07P99r95
781979a9j538j81L83N42j52p93r83p56J134K397J895J019J073L92l52j011j744
782682A306r84j221M0J212O14n76j786j071K82R22Q55K83N69M93R91k60j297j517
783426a145j627L78J870P77q45p92J613L282J899j276k730k401r11N6J391K258
$$ plain form
784087 1797 2209 2891 3261 1676 -1186 -2490 -3181 -2961 -2087 -1565 -2408 -3564 -3852 -2891 -1644 -734 -662 -1124
784830 -1124 -1603 -2555 -2871 -2255 -2164 -1266 1073 3219 4000 2604 302 -763 -697 -402 -469 -629 -406 -790
785575 -790 -1206 -995 385 2666 5666 8575 9716 9504 8805 7103 4269 1213 554 1671 1729 2416 4507
786277 4507 5206 3920 1107 -451 56 704 735 1425 2131 1870 496 152 500 -123 -1348 -1886 -2178 -1658
787021 -1658 -1716 -2210 -1873 366 2179 2104 1470 709 575 1337 2081 2136 779 -1671 -3306 -2992 -1103 87
787764 87 -438 -409 -336 -1309 -1509 -531 65 -107 164 894 1509 710 -937 -1996 -2555 -1937 -1082 -1883 -3954
788550 -3954 -4147 -3804 -3296 -2030 -2016 -1120 560 -67 -1736 -1360 -13 -497 -304 1170 1362 1577 2513 2192
789293 2192 1040 -115 -645 -846 -875 -1688 -2086 275 2619 3241 1973 1611 1911 2278 2302 2428 1117 -21
$$ packed form
784087A797M12O82L70j585k862j304o91K20Q74N22q43j156k88R61J247R10P2m62
784830a124m79r52l16O16R1Q98K339K146P81j396k302j065O6K95o7j60K23l84
785575g90m16K11J380K281L000K909J141k12o99j702k834l056o59J117N8O87K091
786277D507O99j286k813j558N07O48L1O90P06k61j374l44L48o23j225n38k92N20
787021a658n8m94L37K239J813p5o34p61j34P62P44N5j357k450j635L14J889J190
787764H7n25K9P3r73k00R78N96j72K71P30O15p99j647j059n59O18Q55q01k071
788550c954j93L43N08J266J4Q96J680o27j669L76J347m84J93J474J92K15R36l21
789293B192j152j155n30k01k9q13l98K361K344O22j268l62L00L67K4J26j311j138
$$ plain form
790037 -21 367 578 520 1062 1639 1834 2224 2667 1866 -130 -2825 -4714 -3953 -2628 -2385 -1654 -802 -560 67
790822 67 218 1147 2526 3177 2529 -134 -1837 -2021 -1609 335 1797 2726 3612 2963 1609 45 -568
791525 -568 -128 1245 1309 686 -13 -695 -1593 -3337 -3612 -2506 -2983 -3978 -4393 -4436 -2831 -356 129 -1142
792269 -1142 -2246 -2761 -2526 -1573 -135 -122 -1601 -3841 -5020 -3636 -649 2136 3913 3005 577 -749
792930 -749 -1027 -271 -164 -1950 -4120 -4242 -1892 -443 -306 -475 -42 1100 897 1331 2068 2289 2263 1737
793674 1737 1879 3574 4760 4933 4499 4194 3743 1876 301 -91 755 2236 2681 2581 1778 684 88
794376 88 -1464 -2891 -4166 -3734 -1502 820 2115 1864 1606 2683 4447 4036 2528 966 579 1086
795037 1086 1751 2862 2201 -975 -3887 -4027 -2881 -3450 -5050 -4200 -3532 -3495 -2389 -517 646 231 271
$$ packed form
790037b1L88K11n8N42N77J95L90M43q01j996k695j889P61J325K43P31Q52K42O27
790822F7J51R29J379O51o48k663j703j84M12J944J462R29Q86o49j354j564o13
791525e68M40J373O4o23o99o82q98j744k75J106m77r95m15m3J605K475M85j271
792269a142j104n15K35R53J438J3j479k240j179J384K987K785J777r08k428j326
792930g49k78P56J07j786k170j22K350J449J37j69M33J142k03M34P37K21k6n26
793674A737J42J695J186J73m34l05m51j867j575l92Q46J481M45j00q03j094n96
794376H8j552j427j275M32K232K322J295k51k58J077J764m11j508j562l87N07
795037A086O65J111o61l176k912j40J146n69j600Q50O68L7J106J872J163m15M0
$$ plain form
795740 271 1778 3356 3909 4533 5211 5279 4408 3565 2112 516 -147 -685 -2555 -3906 -5346 -7963 -8566
796442 -8566 -7238 -6491 -5676 -3161 -931 -790 -427 212 674 1379 903 -574 -1674 -2255 -3259 -3461 -2544
797144 -2544 -1484 -646 -1172 -2597 -3662 -3596 -3032 -2172 -1159 -135 962 1051 103 -138 395 1749 3138
797847 3138 2908 2039 651 -158 1224 2978 3367 2558 1185 262 26 -8 -919 -1187 -1826 -2469 -3095 -3736
798591 -3736 -4390 -3235 -895 1863 2898 2304 1032 -811 -880 241 1190 1105 786 694 1356 1920 2318 2301
799335 2301 1724 2255 2825 2803 2719 2621 2083 2552 4445 5734 4843 3377 2107 1917 2617 3440 4801 6299
800078 6299 5874 4148 2173 1014 1495 2058 3020 4410 4866 4051 3255 2901 2155 1515 1577 1926 2200 1268
800822 1268 638 1599 1938 1274 21 -142 1381 806 46 413 -113 -864 -738 331 -183 -1271 -1968 -1051
$$ packed form
795740B71J507J578N53O24O78O8q71q43j453j596o63n38j870j351j440k617o03
796442h566J328P47Q15K515K230J41L63O39M62P05m76j477j100n81j004k02R17
797144b544J060Q38n26j425j065O6N64Q60J013J024J097Q9r48k41N33J354J389
797847C138k30q69j388q09J382J754L89q09j373r23k36l4r11k68o39o43o26o41
798591c736o54J155K340K758J035n94j272j843o9J121R49q5l19r2O62N64L98j7
799335B301n77N31N70k2q4r8n38M69J893J289q91j466j270j90P00Q23J361J498
800078F299m25j726j975j159M81N63R62J390M56q15p96l54p46o40O2L49K74r32
800822A268o30R61L39o64j253j63J523n75p60L67n26p51J26J069n14j088o97R17
$$ plain form
801566 -1051 -557 -1159 -1452 -1055 -1003 -1401 -2401 -1767 161 2248 2950 2270 2335 2485 2004 2072 2855 3380 5125
802351 5125 6504 6266 6328 6951 6550 6735 6780 6269 5611 5689 5884 6423 6960 5927 4427 4074 4047 4221 4728
803136 4728 5240 5141 5398 6239 5266 3620 3362 3948 4636 4075 3082 3152 2633 656 -487 388 2466 3977
803880 3977 4547 4744 5192 5073 3997 3484 2221 1111 1025 1077 1267 66 -1044 -1345 -960 -1312 -1597 -1839
804624 -1839 -2041 -2166 -4005 -6522 -5711 -1373 2260 4007 4610 4605 3013 228 -1401 -1125 -745 -1084 -998
805326 -998 563 2272 2354 1053 2179 3352 3130 1954 494 16 1112 2630 3410 3128 2749 2408 2265
806029 2265 1715 2116 2874 3048 3047 1596 553 1296 1828 -32 -1114 285 1193 82 -1636 -2148 -2119 -1490
806773 -1490 -59 86 -1612 -3785 -4653 -4002 -2438 -1615 -1776 -2033 -315 1619 1328 303 -332 234 -430
$$ packed form
801566a051M94o02k93L97N2l98j000O34J928K087P02o80O5J50m81O8P83N25J745
802351E125J379k38O2O23m01J85M5n11o58P8J95N39N37j033j500l53k7J74N07
803136D728N12r9K57Q41r73j646k58N86O88n61r93P0n19j977j143Q75K078J511
803880C977N70J97M48j19j076n13j263j110q6N2J90j201j110l01L85l52k85k42
804624a839k02j25j839k517Q11M338L633J747O03nj592k785j629K76L80l39Q6
805326i98J561J709Q2j301J126J173k22j176j460m78J096J518P80k82l79l41j43
806029B265n50M01P58J74jj451j043P43N32j860j082J399R08j111j718n12K9O29
806773a490J431J45j698k173q68O51J564Q23j61k57J718J934k91j025o35N66o64
$$ plain form
807475 -430 -842 420 1792 2105 2359 2225 1380 437 -628 -469 1656 2243 866 109 634 3022 4479
808177 4479 2795 1155 1301 2722 3510 3370 2612 1867 783 -503 -2053 -3351 -3284 -2169 -1305 -291
808839 -291 274 443 -140 -1859 -1843 -615 680 1448 1782 1583 57 -212 38 928 2689 4026 5556
809542 5556 6630 5833 4736 3879 1939 -1067 -3181 -3497 -4044 -3430 -33 1368 303 -614 -509 -379
810202 -379 -502 1153 2811 3837 2710 1623 1136 617 992 1763 2025 2963 3664 4538 5738 6886 7432
810905 7432 7836 8612 8347 8126 8305 8955 9413 8808 7326 5116 2806 334 -881 -245 -295 -1264 -1755 -1600
811649 -1600 -1092 -82 161 395 2115 3434 1937 -921 -2124 -1805 -1390 -1192 -2061 -3132 -2797 -1311
812310 -1311 806 3131 4734 5077 4371 3547 2235 1734 1886 1550 1266 1003 1115 1891 1572 894 1018 -296
$$ packed form
807475d30m12J262J372L13K54j34q45r43j065J59K125N87j377p57N25K388J457
808177D479j684j640J46J421P88j40p58p45j084j286j550j298O7J115Q64J014
808839b91N65J69n83j719J6J228J295P68L34j99j526k69K50Q90J761J337J530
809542E556J074p97j097q57j940l006k114l16n47O14L397J401j065r17J05J30
810202c79j23J655J658J026j127j087m87n19L75P71K62R38P01Q74J200J148N46
810905G432M04P76k65k21J79O50M58o05j482k210k310k472j215O36n0r69m91J55
811649a600N08J010K43K34J720J319j497k858j203L19M15J98q69j071L35J486
812310a311K117K325J603L43p06q24j312n01J52l36k84k63J12P76l19o78J24j314
$$ plain form
813054 -296 -1955 -1915 -1212 307 3353 5522 7116 9436 11624 12177 10738 9200 7459 4835 2922 1492
813715 1492 546 1523 3778 5341 5086 3897 2800 3356 3729 3648 2576 1137 746 2177 4180 5011 3358
814417 3358 794 -920 -1228 -1524 -311 1599 2614 2319 1085 325 1273 2132 1907 1288 928 619 666
815120 666 128 -821 -1686 -2900 -1674 137 -530 -2157 -4636 -6687 -6288 -4051 -1297 715 1793 957
815781 957 -438 -410 -484 -348 -210 248 1379 2446 3920 5403 5156 4084 2961 2056 3135 4927 6496
816484 6496 8077 8549 8828 8247 5959 5664 6750 6035 4084 2728 2757 2737 2803 2397 1733 1100 -280 -1595
817227 -1595 -1748 -1512 -1880 -593 1622 2327 2295 1777 1356 718 355 -733 -881 -430 -35 211 243 638 871
818012 871 286 2 169 -654 -1828 -2185 -2527 -3161 -4509 -4809 -3717 -2628 -2596 -2383 -1332 -1259 -2680 -4747
$$ packed form
813054b96j659M0P03J519L046K169J594K320K188N53j439j538j741k624j913j430
813715A492r46R77K255J563k55j189j097N56L73q1j072j439l91J431K003Q31j653
814417C358k564j714l08k96J213J910J015k95j234p60R48Q59k25o19l60l09M7
815120F66n38r49q65j214J226J811o67j627k479k051L99K237K754K012J078q36
815781I57j395K8p4J36J38M58J131J067J474J483k47j072j123r05J079J792J569
816484F496J581M72K79n81k288k95J086p15j951j356K9k0O6m06o64o33j380j315
817227a595j53K36l68J287K215P05l2n18m21o38l63j088j48M51L95K46L2L95K33
818012H71n85k84J67q23j174l57l42o34j348l00J092J089L2K13J051P3j421k067
$$ plain form
818756 -4747 -6416 -5858 -4171 -3129 -3069 -2966 -1006 694 -412 -2247 -3380 -4032 -3306 -1087 1539 2987
819417 2987 3238 2392 1707 1061 675 1103 2105 2699 1674 -165 -1068 -293 908 1233 988 615 594 162
820161 162 283 -17 -131 -400 -304 276 1121 1265 1889 3813 4619 4198 3684 2264 472 -307 -128 463 830
820946 830 1371 1950 1833 1230 -92 -928 -933 -924 -340 221 543 2756 4945 6483 6114 4564 3997 4345 3586
821732 3586 1102 -165 1100 3071 4206 3779 2703 1206 -291 -1322 -3038 -4341 -5316 -6040 -4554
822351 -4554 -2603 -2417 -1829 -526 96 873 1734 1879 1996 2585 3025 3033 3880 4095 3023 1311 27 101
823095 101 275 -509 -547 125 729 -224 -2560 -2925 -997 262 -512 -1691 -3064 -4252 -4165 -1603 1997
823797 1997 4749 5838 3974 -318 -4152 -4014 -1390 581 303 1025 825 -883 -1926 -3177 -4073 -4156
$$ packed form
818756d747j669N58J687J042O0J03J960J700j106j835j133o52P26K219K626J448
819417B987K51q46o85o46l86M28J002N94j025j839r03P75J201L25k45l73k1m32
820161A62J21l00j14k69R6N80Q45J44O24J924Q06m21n14j420j792p79J79N91L67
820946H30N41N79j17o03j322q36nRN84N61L22K213K189J538l69j550n67L48p59
821732C586k484j267J265J971J135m27j076j497j497j031j716j303r75p24J486
822351d554J951J86N88J303O22P77Q61J45J17N89M40QQ47K15j072j712j284P4
823095A01J74p84l8O72O04r53k336l65J928J259p74j179j373j188Q7K562L600
823797A997K752J089j864m292l834J38K624J971k78P22k00j708j043j251q96q3
$$ plain form
824459 -4156 -2649 -344 2161 4377 4113 2826 1276 310 -1091 -842 808 23 -2030 -1226 -87 306
825120 306 529 225 839 2122 1931 518 -285 -425 250 1873 1534 203 856 2604 3766 4591 3844
825823 3844 3226 3773 5087 5505 4819 4417 3613 1937 1374 1281 1214 2435 5032 7188 7526 6591 5090 3889
826566 3889 3410 2529 828 531 734 788 674 -289 -1792 -1520 -1106 -378 701 544 -1752 -3815 -4718 -5781
827310 -5781 -4750 -1620 2048 4707 4948 3267 1484 318 134 951 973 1300 2345 2692 1471 -1154
827971 -1154 -3271 -3483 -2563 -897 1031 2195 1579 -389 -1560 -2108 -2789 -2859 -1575 429 3123 5302
828632 5302 5602 4798 3286 3171 3703 3738 4801 4717 3199 199 -1806 -2501 -1696 574 1055 -514 -1437
829335 -1437 -2443 -2987 -2490 -1427 -519 -625 -2524 -5561 -7017 -7295 -8423 -9122 -8743 -7628 -4396 -1517
$$ packed form
824459d156J507K305K505K216k64j287j550r66j401K49J650p85k053Q04J139L93
825120C06K23l04O14J283j91j413q03j40O75J623l39j331O53J748J162Q25p47
825823C844o18N47J314M18o86m02q04j676n63r3o7J221K597K156L38r35j501j201
826566C889m79q81j701k97K03N4j14r63j503K72M14P28J079j57k296k063r03j063
827310e781J031L130L668K659K41j681j783j166j84Q17K2L27J045L47j221k625
827971a154k117k12R20J666J928J164o16j968j171n48o81p0J284K004K694K179
828632E302L00q04j512j15N32L5J063q4j518l000k005o95Q05K270M81j569r23
829335a437j006n44M97J063R08j06j899l037j456k78j128o99L79J115L232K879
$$ plain form
829996 -1517 -247 337 -268 173 1350 1595 2043 2554 3350 3372 3857 4696 3975 2580 561 -1414 -2055 -815
830740 -815 289 340 605 1358 2696 3213 2516 562 -804 -586 -715 -1117 197 1223 1070 328 -366 -560
831484 -560 -419 -660 -1961 -4142 -6156 -5698 -4610 -4431 -2821 -690 -772 -2651 -2907 -2040 -569 -642 -2929
832186 -2929 -3759 -2623 -1095 -721 -504 -514 -288 -475 -1539 -1641 -1282 -556 1127 1789 1871 2094 841 -359
832930 -359 -139 -138 286 1598 648 -1607 -3594 -3668 -2389 -1325 -1344 -2012 -3276 -4652 -5692 -5634 -5445 -4772
833673 -4772 -2163 922 3249 4621 5126 5818 6686 7067 6979 5753 2759 457 -340 -471 -884 -1911 -2507
834376 -2507 -1337 1303 3438 2856 917 -66 -229 -577 -952 -989 -1311 -1747 -2637 -2486 -952 -804 -1869
835078 -1869 -2344 -2385 -2113 -2275 -3751 -4376 -3287 -1060 775 377 -266 -167 743 2172 3504 5706 7027
$$ packed form
829996a517J270N84o05M41J177K45M48N11P96K2M85Q39p21j395k019j975o41J240
830740h15J104N1K65P53J338N17o97j954j366K18j29m02J314J026j53p42o94j94
831484e60J41k41j301k181k014M58J088J79J610K131q2j879k56Q67J471p3k287
832186b929q30J136J528L74K17j0K26j87j064j02L59P26J683O62Q2K23j253j200
832930c59K20JM24J312r50k255j987p4J279J064j9o68j264j376j040N8J89O73
833673d772K609L085K327J372N05O92Q68L81q8j226k994k302p97j31m13j027n96
834376b507J170K640K135n82j939r83j63l48l75l7l22m36q90J51J534J48j065
835078a869m75m1K72j62j476o25J089K227J835l98o43R9R10J429J332K202J321
$$ plain form
835781 7027 6164 4212 2087 101 -137 2322 4261 4174 3637 3554 4446 4894 3748 3051 2328 1940 2851 2387
836525 2387 1614 1954 2703 3431 2482 1163 1286 193 -886 -335 -159 -293 -629 164 746 1083 1180 547
837269 547 743 1135 723 789 959 818 416 -146 -1325 -1787 -2244 -3051 -3489 -3950 -4189 -2905 -2627 -3877 -4330
838054 -4330 -3856 -2451 -1149 -186 27 -625 -636 90 1137 737 -1076 -1172 112 513 674 1913 2807 3058
838797 3058 4077 4651 3080 1080 388 420 878 1634 1439 1750 3202 3741 2018 704 671 429 727 1673
839541 1673 2660 3257 3929 4365 5278 5475 4440 3535 2036 -667 -2657 -2878 -1989 -1836 -1186 158 -251
840244 -251 -1872 -2239 -1985 -3337 -5346 -5906 -5075 -3931 -3896 -5524 -7699 -7360 -5501 -5123 -5871 -6291 -4131
840946 -4131 -1425 386 1373 616 -557 -205 1420 2710 3722 3516 1956 1107 517 -968 -2392 -3056
$$ packed form
835781G027q63j952k125j986k38K459J939q7n37q3Q92M48j146o97p23l88R11m64
836525B387p73L40P49P28r49j319J23j093j079N51J76j34l36P93N82L37R7o33
837269E47J96L92m12O6J70j41m02n62j179m62m57q07m38m61k39J284K78j250m53
838054d330M74J405J302R63K13o52j1P26J047m00j813r6J284M01J61J239Q94K51
838797C058J019N74j571k000o92L2M58P56j95L11J452N39j723j314l3k42K98R46
839541A673R87N97O72M36R13J97j035r05j499k703j990k21Q89J53O50J344m09
840244b51j621l67K54j352k009n60Q31J144L5j628k175L39J859L78p48m20K160
840946d131K706J811R87p57j173L52J625J290J012k06j560q49n90j485j424o64
$$ plain form
841607 -3056 -2738 -781 1069 1866 1768 2213 1419 141 -129 -920 -2232 -3097 -3495 -3751 -4124 -3491 -2728 -3177
842351 -3177 -4493 -5429 -6024 -6924 -6641 -4313 -1743 -196 -13 -674 -2006 -2366 -1214 222 2079 4601
843012 4601 5866 4704 4508 5294 4815 2504 1290 1732 2109 2844 4452 4588 4135 2764 217 -1453
843674 -1453 -2863 -3700 -4025 -4985 -5933 -5762 -5047 -3803 -2681 -1928 -415 839 2314 3582 3287 2326 1368
844376 1368 1040 415 -414 8 1701 3400 4256 3527 1798 -494 -2389 -3313 -4429 -5074 -4450 -4378 -4255
845079 -4255 -3777 -3601 -3669 -3148 -2805 -2512 -2014 -1838 -3220 -2618 -339 1135 2446 3441 3326 1735 -57
845781 -57 -687 -1136 -287 1109 2974 2694 1018 325 -169 -925 -1437 -1966 -1778 -2201 -2390 -1484 -2191 -3549
846525 -3549 -3241 -1651 -300 78 123 1043 3291 5078 5260 4009 2989 2823 2607 2172 1787 1442 1899
$$ packed form
841607c056L18J957J850P97r8M45p94j278k70p91j312q65l98k56l73O33P63m49
842351c177j316r36n95r00K83K328K570J547J83o61j332l60J152J436J857K522
843012D601J265j162j96P86m79k311j214M42L77P35J608J36m53j371k547j670
843674a453j410q37l25r60r48J71P15J244J122P53J513J254J475J268k95r61r58
844376A368l28o25q29M22J693J699Q56p29j729k292j895r24j116o45O24P2J23
845079d255M78J76o8N21L43K93M98J76j382O02K279J474J311R95j15j591j792
845781e7o30m49Q49J396J865k80j676o93m94p56n12n29J88m23j89R06p07j358
846525c549L08J590J351L78M5R20K248J787J82j251j020j66k16m35l85l45M57
$$ plain form
847227 1899 2655 2264 1912 1775 110 -1531 -1604 -117 1356 2825 3377 3770 4470 3552 2265 2048 1843
847930 1843 573 115 1860 3343 3218 1612 1408 2958 4133 3909 3145 2306 1881 684 -1212 -2648
848591 -2648 -3365 -2673 -705 1782 2233 810 77 392 -368 -1204 -896 187 -476 -1823 -2769 -2916 -1991
849293 -1991 -931 -932 -1428 -845 582 804 -469 -1642 -2650 -2345 -853 75 -343 167 350 -1221 -3589
849996 -3589 -4845 -5383 -4787 -3712 -3557 -3129 -1364 1589 2858 1531 596 1450 1412 93 -1303 -1513 -156
850698 -156 1208 1639 1310 1905 3485 5328 5113 3745 1968 1457 2293 3871 4948 4251 3122 2866 2089
851401 2089 1478 1617 1914 1318 -361 -1652 -2389 -2019 -1343 -1729 -2530 -4331 -6048 -5526 -4408 -4665 -5261
852103 -5261 -5741 -4645 -3248 -2363 -836 -670 -2336 -3793 -5227 -6242 -4483 -2146 -2264 -3112 -3327 -1632
$$ packed form
847227A899P56l91l52j37j665j641p3J487J473J469N52L93P00r18j287k17k05
847930A843j270m58J745J483j25j606k04J550J175k24p64q39m25j197j896j436
848591b648p17O92J968K487M51j423p33L15p60q36L08J083o63j347r46j47R25
849293a991J060jm96N83J427K22j273j173j008L05J492R28m18N10J83j571k368
849996c589j256n38N96J075J55M28J765K953J269j327r35Q54l8j319j396k10J357
850698a56J364M31l29N95J580J843k15j368j777n11Q36J578J077o97j129k56p77
851401B089o11J39K97n96j679j291p37L70O76l86q01j801j717N22J118k57n96
852103e261m80J096J397Q85J527J66j666j457j434j015J759K337j18q48k15J695
$$ plain form
852765 -1632 1230 3224 3585 2831 2014 2732 2266 26 -516 835 2319 3167 1952 -796 -1891 -2260
853425 -2260 -2666 -2352 -1496 -995 -885 161 1043 2879 4615 4185 2812 2212 1281 1034 1038 1796 2864 3088
854170 3088 2645 514 -2467 -3995 -4821 -5378 -4296 -3717 -4333 -3980 -2302 -1163 -845 -1587 -3032 -3347 -3148
854872 -3148 -3336 -3619 -3715 -3283 -3303 -1846 318 2353 2923 1643 1200 1600 1145 -117 -561 133 1512 2219
855616 2219 2955 3561 4434 4802 4316 2751 1028 168 529 1700 2016 1729 2260 2779 1406 190 1101
856318 1101 2535 2973 2961 2243 1777 2012 2144 1092 -844 -1146 691 1656 1013 -1475 -3714 -4470 -4312
857021 -4312 -3395 -3003 -3664 -3268 -1200 1079 951 92 280 1263 2753 3620 3501 4257 5848 5385 2720
857723 2720 725 -325 92 1601 2975 4118 4138 4243 3824 3352 2677 1857 182 -1573 -2456 -1950 -893
$$ packed form
852765a632K862J994L61p54q17P18m66k240n42J351J484Q48j215k748j095l69
853425b260m06L14Q56N01J10J046Q82J836J736m30j373o00r31k47MP58J068K24
854170C088m43k131k981j528q26n57J082N79o16L53J678J139L18p42j445l15J99
854872c148j88k83r6M32k0J457K164K035N70j280m43M00m55j262m44O94J379P07
855616B219P36O06Q73L68m86j565j723q60L61J171L16k87N31N19j373j216R11
856318A101J434M38j2p18m66K35J32j052j936l02J837R65o43k488k239p56J58
857021d312R17L92o61L96K068K279j28q59J88R83J490Q67j19P56J591m63k665
857723B720j995j050M17J509J374J143K0J05m19m72o75q20j675j755q83N06J057
$$ plain form
858426 -893 -586 -1006 -2340 -3072 -3612 -4150 -3803 -2567 -1142 -654 499 2374 3901 5267 5268 4049 2250
859128 2250 748 60 -143 -1095 -2302 -2699 -2748 -2274 -1858 -1492 -772 -829 -1399 -1009 769 2513 3466 3548 4066
859913 4066 5121 4756 2317 -77 -751 -85 960 2255 3132 2435 1346 668 290 895 1299 1840 1309
860616 1309 -918 -3152 -2437 -36 857 1615 2220 2066 1827 2190 2781 2395 925 317 -384 -753 -15 -331
861359 -331 -2180 -3249 -1112 603 -599 -2393 -3546 -4254 -3315 -1747 429 2903 3455 1639 477
861980 477 1025 1340 638 315 1346 1641 1748 1564 39 718 3618 5774 5502 5304 5972 6240 5841 5458
862723 5458 3610 2629 1614 646 547 435 -23 338 1526 1891 737 -1671 -2356 -2584 -2117 290 1468
863426 1468 2122 2834 2754 3203 3326 2510 1299 154 176 -227 -1983 -3588 -4822 -5934 -6029 -5360 -4062 -2053
$$ packed form
858426h93L07m20j334p32n40n38L47J236J425M88J153J875J527J366Jj219j799
859128B250j502o88k03r52j207l97m9M74M16L66P20n7n70L90J778J744R53Q2N18
859913D066J055l65k439k394o74O66J045J295Q77o97j089o78l78O05M04N41n31
860616A309k227k234P15K401Q93P58O05j54k39L63N91l86j470o08p01l69P38l16
861359c31j849j069K137J715j202j794j153p08R39J568K176K474N52j816j162
861980D77N48L15p02l23J031K95J07j84j525O79K900K156k72j98O68K68l99l83
862723E458j848r81j015r68r9j12m58L61J188L65j154k408o85k28M67K407J178
863426A468O54P12q0M49J23q16j211j145K2m03j756j605j234j112r5O69J298K009
$$ plain form
864169 -2053 338 3169 4828 4121 3231 2513 2837 2905 2419 1092 -1570 -3084 -2562 -1073 883 97 -2359
864872 -2359 -2788 -1832 -1121 -1353 -1335 356 2613 3039 1436 347 99 -117 1087 2799 1627 -826 -2479
865574 -2479 -4313 -4982 -4934 -3530 -2624 -3313 -4177 -5039 -5313 -4803 -2266 470 348 -575 -2231 -2889 -1169
866277 -1169 1866 4198 4668 5121 5542 4851 3435 2623 3037 3882 3660 1595 -937 -2098 -2108 -2235 -2767
866979 -2767 -2889 -2199 -738 1384 2120 950 -1302 -1739 -841 469 2445 4552 5338 4083 2591 1898
867641 1898 2543 3195 2396 336 -1863 -3024 -2662 -1459 63 775 779 49 -869 -1251 -1747 -2715 -3415 -3813
868384 -3813 -2437 -423 521 -714 -1655 -1978 -2311 -3117 -3940 -3431 -1370 -1012 -46 1788 2490 2233 2353
869087 2353 2296 1868 1619 2500 3837 4125 3413 2683 2101 798 558 877 83 -313 -1130 -1993 -1172 1085
$$ packed form
864169b053K391K831J659p07q90p18L24O8m86j327k662j514N22J489J956p86k456
864872b359m29R56P11k32J8J691K257M26j603j089k48k16J204J712j172k453j653
865574b479j834o69M8J404R06o89q64q62k74N10K537K736j22r23j656o58J720
866277a169L035K332M70M53M21o91j416q12M14Q45k22k065k532j161j0j27n32
866979b767j22O90J461K122P36j170k252m37Q98J310J976K107P86j255j492o93
867641A898O45O52p99k060k199j161L62J203J522P12Mp30r18l82m96r68p00l98
868384c813J376K014R44j235r41l23l33q06q23N09K061L58R66J834P02k57J20
869087B353n7m28k49Q81J337K88p12p30n82j303k40L19p94l96q17q63Q21K257
$$ plain form
869830 1085 2583 2523 1465 863 1306 1047 675 1168 1969 2856 3661 4597 4914 4732 4047 4670 4980 4250 2202
870616 2202 -600 -2974 -4095 -3492 -1969 -898 -282 872 567 -1860 -4225 -4376 -3594 -2726 -2713 -2595 585
871318 585 4720 5554 3508 1025 -1009 -2921 -3606 -2794 -1983 -1059 671 3406 4682 4132 3010 2117
871979 2117 2070 3195 3745 3601 3857 5441 5493 4301 4055 3979 4359 5800 5068 2726 1343 1169 794 -506
872723 -506 -3420 -5437 -6044 -6213 -4875 -3697 -2564 -928 321 1180 506 -1666 -3501 -4926 -4793 -4305
873384 -4305 -3495 -2998 -3544 -4110 -3340 -2509 -2949 -3358 -3678 -4034 -3460 -1773 -555 -1147 -1882 -1488 -1801 -2600
874128 -2600 -2211 -438 1577 2878 3721 3475 2557 2295 2028 1596 668 -173 576 1855 2042 1014 -527
874831 -527 -989 -727 -1764 -2856 -2602 -1091 18 540 990 1565 249 -1181 -1122 -754 -1944 -4566 -5727
$$ packed form
869830A085J498o0j058o02M43k59l72M93Q01Q87Q05R36L17j82o85O23L10p30k048
870616B202k802k374j121O03J523J071O16J154l05k427k365j51P82Q68J3J18L180
871318E85M135Q34k046k483k034j912o85Q12Q11R24J730K735J276n50j122q93
871979B117m7J125N50j44K56J584N2j192k46p6L80J441p32k342j383j74l75j300
872723e06k914k017o07j69J338J178J133J636J249Q59o74k172j835j425J33M88
873384d305Q10M97n46n66P70Q31m40m09l20l56N74J687J218n92p35L94l13p99
874128b600L89J773K015J301Q43k46r18k62k67m32r28q41P49J279J87j028j541
874831e27m62K62j037j092K54J511J109N22M50N75j316j430N9L68j190k622j161
$$ plain form
875533 -5727 -4646 -2957 -2088 -1654 -869 110 910 2331 3492 3264 2392 2837 2604 1457 1353 2190 2042
876235 2042 1027 -311 -872 -548 -571 -1257 -2487 -3852 -5662 -6234 -4601 -1860 286 693 -1182 -1919
876897 -1919 -1534 -1078 -446 1106 1854 1758 1088 -516 -524 937 1638 952 89 -436 -94 919 931 591 521
877682 521 1508 2442 2192 933 226 8 -328 -946 -1281 -598 1717 4136 5379 4093 3171 3297 2344 1103
878426 1103 403 -856 -2453 -2780 -3315 -4317 -4001 -2622 -814 -272 382 2795 4077 2504 1467 1570
879087 1570 1558 1942 2124 1232 -53 -1753 -2970 -3933 -4925 -4562 -2612 -1025 1250 2016 300 -1630 -1971
879789 -1971 -120 1321 1704 950 -739 -2100 -3364 -4049 -4808 -5659 -5166 -3608 -1966 -1468 -1882 -1579 -423
880492 -423 -148 -582 -1465 -2001 -1572 -3086 -4305 -3752 -1501 984 1669 1391 2304 3391 3847 4401 3565 1339
$$ packed form
875533e727J081J689Q69M34P85R79Q00J421J161k28q72M45k33j147j04Q37j48
876235B042j015j338n61L24k3o86j230j365j810n72J633K741K146M07j875p37
876897a919L85M56O32J552P48r6o70j604qJ461P01o86q63n25L42J013J2l40p0
877682E21R87R34k50j259p07k18l36o18l35O83K315K419J243j286r22J26r53j241
878426A103p00j259j597l27n35j002L16J379J808N42O54K413J282j573j037J03
879087A570j2L84J82q92j285j700j217r63r92L63J950J587K275P66j716j930l41
879789a971J851J441L83p54j689j361j264o85p59q51M93J558J642M98m14L03J156
880492d23K75m34q83n36M29j514j219N53K251K485O85k78R13J087M56N54q36k226
$$ plain form
881236 1339 -492 -1574 -1313 -1064 -1714 -2201 -2946 -4066 -4188 -3272 -1984 -211 1292 656 -2003 -2628 -1379
881938 -1379 252 507 -1502 -3362 -3021 -1152 387 1310 555 -924 -729 63 948 856 9 120 1461
882641 1461 2133 2412 2841 3262 3647 3192 2681 1112 -2442 -5657 -6323 -4808 -2889 -1220 -15 1454
883301 1454 4897 7846 6294 2641 -71 -1060 -1037 -1668 -1946 -994 149 432 -301 -601 -596 -937 -149 53
884045 53 -1237 -1418 169 1933 2970 2706 1530 924 1452 754 -90 -1384 -2352 -1231 379 1814 2248
884748 2248 2786 3345 3215 1485 2212 4479 4961 6255 8350 9022 7190 5737 4536 2767 870 -490
885409 -490 45 -412 -1548 -1846 -1475 -721 -572 -1586 -2049 -2330 -2924 -3211 -2333 -957 24 587 1061 576
886153 576 -549 -492 -272 -768 -1603 -884 -782 -3138 -4720 -4336 -3252 -3271 -4479 -4396 -2465 -1637 -1313 -192
$$ packed form
881236A339j831j082K61K49o50m87p45j120j22R16J288J773J503o36k659o25J249
881938a379J631K55k009j860L41J869J539R23p55j479J95P92Q85r2q47J11J341
882641A461O72K79M29M21L85m55n11j569l554l215o66J515J919J669J205J469
883301A454L443K949j552l653k712r89K3o31k78R52J143K83p33l00Nl41P88K02
884045E3j290j81J587J764J037k64j176o06N28o98q44j294r68J121J610J435M34
884748B248N38N59j30j730P27K267M82J294K095O72j832j453j201j769j897j360
885409d90N35m57j136k98L71P54J49j014m63k81n94k87Q78J376R81N63M74m85
886153E76j125N7K20m96q35P19J02k356j582L84J084j9j208Q3J931Q28L24J121
$$ plain form
886897 -192 -74 -1222 -1603 -1690 -2658 -4570 -4997 -3228 -2296 -3170 -3169 -1447 -213 47 146 -371 -179 1349 3162
887682 3162 3584 1455 -1215 -3230 -2890 207 3172 3934 3337 2997 3117 3580 2516 -307 -2236 -2091
888343 -2091 -624 1931 4118 4563 3745 2748 2852 2571 949 171 -95 -409 20 -1086 -2653 -2740 -765
889046 -765 2654 4781 4696 3471 1596 -414 -1216 -1722 -1885 -1814 -1509 -1461 -948 2455 3829 2492 1062
889748 1062 4 -132 1188 2910 3655 3387 3710 4776 5296 4403 3535 2761 2276 2773 2280 -229 -1361
890451 -1361 -1081 -1121 -613 -571 220 1870 3542 4010 3607 3737 3002 935 519 1541 2678 2212 1677 1396
891194 1396 181 -414 94 629 -563 -3114 -3745 -2276 -1149 -91 824 604 -982 -2670 -2896 -3091
891855 -3091 -3667 -4212 -4642 -6575 -7344 -5274 -1383 856 652 895 1094 867 1523 1429 -99 -1230 -1241 -710
$$ packed form
886897a92J18j148l81q7r68j912m27J769R32q74JJ722J234K60R9n17J92J528J813
887682C162M22k129k670k015L40L097K965P62n97l40J20M63j064k823j929J45
888343b091J467K555K187M45q18r97J04k81j622p78k66l14M29j106j567q7J975
889046g65L419K127q5j225j875k010q02n06j63P1L05M8N13L403J374j337j430
889748A062j058j36J320J722P45k68L23J066N20q93q68p74m85M97m93k509j132
890451a361K80m0N08M2P91J650J672M68m03J30p35k067m16J022J137m66n35k81
891194A396j215n95N08N35j192k551o31J469J127J058R15k20j586j688k26j95
891855c091n76n45m30j933p69K070L891K239k04K43J99k27O56r4j528j131j1N31
$$ plain form
892599 -710 615 1656 706 -81 663 2364 2233 104 -1160 495 2787 4012 3162 1437 631 2216
893260 2216 4711 5292 4423 4562 4094 3555 3494 3100 3051 2448 1584 1782 1617 1058 1412 1346 1357 608 -493 -1591
894086 -1591 -1769 18 2364 2761 1509 1445 2301 2197 1681 2119 1879 658 -1325 -3180 -3931 -3437 -2943
894789 -2943 -2444 -2252 -1290 31 1131 858 -1145 -2817 -3163 -2450 -2796 -3263 -2889 -1649 -1785 -3260 -4484
895491 -4484 -4050 -3881 -5282 -4859 -3079 -2353 -1449 -566 1488 2359 1213 665 1724 2780 2961 2288 2287 3523
896236 3523 4946 6389 6589 4020 1137 536 1432 900 -509 -1176 -99 2364 4145 3055 1242 802
896896 802 1552 1370 806 51 -1694 -2249 -2386 -4160 -6502 -5873 -4188 -2279 -311 1697 3910 5841
897558 5841 6645 6993 7524 7006 4023 543 -1509 -2820 -4851 -6132 -5839 -6386 -6985 -7052 -6573 -3915 -753
$$ packed form
892599g10J325J041r50p87P44J701j31k129j264J655K292J225q50j725q06J585
893260B216K495N81q69J39m68n39o1l94m9o03q64J98j65n59L54o6J1p49j101j098
894086a591j78J787K346L97j252o4Q56j04n16M38k40j221j983j855p51M94M94
894789b943M99J92R62J321J100k73k003j672l46P13l46m67L74J240j36j475j224
895491d484M34J69j401M23J780P26R04Q83K054Q71j146n48J059J056J81o73jJ236
896236C523J423J443K00k569k883o01Q96n32j409o67J077K463J781j090j813m40
896896H02P50j82n64p55j745n55j37j774k342O29J685J909J968K008K213J931
897558E841Q04L48N31n18k983l480k052j311k031j281K93n47n99o7M79K658L162
$$ plain form
898260 -753 2425 5191 5632 4113 2437 2133 2471 2074 1393 1385 3254 5832 6190 6066 6140 6273 6945 5886
899004 5886 3524 1777 1955 2618 2500 2291 1642 1647 1455 532 -365 -788 -1655 -2879 -2896 -1784 -609 -960
899748 -960 -614 1207 3172 4474 4240 2350 1374 1635 2391 2030 870 415 717 701 -453 -1376 -2417
900450 -2417 -4165 -5446 -6117 -5609 -5538 -5857 -6505 -6046 -4310 -1954 -169 814 1924 1838 2282 2957 4619
901153 4619 6871 6700 4414 2594 2945 2454 1003 874 1983 1240 -257 -520 -1007 -1415 -1527 -1709 -2485
901855 -2485 -2601 -2254 -2388 -3433 -3750 -2677 -596 789 514 -47 513 2621 3736 3521 3250 2887 2404
902558 2404 1509 761 359 -370 -703 1206 2878 1672 333 328 990 3135 4526 6065 6861 4307 2486
903260 2486 3230 3131 1204 -458 -1220 -1748 -1497 -1113 -383 -303 -109 541 606 1756 3074 2925 2635 2700 2483
$$ packed form
898260g53L178K766M41j519j676l04L38l97o81qJ869K578L58j24P4J33O72j059
899004E886k362j747J78O63j18k09o49Nj92r23q97m23q67j224j7J112J175l51
899748i60L46J821J965J302k34j890r76K61P56l61j160m55L02j6j154r23j041
900450b417j748j281o71N08P1l19o48M59J736K356J785R83J110q6M44O75J662
901153D619K252j71k286j820L51m91j451j29J109p43j497k63m87m08j12j82p76
901855b485j16L47j34j045l17J073K081J385k75n61N60K108J115k15k71l63m83
902558B404q95p48m02p29l33J909J672j206j339nO62K145J391J539P96k554j821
903260B486P44r9j927j662p62n28K51L84P30Q0J94O50O5J150J318j49k90O5k17
$$ plain form
904045 2483 456 -1739 -3105 -2843 -2560 -3330 -5046 -5592 -4498 -2720 -2585 -2538 -2377 -1635 257 2066 3241
904748 3241 1394 -1388 -2844 -3217 -3254 -4255 -4873 -4623 -4019 -2309 -569 796 1311 1385 2044 2008 1514 375
905492 375 -845 -1649 -2019 -3591 -4452 -3218 -2768 -3714 -3834 -2671 -88 1473 82 -1129 -1106 -1560 -2149
906194 -2149 -2221 -2297 -1589 -944 -1352 -1676 -1061 743 733 -1301 -3433 -4715 -6177 -7413 -6732 -5924 -4674 -3298
906938 -3298 -1939 -25 1230 1334 682 -641 -1482 -1534 -922 -1106 -1736 -1024 1035 2571 3775 3068 940
907641 940 -310 197 816 2087 3240 3328 1748 592 -560 -1522 -2697 -4197 -4517 -3150 -1548 -1895
908302 -1895 -1875 -1259 -552 319 1402 2632 1660 -1389 -3046 -3254 -1868 -1337 -2163 -1858 78 -475 -3496
909004 -3496 -4965 -4160 -2881 -1579 -1152 -1230 -720 288 645 -213 -1554 -2647 -2852 -1154 1090 2603
$$ packed form
904045B483k027k195j366K62K83p70j716n46J094J778J35M7J61P42J892J809J175
904748C241j847k782j456l73l7j001o18K50O04J710J740J365N15P4O59l6m94j139
905492C75j220q04l70j572q61J234M50r46j20J163K583J561j391j211K3m54n89
906194b149p2p6P08O45m08l24O15J804j0k034k132j282j462j236O81Q08J250J376
906938c298J359J914J255J04o52j323q41n2O12j84o30P12K059J536J204p07k128
907641I40j250N07O19J271J153Q8j580j156j152r62j175j500l20J367J602l47
908302a895K0O16P07Q71J083J230r72l049j657k08J386N31q26L05J936n53l021
909004c496j469Q05J279J302M27p8N10J008L57q58j341j093k05J698K244J513
$$ plain form
909665 2603 2488 2241 1415 774 1041 2098 2609 2402 1687 1405 161 -1086 -2019 -1302 -294 -170 -79 243
910409 243 -267 -1453 -2095 -2563 -2529 -2878 -3696 -3726 -2662 -893 1057 628 169 669 623 -162 5 1468 1186
911194 1186 -297 -1593 -3065 -3644 -2958 -1954 -79 1051 -155 -1500 -2417 -4000 -5274 -4158 -2950
911814 -2950 -571 1945 2614 1332 373 -52 -1089 -2129 -3676 -5107 -5146 -4686 -2536 317 1941 1911
912475 1911 776 -1634 -4009 -4689 -4461 -4017 -2243 -801 23 7 -71 -252 133 563 -30 -1103 -1758 -881
913219 -881 668 1825 1506 -1032 -3479 -3154 -1007 -62 1428 3765 4611 4184 3766 3255 836 -2158
913880 -2158 -3458 -2855 -1238 -2484 -2520 -1583 -2127 -2483 -2933 -3361 -2793 -2508 -1953 -1666 -1398 -1641 -2092 -2291
914624 -2291 -2430 -2067 -2392 -2976 -2390 -1651 -1084 -895 -733 -1337 -1222 -156 0 -3 27 -19 -504 -542 -664 -250
$$ packed form
909665B603j15k47q26o41K67J057N11k07p15k82j244j247r33P17J008J24R1L22
910409B43n10j186o42m68L4l49q18l0J064J769J950m29m59N00m6p85J67J463k82
911194A186j483j296j472n79O86J004J875J130j206j345r17j583j274J116J208
911814b950K379K516O69j282r59m25j037j040j547j431l9M60K150K853J624l0
912475A911j135k410k375o80K28M44J774J442Q24j6p8j81L85M30n93j073o55Q77
913219h81J549J157l19k538k447L25K147R45J490K337Q46m27m18n11k419k994
913880b158j300O03J617j246l6R37n44l56m50m28N68K85N55K87K68k43m51j99
914624b291j39L63l25n84N86P39N67J89J62o04J15J066J56lL0m6m85l8j22M14
$$ plain form
915450 -250 851 1544 2114 2820 1235 -1549 -2985 -3059 -2923 -2537 -2166 -2383 -3683 -4291 -3255 -2297 -1927 -1349
916194 -1349 -557 -734 -1488 -2031 -2859 -1818 272 1943 2182 2636 4437 4709 2642 43 -335 513 1910
916896 1910 3820 4688 4190 3487 2894 2433 2275 2602 2215 1894 2845 4234 4252 2836 1507 665 -698 -2533
917640 -2533 -2557 -325 1997 1456 -111 77 1196 1591 1157 -88 -1460 -523 2076 3829 3798 1795 224
918343 224 -1157 -2293 -2483 -2851 -2456 -2236 -990 1408 2751 2783 2543 1886 1246 1778 2208 1678 44 -1092
919087 -1092 -1891 -2724 -3582 -2577 553 3994 4549 2463 740 -1059 -1912 -1958 -1690 -876 779 659 -1238
919789 -1238 -2306 -1686 665 3921 4842 2894 585 -1258 -2647 -3822 -3871 -3412 -3283 -3367 -4076 -4953 -5724
920492 -5724 -6122 -4771 -3270 -2681 -3054 -4244 -4623 -4579 -4479 -3884 -3085 -3248 -2465 -2246 -2472 -2567 -2719 -3186 -3860
$$ packed form
915450b50J101O93N70P06j585k784j436p4J36L86L71k17j300o08J036R58L70N78
916194a349P92j77p54n43q28J041K090J671K39M54J801K72k067k599l78Q48J397
916896A910J910Q68m98p03n93m61j58L27l87l21R51J389J8j416j329q42j363j835
917640b533k4K232K322n41j567J88J119L95m34j245j372R37K599J753l1k003j571
918343B24j381j136j90l68L95K20J246K398J343L2k40o57o40N32M30n30j634j136
919087a092p99q33q58J005L130L441N55k086j723j799q53m6K68Q14J655j20j897
919789a238j068O20K351L256R21j948k309j843j389j175m9M59J29q4p09q77p71
920492e724l98J351J501N89l73j190l79M4J00N95P99j63P83K19k26r5j52m67o74
$$ plain form
921277 -3860 -3998 -3478 -2953 -1969 -660 203 -524 -932 43 1141 1557 288 -1473 -3986 -5715 -5192 -4859
921979 -4859 -5565 -5286 -3888 -3565 -3574 -3806 -5137 -6958 -6390 -3565 -1409 198 2047 3455 3669 2771 1307
922682 1307 -1201 -3573 -3947 -2952 -2246 -1917 -2499 -3460 -3432 -2856 -2674 -2076 -1093 -700 -806 -1710 -3552 -5358
923425 -5358 -6195 -5967 -4797 -4262 -4298 -3863 -4216 -4372 -4595 -4731 -3212 -899 -507 -1923 -3033 -3980 -4933 -6160
924169 -6160 -7184 -6717 -4937 -4374 -5361 -5473 -4028 -1819 190 867 709 1732 2304 -35 -2705 -3292
924830 -3292 -1466 1135 2574 2503 1206 -640 -2259 -3941 -4254 -3889 -3945 -3464 -2308 -1450 -2341 -3387 -4412
925533 -4412 -5392 -6064 -5592 -3458 -2281 -2256 -3001 -3993 -4005 -3266 -2359 -808 -1801 -3138 -3745 -3946 -2466 -1154
926277 -1154 -1620 -3070 -4206 -5927 -8312 -9504 -8927 -7721 -7235 -6311 -4799 -2735 -909 931 2303
$$ packed form
921277c860j38N20N25R84J309Q63p27m08R75J098M16j269j761k513j729N23L33
921979d859p06K79J398L23rk32j331j821N68K825K156J607J849J408K14q98j464
922682A307k508k372l74R95P06L29n82r61K8N76J82N98R83L93j06r04j842j806
923425e358q37K28J170N35l6M35l53j56k23j36J519K313L92j416j110r47r53j227
924169f160j024M67J780N63r87j12J445K209K009O77j58J023N72k339k670n87
924830c292J826K601J439p1j297j846j619j682l13L65n6M81J156Q58q91j046j025
925533d412r80o72M72K134J177K5p45r92j2P39R07J551r93j337o07k01J480J312
926277a154m66j450j136j721k385j192N77J206M86R24J512K064J826J840J372
$$ plain form
926897 2303 2570 1351 -144 -666 383 2358 4069 4115 2464 953 324 437 593 614 342 -1522 -2325
927599 -2325 -1907 -2435 -3529 -3114 -1584 -1863 -3254 -2935 -1957 -2348 -3987 -5186 -4764 -3717 -3483 -4019 -4059
928302 -4059 -4377 -4491 -3693 -4560 -4779 -3058 -1379 -948 108 1086 858 -43 106 2078 2819 1001 -1322
929004 -1322 -1003 -658 -1372 -3434 -5319 -5887 -5770 -5235 -6173 -6065 -3914 -2314 -1765 -1756 -2117 -4109 -5189 -4281
929748 -4281 -3753 -3757 -4256 -3744 -3517 -3265 -2161 -160 1187 1498 273 -504 -696 -985 -1131 -671 -741 -1745
930492 -1745 -1214 37 604 -547 -2430 -3727 -4370 -4178 -3160 -1882 -1519 -961 -128 -914 -2181 -2998 -4342
931194 -4342 -7090 -8347 -6993 -6107 -5480 -5172 -4916 -4102 -4056 -4629 -4763 -4901 -5527 -6373 -6517 -5323 -5185 -3646
931938 -3646 314 2426 2401 980 626 464 -1422 -2574 -2199 -1913 -2878 -3182 -2684 -2573 -2974 -3721 -4367 -4395
$$ packed form
926897B303K67j219j495n22J049J975J711M6j651j511o29J13J56K1k72j864q03
927599b325M18n28j094M15J530k79j391L19R78l91j639j199M22J047K34n36m0
928302d059l18j14P98q67k19J721J679M31J056R78k28r01J49J972P41j818k323
929004a322L19L45p14k062j885n68J17N35r38J08K151J600N49Rl61j992j080R08
929748d281N28mm99N12K27K52J104K001J347L11j225p77j92k89j46M60p0j004
930492a745N31J251N67j151j883j297o43J92J018J278L63N58Q33p86j267q17j344
931194d342k748j257J354Q86O27L08K56Q14M6n73j34j38o26q46j44J194J38J539
931938c646L960K112k5j421l54j62j886j152L75K86r65l04M98J11m01p47o46k8
$$ plain form
932682 -4395 -4235 -5230 -6529 -6995 -6179 -5850 -6519 -7127 -8257 -8870 -8078 -6289 -3533 -1156 -255 -1264 -1373
933384 -1373 370 1685 303 -2718 -5043 -5718 -4357 -2685 -2246 -2667 -2484 -1898 -2146 -1433 -839 -1673 -2392
934087 -2392 -2851 -4227 -4975 -4476 -6215 -9611 -10168 -9063 -9058 -8488 -6156 -4742 -3686 -3192 -3115 -2811 -3187 -3648
934831 -3648 -3065 -1887 -1379 -2384 -4785 -6098 -7303 -6565 -4848 -3427 -2515 -2828 -2207 -675 -1222 -3375
935492 -3375 -3616 -2838 -1878 -1262 -102 890 -222 -1774 -1735 -2394 -3936 -5320 -7007 -7874 -8413 -8871 -9253
936194 -9253 -9507 -8303 -6986 -6646 -7769 -11139 -13585 -14374 -14427 -14505 -14706 -14440 -14203 -13270 -10924 -6144 3328
936897 3328 24598 70152 128636 142377 119751 97334 80135 67324 58851 51985 44985 38468
937393 38468 33629 30631 27379 24221 21425 19876 19092 18288 17793 15857 12012 10273 10325 10484 9439 8222
$$ packed form
932682d395J60r95j299m66Q16L29o69o08j130o13P92J789K756K377R01j009j09
933384a373J743J315j382l021k325o75J361J672M39m21J83N86k48P13N94q34p19
934087b392m59j376p48M99j739l396n57J105NN70K332J414J056M94P7L04l76m61
934831c648N83J178N08j005k401j313j205P38J717J421R12l13O21J532n47k153
935492c375k41P78R60O16J160R92j112j552L9o59j542j384j687q67n39m58l82
936194i253k54J204J317L40j123l370k446p89n3p8k01K66K37R33K346M780R472
936897C328K1270M5554N8484J3741k2626k2417j7199j2811q473o866p000o517
937393C8468m839k998l252l158k796j549p84q04m95j936l845j739N2J59j045j217
$$ plain form
938054 8222 6643 5240 5186 5654 6220 5835 5346 5059 3447 3213 2729 2058 2971 3905 4960 5028 4739 4545
938798 4545 3556 3654 4885 6004 6412 6916 7553 7209 5373 3147 2454 2773 3795 3949 4222 5202 5058 4127
939541 4127 4245 4771 5720 7082 6540 3861 3209 3935 3746 3077 4225 5430 6280 5845 4940 6257 8468
940244 8468 8419 7000 4353 4089 4988 4785 4422 4882 6050 7783 8079 5866 3238 778 -862 10 1797
940946 1797 3523 3560 1156 -1716 -3742 -2975 -1488 129 1856 3268 4273 4331 2986 1043 742 2226
941608 2226 3645 2554 180 -2204 -4011 -2935 -761 1340 3472 5729 7736 7872 6539 5974 6515
942227 6515 6846 5442 2812 -384 -2269 -1386 1111 3119 4043 4051 2622 933 -134 -1120 -2130 -1916
942889 -1916 -352 1259 3416 5070 5336 4612 2260 -279 -1903 -798 1105 1543 1146 2486 4003
$$ packed form
938054H222j579j403n4M68N66l85m89k87j612k34m84o71R13R34J055O8k89j94
938798D545r89R8J231J119M08N04O37l44j836k226o93L19J022J54K73R80j44r31
939541D127J18N26R49J362n42k679o52P26j89o69J148J205Q50m35r05J317K211
940244H468m9j419k647k64Q99k03l63M60J168J733K96k213k628k460j640Q72J787
940946A797J726L7k404k872k026P67J487J617J727J412J005N8j345j943l01J484
941608B226J419j091k374k384j807J076K174K101K132K257K007J36j333n65N41
942227F515L31j404k630l196j885Q83K497K008R24Qj429j689j067r86j010K14
942889a916J564J611K157J654K66p24k352k539j624J105J903M38l97J340J517
$$ plain form
943508 4003 4682 4321 2880 1605 950 1184 2294 2377 2042 2296 2870 3238 3148 2771 2633 2956 5076 6751
944252 6751 7444 7147 6034 5479 5075 4206 3238 1960 105 -1904 -2565 -1746 -624 376 552 -1226 -3320
944954 -3320 -3371 -2087 -1264 -1415 -1179 698 2992 3016 2366 1525 -175 -438 642 1185 1081 600 736 1048
945698 1048 5 -1882 -2700 -1521 37 -135 -1376 -1974 -1443 -704 -269 279 892 423 -293 421 913
946401 913 976 1986 2976 2001 -376 -1323 -1082 -1580 -2496 -3289 -4009 -4919 -3663 -2235 -2416 -3119 -3129 -2898 -3158
947186 -3158 -2238 -1072 -484 213 1623 3039 3494 2871 1234 1236 3053 5106 5386 3865 1628 770 1181
947889 1181 -519 -2658 -1791 642 1822 1010 394 1532 2353 836 -1196 -1863 -1563 -3039 -5073 -5680
948550 -5680 -4383 -1752 -364 -769 -2004 -2192 -2128 -1696 -1502 -471 1776 2812 2442 1411 -496 -2375
$$ packed form
943508D003O79l61j441j275o55K34J110Q3l35K54N74L68r0l77j38L23K120J675
944252F751O93k97j113n55m04q69r68j278j855k009o61Q19J122J000J76j778k094
944954c320n1J284Q23j51K36J877K294K4o50q41j700k63J080N43j04m81J36L12
945698A048j043j887q18J179J558j72j241n98N31P39M35N48O13m69p16P14M92
946401I13O3J010R90r75k377r47K41m98r16p93p20r10J256J428j81p03j0K31k60
947186c158R20J166N88O97J410J416M55o23j637KJ817K053K80j521k237q58M11
947889A181j700k139Q67K433J180q12o16J138Q21j517k032o67L00j476k034o07
948550e680J297K631J388m05j235j88O4M32J94J031K247J036l70j031j907j879
$$ plain form
949210 -2375 -1676 -485 -1411 -2709 -944 2009 2820 2357 962 1221 3359 5040 6371 6812 5773 3246
949872 3246 1635 1211 396 -1351 -3036 -4208 -6084 -7256 -5540 -4523 -5220 -4845 -2552 -705 630
950492 630 727 734 2067 3629 4436 4219 2892 574 -1739 -3154 -4022 -4246 -4220 -4537 -4784 -3262 -1424 -1282
951236 -1282 -2107 -2685 -1910 -78 1296 912 -267 -611 620 1875 2450 1967 1524 450 -191 -130 -120 149
951980 149 -351 -495 -1087 -2160 -4231 -5280 -4176 -2164 -902 471 233 -2007 -2721 -1254 -618 -1617
952640 -1617 -2510 -2142 -539 648 1838 2838 3047 2088 2006 2757 3178 1531 56 -237 -1341 -4510 -6792
953343 -6792 -7608 -7343 -6413 -5981 -5400 -4182 -3106 -2819 -1757 -332 512 1259 1949 3456 4539 3893 3706
954045 3706 3338 1225 -1339 -2433 -2189 -1242 800 1725 1377 718 -546 -2351 -3081 -2653 -1812 -1244 -1431
$$ packed form
949210b375O99J191r26j298J765K953Q11m63j395K59K138J681J331M41j039k527
949872C246j611m24q15j747j685j172j876j172J716J017o97L75K293J847J335
950492F30R7PJ333J562Q07k17j327k318k313j415q68k24K6l17k47J522J838J42
951236a282q25n78P75J832J374l84j179l44J231J255N75m83m43j074o41O1J0K69
951980A49n00j44n92j073k071j049J104K012J262J373k38k240p14J467O36r99
952640a617q93L68J603J187J190J000K09r59q2P51M21j647j475k93j104l169k282
953343f792q16K65R30M32N81J218J076K87J062J425Q44P47O90J507J083o46j87
954045C706l68k113k564j094K44R47K042R25l48o59j264j805p30M28Q41N68j87
$$ plain form
954748 -1431 -1444 -282 135 -1218 -1636 -794 -395 -332 -703 -995 -1266 -2142 -2476 -1793 -1043 -1345 -1174 -687 -1577
955533 -1577 -1999 -1403 -505 -2744 -5765 -7171 -7077 -5541 -3964 -2385 -528 492 154 -509 -840 -248 704
956236 704 1231 2105 2195 1065 -1400 -3831 -4433 -2794 -805 1050 3265 4637 2618 229 -878 -69
956897 -69 259 -494 43 784 336 189 -220 -1126 -2443 -2060 -73 922 251 300 1135 1829 2575 3639 4959
957682 4959 5378 4929 4153 2958 1360 856 791 -1457 -3748 -4074 -3786 -3634 -4007 -4380 -4552 -4069 -3716 -3824
958425 -3824 -3256 -1841 -296 403 -564 -1544 -1795 -2463 -2985 -3354 -3097 -2735 -2655 -2307 -1837 -1231 -625 -1336 -2253
959211 -2253 -3026 -2892 -2093 -2147 -1203 400 253 59 56 -1422 -3190 -3152 -1643 474 2212 2627 1850 1116
959954 1116 121 -483 -1425 -1976 -436 983 2081 3325 3683 2391 2023 2691 2432 1784 1075 1083 878 -379
$$ packed form
954748a431j3J162M17j353m18Q42L99O3l71k92k71q76l34O83P50l02J71M87q90
955533a577m22N96Q98k239l021j406R4J536J577J579J857J020l38o63l31N92R52
956236G04N27Q74R0j130k465k431o02J639J989J855K215J372k019k389j107Q09
956897f9L28p53N37P41m48j47m09r06j317L83J987R95o71M9Q35O94P46J064J320
957682D959M19m49p76j195j598n04o5k248k291l26K88J52l73l73j72M83L53j08
958425c824N68J415J545O99r67r80k51o68n22l69K57L62Q0L48M70O06O06p11r17
959211b253p73J34P99n4R44J603j47j94lj478j768L8J509K117J738M15p77p34
959954A116r95o04r42n51J540J419J098J244L58j292l68O68k59o48p09Qk05j257
$$ plain form
960698 -379 -1148 -1166 -54 -298 -1983 -3412 -2969 -1422 -133 474 1512 2034 250 -2499 -3818 -4272 -3214
961401 -3214 -1922 -1425 -2058 -3655 -5991 -7423 -6708 -4647 -2183 -285 979 1145 732 -225 -2615 -3958
962062 -3958 -3895 -3807 -3783 -4648 -6709 -7418 -5711 -5074 -4525 -4057 -3906 -4190 -4862 -4910 -3640 -2462 -1940 -1861 -2115
962847 -2115 -3019 -4162 -4312 -3278 -3275 -4413 -4824 -4614 -4253 -3282 -1963 -310 87 -92 -311 -777 -310 -1599
963591 -1599 -3536 -2909 -1376 -252 576 1687 3140 3388 1922 -425 -1263 -491 30 -322 -666 -253 -209
964294 -209 -60 498 329 -1519 -1880 -1558 -2440 -3289 -2686 -1486 -461 -75 -758 -1532 -1409 -1379 -1237 -865 -175
965078 -175 930 1910 1170 -611 -1593 -715 185 534 -108 -1276 -3292 -4388 -5504 -7326 -7938 -6434 -3956
965781 -3956 -2047 -749 735 2310 3289 4458 6065 7764 7738 5433 2935 901 -396 -749 -1386 -2146
$$ packed form
960698c79p69j8J112k44j685j429M43J547J289O07J038N22j784k749j319m54J058
961401c214J292M97o33j597k336j432P15K061K464J898J264J66m13r57k390j343
962062c958O3Q8K4q65k061p09J707O37N49M68J51k84o72m8J270J178N22P9k54
962847b115r04j143j50J034Lj138m11K10L61R71J319J653L97j79k19m66M67j289
963591a599j937O27J533J124Q28J111J453K48j466k347q38P72N21l52l44M13M4
964294b09J49N58j69j848l61L22q82q49O03J200J025L86o83p74J23L0J42L72O90
965078a75J105R80p40j781r82Q78R00L49o42j168k016j096j116j822o12J504K478
965781c956J909J298J484J575R79J169J607J699k6k305k498k034j297l53o37p60
$$ plain form
966442 -2146 -2466 -2840 -2782 -2110 -1693 -2974 -4380 -3481 -1377 215 334 -281 -687 -203 55 586 1365 1594
967186 1594 120 -2141 -2425 -2839 -2540 -1681 -1599 -1841 -1229 41 1484 823 130 -178 485 1945 3065
967888 3065 3894 4307 2850 1030 -180 -961 -1543 -1920 -1879 -2628 -3890 -4092 -3847 -3466 -2744 -2622 -3276 -3717
968632 -3717 -5090 -6829 -7064 -5980 -3989 -102 3101 3744 1875 -131 -1227 -2236 -2671 -2404 -2815 -3737
969293 -3737 -2591 -1304 -1684 -1680 -729 317 745 1175 1457 939 787 841 1948 2631 2294 1453 543 383 -1219
970079 -1219 -3497 -4070 -3078 -2001 -2012 -2190 -918 792 4 -1867 -3908 -5122 -4364 -3483 -4206 -4677 -2922
970781 -2922 -2196 -2758 -2265 -2141 -1857 -1596 -2129 -3004 -3324 -3531 -4288 -4549 -4080 -2537 216 1797 998 466
971525 466 313 787 971 91 -728 -1423 -651 690 1242 970 -234 -1408 -1119 -876 -1562 -1867 -850 442
$$ packed form
966442b146l20l74N8O72M17j281j406Q99K104J592J19o15m06M84K58N31P79K29
967186A594j474k261k84m14K99Q59Q2k42O12J270J443o61o93l08O63J460J120
967888C065Q29M13j457j820j210p81n82l77M1p49j262k02K45L81P22J22o54m41
968632c717j373j739k35J084J991L887L203O43j869k006j096j009m35K67m11r22
969293c737J146J287l80MR51J046M28M30K82n18j52N4J107O83l37q41r10j60j602
970079a219k278n73R92J077j1j78J272J710p88j871k041j214P58Q81p23m71J755
970781b922P26n62M93J24K84K61n33q75l20k07p57k61M69J543K753J581p99n32
971525D66j53M74J84q80q19o95P72J341N52k72j204j174K89K43o86l05J017J292
$$ plain form
972269 442 1165 1973 2170 1141 -166 -1486 -1512 -1803 -2012 -2397 -3848 -5148 -5077 -4081 -2513 -1595 -1356 -154
973012 -154 1208 1951 968 25 49 124 477 885 1542 1301 95 296 1185 649 -135 609 701 -462 -266
973798 -266 152 -1219 -2977 -3479 -2950 -2717 -3061 -3565 -3626 -3496 -3657 -2646 -849 -22 1159 1552 -88 -2197
974541 -2197 -3068 -1908 -221 56 75 330 -1330 -2258 -2262 -3142 -4156 -5350 -7267 -8136 -6703 -4187 -2389
975244 -2389 -1042 209 799 1531 2676 2322 641 -1440 -2679 -2930 -3053 -3383 -3382 -3097 -2201 -1392 -1210 -487
975987 -487 15 59 -779 -1489 -2155 -4252 -6549 -6801 -4376 -2928 -3725 -3722 -1427 2262 4565 4788 4036 1962
976731 1962 -546 -1672 -1037 -231 -652 -988 -526 -478 -2120 -4349 -5759 -5861 -4833 -3286 -2383 -2515 -1827
977434 -1827 -1055 -502 0 -543 -869 11 1702 2017 1314 -583 -2290 -2244 -1828 -2512 -2392 -1047 230 -119
$$ packed form
972269D42P23Q08J97j029j307j320k6k91k09l85j451j300P1R96J568R18K39J202
973012a54J362P43r83r43K4P5L53M08O57k41j206K01Q89n36p84P44R2j163J96
973798b66M18j371j758n02N29K33l44n04o1J30j61J011J797Q27J181L93j640k109
974541b197q71J160J687K77J9K55j660r28mq80j014j194j917q69J433K516J798
975244b389J347J251N90P32J145l54j681k081j239k51j23l30JK85Q96Q09J82P23
975987d87N02M4q38p10o66k097k297k52K425J448p97LK295L689K303K23p52k074
976731A962k508j126O35Q06m21l36M62M8j642k229j410j02J028J547R03j32O88
977434a827P72N53N02n43l26Q80J691L15p03j897j707M6M16o84J20J345J277l49
$$ plain form
978178 -119 -489 25 159 -1039 -2298 -2586 -2244 -594 2262 3374 1982 114 -1169 -1829 -2817 -2683 -1592
978880 -1592 -774 -623 -1198 -2252 -3223 -3813 -4926 -6527 -7806 -9367 -9936 -7189 -3774 -2946 -4050 -4206
979541 -4206 -4468 -4234 -3031 -1945 -716 520 788 70 -1602 -3803 -4690 -5233 -5186 -4240 -2555 -1646 138
980244 138 1882 1816 103 -2595 -4020 -3519 -2643 -2193 -1713 -1325 -1750 -1697 -336 552 -400 -1610 -1184 781
980988 781 1925 1369 161 -334 -1743 -2465 -2866 -3765 -5506 -6756 -7801 -7916 -6496 -4087 -2292 -1663
981649 -1663 -1470 -1070 -274 1627 1696 64 51 1593 2281 2105 1153 -192 -2406 -4498 -4831 -4327 -4153 -2289
982392 -2289 316 1118 2526 3722 3282 2162 1509 858 729 -152 -1569 -1427 -139 2522 4986 5431
983054 5431 4649 3593 2899 1843 -99 -1618 -2471 -3535 -4579 -3990 -2742 -1911 -2082 -1324 906 2690
$$ packed form
978178a19l70N14J34j198j259k88L42J650K856J112j392j868j283o60r88J34J091
978880a592Q18J51n75j054r71n90j113j601j279j561n69K747L415Q28j104j56
979541d206k62K34J203J086J229J236K68p18j672k201q87n43M7R46J685R09J784
980244A38J744o6j713k698j425N01Q76M50M80L88m25N3J361Q88r52j210M26J965
980988G81J144n56j208m95j409p22m01q99j741j250j045j15J420K409J795O29
981649a663J93M00P96J901O9j632j3J542O88j76r52j345k214k092l33N04J74J864
982392b289K605Q02J408J196m40j120o53o51j29q81j417J42J288K661K464M45
983054E431p82j056o94j056j942j519q53j064j044N89J248Q31j71P58K230J784
$$ plain form
983715 2690 2884 2667 2846 3166 3662 2871 973 -861 -2053 -2871 -2242 -815 -203 -1522 -2996 -3987 -4862
984417 -4862 -5192 -4912 -4191 -4382 -4705 -3713 -2591 -2489 -3881 -3786 -1517 -227 765 1290 157 -1023 -1564
985120 -1564 -1930 -3279 -4071 -4461 -5120 -5037 -3975 -3055 -2361 -562 830 2268 3225 2601 1781 1151 913 898
985864 898 -545 -2545 -2414 -1066 -638 -1427 -1796 -1402 294 1671 1155 -908 -3196 -4080 -3370 -3223 -3272
986566 -3272 -3337 -4456 -5602 -6166 -5616 -4223 -3263 -3236 -3614 -3743 -4636 -5023 -3931 -2397 -2872 -4987 -6068
987269 -6068 -5695 -5548 -5527 -5107 -5514 -6133 -6103 -7070 -7558 -6493 -5643 -6059 -6738 -7481 -7558 -6810 -5930 -5141 -4602 -4225
988095 -4225 -2978 -1117 455 -103 98 314 -2146 -4132 -3927 -3336 -3847 -4341 -4858 -5582 -5819 -6300 -6392 -7104
988839 -7104 -8440 -8202 -8787 -10830 -13595 -15793 -15528 -14586 -12132 -9025 -7926 -8315 -8531 -8989 -8330 -7518 -7664
$$ packed form
983715B690J94k17J79L20M96p91j898j834j192q18O29J427O12j319j474r91q75
984417d862l30K80P21j91l23R92J122J02j392R5K269J290R92N25j133j180n41
985120a564l66j349p92l90o59Q3J062R20O94J799J392J438R57o24q20o30k38j5
985864H98j443k000J31J348M28p89l69L94J696J377n16k063k288q84P10J47m9
986566c272o5j119j146n64N50J393R60K7l78j29q93l87J092J534m75k115j081
987269f068L73J47K1M20m07o19L0r67m88J065Q50m16o79p43p7P48Q80P89N39L77
988095d225J247J861J572n58K01K16k460j986K05N91n11m94n17p24k37m81r2p12
988839g104j336K38n85k043k765k198K65R42K454L107J099l89k16m58O59Q12j46
$$ plain form
989542 -7664 -7681 -6925 -3445 6016 28608 62843 86693 97128 102793 102337 93859 79924 67243 57634
990120 57634 49497 41894 35290 30584 26279 22372 19815 18196 17619 19278 19720 19686 20125 18773 16939
$$ packed form
989542g664j7P56L480R461K2592L4235K3850J0435N665m56q478j3935j2681r609
990120E7634q137p603o604m706m305l907k557j619n77J659M42l4M39j352j834
$$ [...]
##END=
