##TITLE= 4-methyl-2-pentanone C-13
##JCAMP-DX= 5.00 $$From Command Line Converter 1.0
##DATA TYPE= NMR Spectrum
##DATA CLASS=  XYDATA

##ORIGIN= Exported from Command Line Converter 1.0
##OWNER= SVB
##$URL= http://wwwchem.uwimona.edu.jm:1104/software/jcampdx.html
##SPECTROMETER/DATA SYSTEM= NUTS EXPORT
##.OBSERVE FREQUENCY= 75.480980
##.OBSERVE NUCLEUS= ^1H
##INSTRUMENTAL PARAMETERS= 1H
##XUNITS= PPM
##YUNITS= ARBITRARY UNITS
##XFACTOR= 0.0002649675
##YFACTOR= 24.6490450000
##FIRSTX= -17.968720
##FIRSTY= 25793.000000
##LASTX= 246.998700
##NPOINTS= 16384
##MAXY= 24472000.000000
##MINY= -177045.000000
##DELTAX=   0.016173
##XYDATA= (X++(Y..Y))
-67815A046J317j418j790N19j59L55M68R96K0j554j619l8P03O31N02r65p58k13
$$ 1046 2363 945 -845 -326 -485 -130 338 1334 1354 -200 -1819 -1857 -1154 -523 -21 -986 -1744 -1957
-66717a957n28l75j516L35K553J535j248j812j472k459pJ182J354J42J06l54Q60
$$ -1957 -2485 -2860 -4376 -4041 -1488 47 -1201 -3013 -4485 -6944 -6951 -5769 -4415 -4273 -4167 -4521 -3661
-65679c661J992P81r7n66j66O9j36M40K01j07O97n43l78l34J77k34O24N85Q72
$$ -3661 -1669 -888 -985 -1551 -1717 -1648 -1784 -1344 -1143 -1250 -553 -1096 -1474 -1808 -1631 -1865 -1241 -656 216
-64519B16J184m7p90M54N54r05j601o04j094J86J115M32j055J2O5J13o98m96L67
$$ 216 1400 1353 563 1017 1571 666 -935 -1539 -2633 -2447 -1332 -900 -1955 -1943 -1878 -1765 -2463 -2959 -2592
-63360b592k98Q98Q60L34J275L03n6m5m67p82j456l04P96j014j777r01R11P27
$$ -2592 -2890 -1992 -1132 -798 477 780 724 679 212 -570 -2026 -2330 -1534 -2548 -4325 -5226 -4315 -3588
-62261c588k07l58M82L96K80J95j992q97L64M35R08Q31R22o0N69Q58q76j375j787
$$ -3588 -3795 -4153 -3671 -3275 -2995 -2800 -4792 -5689 -5325 -4890 -3982 -3151 -2229 -2289 -1720 -862 -1738 -3113 -4900
-61101d900K16J234J489J636N59j133o10R26O52m57r00l61l00j87J217N71r72
$$ -4900 -4684 -3450 -1961 -325 234 -899 -1509 -583 69 -388 -1288 -1649 -1949 -2136 -919 -348 -1320
-60064a320J45m77k481L45K467M79k01q29j027l46L72M89q38l18J355m06r00p82
$$ -1320 -1175 -1652 -4133 -3788 -1321 -842 -1043 -1872 -2899 -3245 -2873 -2384 -3222 -3540 -2185 -2591 -3491 -4273
-58965d273l01Q31J01N06J555J450J603l55q32q66j893r09J467J061O57Q36J513
$$ -4273 -4574 -3743 -3642 -3136 -1581 -131 1472 1117 285 -581 -2474 -3383 -1916 -855 -198 638 2151
-57927B151j213k441j370J105J940q77k599l80L44P68O66K242m39j339O58k95
$$ 2151 938 -1503 -2873 -1768 172 -705 -3304 -3684 -3340 -2572 -1906 336 -103 -1442 -784 -1079
-56950a079j303r11j071j461O6K203R03p56P9n45q5J167N54M82J547N40O20M23
$$ -1079 -2382 -3293 -4364 -5825 -5759 -3556 -2653 -3409 -3330 -3875 -3960 -2793 -2239 -1757 -210 330 950 1373
-55852A373j913n48m67n23j8k159L74K188O41j160k63Q91P95N12J03p45j364k60
$$ 1373 -540 -1088 -1555 -2078 -2096 -4255 -3881 -1693 -1052 -2212 -2475 -1584 -789 -277 -174 -919 -2283 -2543
-54753b543l06J388K347J25j773j59J665O89L93k97q87j719L19J787L62q21L6
$$ -2543 -2849 -1461 886 1011 -762 -921 744 1433 1826 1529 642 -1077 -758 1029 1391 570 606
-53715F06p4N91m91k749k581M18J960L077J013j253k120j524M61J771Q12m58j418
$$ 606 532 1123 632 -2117 -4698 -4280 -2320 757 1770 517 -1603 -3127 -2666 -895 -83 -541 -1959
-52678a959j380q86l97J925J681R05K56k19k78M5q57p28l94q81j93Q77J690Q63
$$ -1959 -3339 -4225 -4622 -2697 -1016 -111 145 -74 -352 -307 -1164 -1892 -2286 -3167 -3360 -2483 -793 70
-51579G0q90j67p81j533o58K656K538N32l44l04j480j250j54K4k96k17Q39J140
$$ 70 -820 -987 -1768 -3301 -3959 -1303 1235 1767 1423 1119 -361 -1611 -1765 -1741 -2037 -2254 -1415 -275
-50481b75m37m87o83J016K24j152j72Q00J087R53J75j673l659j480K653J244P7
$$ -275 -712 -1199 -1882 -866 -642 -1794 -1966 -1166 -79 874 1049 -624 -4283 -5763 -3110 -1866 -1789
-49443a789Q48j258k215k061N36P17R94J776n30L3J300j389j568J678P05J6j508
$$ -1789 -941 -2199 -4414 -6475 -5939 -5222 -4228 -2452 -2982 -2949 -1649 -3038 -4606 -2928 -2223 -2207 -3715
-48405c715l54J736K419M40j194M3L14J2m56k28Q3j39r09l35J320R27j351k197
$$ -3715 -4069 -2333 86 526 -668 -625 -311 -299 -755 -983 -900 -1039 -1948 -2283 -963 -36 -1387 -3584
-47306c584o49n92m85M80L93J083M37P45m39j452k83J268Q66r85j528L64J507
$$ -3584 -4233 -4825 -5310 -4830 -4437 -3354 -2917 -2172 -2611 -4063 -4346 -3078 -2212 -3197 -4725 -4361 -2854
-46269b854J089k78R29O82J51O14k34m3R9N1O53n91m27n08j528m38N12K87J947
$$ -2854 -1765 -2043 -1114 -432 -281 333 99 56 155 206 859 268 -159 -667 -2195 -2633 -2121 -1834 113
-45109A13J21o99Q46O92M98n67l61l04Q7K55O98m10l421k489P79K380K68q59p64
$$ 113 234 -465 381 1073 1571 1004 643 339 426 681 1379 969 -2452 -4941 -4162 -1782 -1514 -2373 -3137
-43949c137l26N5o32J355J657P47j061n51M38N31J173J604J018q88k082l542j192
$$ -3137 -3463 -3408 -4040 -2685 -1028 -281 -1342 -1893 -1455 -924 249 1853 2871 1983 -99 -3641 -4833
-42911d833J726R17J418J912Q81j228j578r67j787N9P54q3j38P5n21j163n61L98
$$ -4833 -3107 -2190 -772 1140 2021 793 -785 -1752 -3539 -3480 -2726 -2809 -2947 -2872 -3393 -4556 -5117 -4719
-41813d719L90R46k14K11m00K60J493R18j024j074J130K84m69m60j880j266J121
$$ -4719 -4329 -3383 -3597 -3386 -3786 -3526 -2033 -1115 -2139 -3213 -2083 -1799 -2268 -2728 -4608 -5874 -4753
-40775d753l7j487l06N24P24M85L49n86j226p06P65P30L77J147M27l70j135n41
$$ -4753 -4790 -6277 -6583 -6059 -5335 -4850 -4501 -5087 -6313 -7019 -6254 -5524 -5147 -4000 -3573 -3943 -5078 -5619
-39677e619q7O23J834J705O23j38N34L86j637l190o19J397K79M40J087M26j677
$$ -5619 -5706 -5083 -3249 -1544 -921 -1059 -525 -139 -1776 -4966 -5585 -4188 -3909 -3469 -2382 -1956 -3633
-38639c633k5J365n4q3p01q35j95Q51J259P10L07j421j545Q13J198O53N45J236
$$ -3633 -3658 -2293 -2347 -2430 -3131 -3966 -4161 -3310 -2051 -1341 -1034 -2455 -4000 -3187 -1989 -1336 -791 445
-37540D45N36k9M6L46J417r76o12J58q79o86n37K80p42p50j256j153k91o11J342
$$ 445 981 952 998 1344 2761 1785 1173 1331 452 -234 -771 -491 -1233 -1983 -3239 -4392 -4683 -5294 -3952
-36380c952k78m73R17O18L80O46K32l2N8J600J634l14k58o11N94j711k223k17
$$ -3952 -4230 -4703 -3786 -3168 -2788 -2142 -1910 -1942 -1884 -284 1350 1036 778 167 761 -950 -3173 -3390
-35282c390j299r0K227M86j646r83l34K17L31J099J153J822J191q10j233m38O78
$$ -3390 -4689 -4779 -2552 -2066 -3712 -4695 -5029 -4812 -4481 -3382 -2229 -407 784 -26 -1259 -1697 -1019
-34244a019o05j867j325K16o85L09J476J911j09q25l65J661J305J28n60m43p14
$$ -1019 -1624 -3491 -4816 -4600 -5285 -4976 -3500 -1589 -1698 -2523 -2888 -1227 78 206 -354 -797 -1511
-33206a511j73J524J440p01p32j162j634n1o03O16J360J131J724J005j811k840
$$ -1511 -1684 -160 1280 579 -153 -1315 -2949 -3000 -3603 -2987 -1627 -496 1228 2233 422 -2418
-32230b418L13J194M80k316p16K222J156q09j558KN81r87k91K69l80k51j43m81
$$ -2418 -2105 -911 -431 -2747 -3463 -1241 -85 -894 -2452 -2450 -1869 -2856 -3147 -2878 -3258 -3509 -3652 -4133
-31131d133K93R23J092L67k925k234R67O0N70J35R52R19l61K90J639M27j527j119
$$ -4133 -3840 -2917 -1825 -1458 -4383 -6617 -5650 -5590 -5020 -4885 -3933 -3014 -3375 -3085 -1446 -1019 -2546 -3665
-30032c665l9J268J238j3J071N5l49O09j34j837j060n44Q46Q60J155m13j522j309
$$ -3665 -3704 -2436 -1198 -1211 -140 -85 -434 175 41 -1796 -2856 -3400 -2554 -1694 -539 -952 -2474 -3783
-28934c783l89k19P40K311r4M63P67Q89p99r56j249k642j362K67L9p21O00R59
$$ -3783 -4172 -4391 -3651 -1340 -1434 -971 -204 685 -114 -1070 -2319 -4961 -6323 -6056 -6017 -6738 -6138 -5179
-27835e179M77n81j13Q52K034J788R03K82o32j93l18q27j743j673j104J128J023
$$ -5179 -4702 -5283 -5396 -4544 -2510 -722 181 463 -169 -362 -680 -1507 -3250 -4923 -6027 -4899 -3876
-26797c876N49K97J783N86L93k95j822j152L70J106j095k058M55J411O40J533
$$ -3876 -3327 -3030 -1247 -661 -268 -563 -2385 -3537 -3167 -2061 -3156 -5214 -4759 -3348 -2708 -1175
-25821a175P26j52o25J524Q50r41n24J166m6j50Q46Q04k403J98l90k586k107l16
$$ -1175 -449 -601 -1226 298 1148 207 -317 849 803 653 1499 2303 -100 98 -292 -2878 -4985 -5301
-24722e301J359K385N66m47J501J972K49j933q59J466P43j79L46p58j245j110
$$ -5301 -3942 -1557 -991 -1438 63 2035 2284 351 -508 958 1701 1522 1868 1110 -135 -1245
-23745a245n41o12N1J038J295N03j653m72K686P37M48j274q88O10J451r18j551
$$ -1245 -1786 -2398 -2347 -1309 -14 489 -1164 -1636 1050 1787 2235 961 73 683 2134 1216 -335
-22708c35l47k30r39j398j37M95O55n78k60k87O83M51J72j60N75o1l78R0O00K094
$$ -335 -682 -912 -1851 -3249 -3386 -2891 -2236 -2814 -3074 -3361 -2678 -2227 -2055 -2215 -1640 -1701 -2079 -1989 -1389 705
-21487G05J077l02N6o37j234k186j819o24J577J589J247K28n14j774j285M59K2
$$ 705 1782 1480 1536 899 -335 -2521 -4340 -4964 -3387 -1798 -551 -323 -837 -2611 -3896 -3437 -3415
-20449c415k45P23P83j42j059m66J445J971P14J76O00Mm83j217k95j460p24q75
$$ -3415 -3660 -2937 -2154 -2296 -3355 -3821 -2376 -405 309 485 1085 1089 606 -611 -906 -2366 -3090 -3965
-19351c965j044k9N54J837J437n81m57o10O60J122p65j351J36L42j120j24K7J6
$$ -3965 -5009 -5038 -4484 -2647 -1210 -1791 -2248 -2858 -2198 -1076 -1841 -3192 -3056 -2714 -3834 -3958 -3931 -3915
-18252c915q47j94m77j280l46J69p6O68q9P66J770P67j2m65J253J177l07p4J19
$$ -3915 -4762 -4956 -5433 -6713 -7059 -6890 -6966 -6298 -6387 -5621 -3851 -3084 -3096 -3561 -2308 -1131 -1438 -1512 -1393
-17092a393M38j355j587P0J320J430J387N20K76j593j874m33P75M40n44j302k048
$$ -1393 -955 -2310 -3897 -3827 -2507 -1077 310 830 1106 -487 -2361 -2794 -2019 -1579 -2123 -3425 -5473
-16054e473oK251J367K43r4o29j46q85l98J085R04J58J046O92o23k81Q23j011
$$ -5473 -5479 -3228 -1861 -1618 -1712 -2341 -2487 -3372 -3770 -2685 -1781 -1623 -577 115 -508 -789 34 -977
-14956i77j790J431J340r14k51J655M35r03j546j055j147M73m95o82j708p97J837
$$ -977 -2767 -1336 4 -910 -1161 494 929 26 -1520 -2575 -3722 -3249 -3744 -4426 -6134 -6931 -5094
-13918e094K210P30p19j284j316j024P13J725J012J361K362J731M1M80J12j60
$$ -5094 -2884 -2154 -2873 -4157 -5473 -6497 -5784 -4059 -3047 -1686 676 2407 2448 2928 3040 2880
-12941B880j540j218p69n49n21L91j84j207P7K86p6m56j70J519r66j354L19J440
$$ 2880 1340 122 -647 -1196 -1717 -1326 -1510 -2717 -2640 -2354 -2430 -2886 -3056 -1537 -2503 -3857 -3538 -2098
-11843b098r06q72R7J39L6J077R24M97M25o4j03p36j844j584k28J43J705J373
$$ -2098 -3004 -3876 -3779 -3640 -3604 -2527 -1603 -1106 -681 -745 -848 -1584 -3428 -5012 -5240 -5097 -3392 -2019
-10744b019M9j103J06N39j13j33j431o08J038J836R54N15M23K85j39j078J012
$$ -2019 -1970 -3073 -2967 -2428 -2541 -2674 -4105 -4713 -3675 -1839 -885 -370 53 338 199 -879 133
-9706A33k1j09j540j731j566j60J236L21k70L17j449l58p7j87M71Q82N87J225
$$ 133 112 3 -1537 -3268 -4834 -4994 -3758 -3437 -3707 -3390 -4839 -5197 -5274 -5461 -4990 -4108 -3521 -2296
-8608b296J227l32J40n09j40j66l05j348O2Q53k33J024P22J061K90p56N35R95
$$ -2296 -1069 -1401 -1261 -1770 -1910 -2076 -2381 -3729 -3667 -2814 -3047 -2023 -1301 -240 50 -706 -171 824
-7509H24L50j044q48m65j283J290P58j819j149L70R18J251l00j159q46P7j537
$$ 824 1174 130 -718 -1183 -2466 -1176 -418 -2237 -3386 -3016 -2098 -847 -1147 -2306 -3152 -3075 -4612
-6471d612J472K708L41N90m66k050j126O63O1j022k43l46n75O33J91R3J36J31
$$ -4612 -3140 -432 -91 499 33 -2017 -3143 -2480 -2419 -3441 -3684 -4030 -4605 -3972 -3781 -3688 -3552 -3421
-5373c421p48R47J127K5J402J049J83n80j576j40J07O1J011M06j59j310r78m24
$$ -3421 -4169 -3222 -2095 -2070 -668 381 564 -16 -1592 -1732 -1625 -1564 -553 -147 -306 -1616 -2594 -3018
-4274c018q79l23P26J34j378j094j27J413N22N27l13r0j48k60R13J970J330o97
$$ -3018 -3897 -4220 -3494 -3360 -4738 -5832 -5959 -4546 -4024 -3497 -3810 -3900 -4048 -4308 -3395 -1425 -95 -792
-3175g92j589j720n63N25N32O81K06O8k28N64J841J642M68l9q03j162j692o57
$$ -792 -2381 -4101 -4664 -4139 -3607 -2926 -2720 -2652 -2880 -2316 -475 1167 1635 1596 793 -369 -2061 -2718
-2077b718J015N34M59o58J4N18m01k52k9Q61O64K65n45n16J01j32j690j238J83
$$ -2718 -1703 -1169 -710 -1368 -1354 -836 -1237 -1489 -1518 -657 7 272 -273 -789 -688 -820 -2510 -3748 -3565
-917c565O49J364n43o00l95K194K111J147J252j68j475j234M6r91p77J4n35
$$ -3565 -2916 -1552 -2095 -2695 -3090 -896 1215 2362 3614 3446 1971 737 783 -208 -985 -971 -1506
121a506j084j884K13P54N05K293K875J492k07j679j175p81j25Q59p07o84m89
$$ -1506 -2590 -4474 -4261 -3507 -3002 -709 2166 3658 3451 1772 597 -184 -309 550 -157 -841 -1330
1159a330J03J771J484l42k005R52J26l72r48n02pJ286l08q3J266j073k042P02
$$ -1330 -1227 544 2028 1686 -319 633 759 387 -561 -1063 -1070 216 -92 -175 1091 18 -2024 -1322
2257a322M68O79J389n69m01M28L18J651n81l196k637o33j96J382n01j506J681
$$ -1322 -854 -175 1214 645 244 672 990 2641 2060 -1136 -3773 -4406 -4602 -3220 -3721 -5227 -3546
3295c546M45J80N31j072k210L6J171K47O59p87l28J977K058J360K25n95n40
$$ -3546 -3101 -2921 -2390 -3462 -5672 -5636 -4465 -4218 -3559 -4346 -4674 -2697 -639 721 946 351 -189
4332a89q35q15k88J447J561R13j473r43J468L161n16j636p25r84j227r72k15
$$ -189 -1024 -1839 -2127 -680 881 1794 321 -622 846 4007 3491 1855 1130 146 -1081 -2053 -2268
5370b268K20j81l1q71N00l41j029j202L40N49m31j473N40J112P83J417J868
$$ -2268 -2048 -2229 -2260 -3131 -2631 -2972 -4001 -5203 -4863 -4314 -4745 -6218 -5678 -4566 -3783 -2366 -498
6408d98J499O22r82k25p08J294K026L56k120j706j495m55J700p13q45M65O51
$$ -498 1001 1623 641 416 -292 1002 3028 3384 1264 -442 -1937 -2392 -692 -1405 -2250 -1785 -1134
7445a134K042m37k229r12M01P31J51J66J167N10J26j1l13m16k42n25L06K70
$$ -1134 908 471 -1758 -2670 -2269 -1538 -1387 -1221 -54 456 582 571 258 -158 -400 -925 -619 -349
8544c49K11p12j962l67n22n18K94l17p54o84j149P73K140J748J519j88r56J033
$$ -349 -138 -850 -2812 -3179 -3701 -4219 -3925 -4242 -4996 -5680 -6829 -6056 -3916 -2168 -649 -837 -1793 -760
9643g60J503l61N99J002Q93m06q02K14l17l83p27o57L50M18J121n56L3K858
$$ -760 743 382 981 1983 2876 2470 1668 1882 1565 1182 455 -202 148 566 1687 1131 1164 4022
10742D022O90k501l016j628N83O68L03o03j254j493l04L82j098J44O63K19n04
$$ 4022 4712 2211 -805 -2433 -1850 -1182 -879 -1482 -2736 -4229 -4533 -4151 -5249 -5105 -4442 -4223 -4727
11779d727o12R1J062K65j176L05J140m52p97j355J253J626m26o70R07J746J108
$$ -4727 -5339 -5248 -4186 -3921 -5097 -4792 -3652 -4104 -4901 -6256 -5003 -3377 -3803 -4473 -3566 -1820 -712
12817g12l21q65j124J299J599R82q45k07J079J05l00j566j010L33N95l32o3R07
$$ -712 -1033 -1898 -3022 -1723 -124 858 13 -194 885 990 690 -876 -1886 -1553 -958 -1290 -1353 -446
13916d46J183k16k749j046N60p0q84L33M54K11q58K45J327R98M2q77j264n95
$$ -446 737 521 -2228 -3274 -2714 -2784 -3668 -3335 -2881 -2670 -3528 -3283 -1956 -958 -916 -1793 -3057 -3652
15014c652P72k83j304P15J476r58j179P14j37j029j555J110K419J104r61j33
$$ -3652 -2880 -3163 -4467 -3752 -2276 -3234 -4413 -3699 -3836 -4865 -6420 -5310 -2891 -1787 -2748 -2881
15991b881o80o94J63q68j020J003K111J087R35K27R0P26r58r00R62J535J09m20
$$ -2881 -3561 -4255 -4092 -4960 -5980 -4977 -2866 -1779 -844 -617 -527 199 -759 -1659 -697 838 947 527
17090E27j56J273M55j570j305j222J38L29q8M40J258k80j143j346k56N61K83
$$ 527 371 1644 2099 529 -776 -1998 -1860 -1531 -1619 -1179 79 -201 -1344 -2690 -2946 -2385 -2102
18127b102J518J323q11J50m04n27j543J37N11Q29J036J369N56k184l53j19j485
$$ -2102 -584 739 -72 78 -326 -853 -2396 -2259 -1748 -919 117 1486 2042 -142 -495 -614 -2099
19165b099P8R86Q33j114r86L08J299J074M94O59J99j143j241m52j77M5J108J252
$$ -2099 -2021 -1035 -202 -1316 -2302 -1994 -695 379 873 1532 1731 588 -653 -1105 -1282 -1237 -129 1123
20263A123J81j503n94k7O83J15k108j104l01J177K464K166J234j067j460j086
$$ 1123 1304 -199 -793 -820 -137 -22 -2130 -3234 -3535 -2358 106 2272 3506 2439 979 -107
21240a07o4R4q71j935k33J208J813J006J352m70P48Q90p80k047n74k38K45l22
$$ -107 -171 -77 -948 -2883 -3116 -1908 -95 911 2263 1793 2541 3431 2651 604 30 -208 37 -285
22339b85n26M8L12j20j521r93m10J174J880J80j828p38J230J551N74k98m71j557
$$ -285 -811 -763 -451 -571 -2092 -3085 -3495 -2321 -441 -261 -2089 -2827 -1597 -46 528 230 -241 -1798
23438a798k46N36J82r78j845M99J696O05J407J073p36j762N96P82q90P8k38J218
$$ -1798 -2044 -1508 -1326 -2304 -4149 -3650 -1954 -1349 58 1131 395 -1367 -771 11 -879 -801 -1039 179
24536A79R31L21j598j591M0J037n63r26p17J508O60q1J413J431r44k64l60n92
$$ 179 1110 1431 -167 -1758 -1718 -681 -1244 -2170 -2887 -1379 -719 -800 613 2044 1100 836 476 -116
25635a16r77R4J265J461m62j181P04l05j136p88r44R66J687J82q55j342j393
$$ -116 -1093 -999 266 1727 1265 84 788 483 -653 -1441 -2385 -1419 268 450 -405 -1747 -3140
26673c140j259K90J576K008J481j074j907m63J137r30j605m79n67O37J142K435
$$ -3140 -4399 -4109 -2533 -525 956 -118 -2025 -2488 -1351 -2281 -3886 -4365 -4932 -4295 -3153 -718
27649g18J416L63J001R38o72r66j035j041k06k7m52J16L14o15j584j137k91j607
$$ -718 698 1061 2062 3000 2328 1362 327 -714 -920 -947 -1399 -1283 -969 -1584 -3168 -4305 -4596 -6203
28748f203p99o2J187O29J252K433J103o24q32l37K569k9j562k00n15r77o52K10
$$ -6203 -7002 -7064 -5877 -5248 -3996 -1563 -460 -1084 -1916 -2253 316 287 -1275 -1475 -1990 -2967 -3619 -3409
29847c409O00n62k80O95J661L16j539J218R27r18p35O76R31J499R33q37j726
$$ -3409 -2809 -3371 -3651 -2956 -1295 -979 -2518 -1300 -373 -1291 -2026 -1350 -419 1080 2013 1176 -550
30884e50R54j313j823n37J37J224j74O5j75J54J206n79j04J20J281P52J121m9
$$ -550 404 -909 -2732 -3269 -3132 -1908 -2082 -2017 -2192 -2038 -832 -1411 -1515 -1395 -114 638 1759 1710
31983A710j286o26p84j233O48Q50M38n1p65j591j022l71j34l9L53p12J53o88
$$ 1710 424 -202 -986 -2219 -1571 -721 -283 -334 -1099 -2690 -3712 -4083 -4217 -4256 -3903 -4615 -4462 -5150
33082e150j646l87J277K035j66K77O52j056l45J534P21j945l38N33R69R44Kn93
$$ -5150 -6796 -7183 -5906 -3871 -4037 -3760 -3108 -4164 -4509 -2975 -2254 -4199 -4537 -4004 -3035 -2091 -2089 -2682
34181b682j190p07L00R24Q00J800o96k26Q64q67K66J7K21j045k449L21K282J334
$$ -2682 -3872 -4579 -4279 -3355 -2555 -755 -1451 -1677 -813 -1680 -1414 -1397 -1176 -2221 -4670 -4349 -2067 -733
35279g33m68J007J234J004j224j72M59j930j361Q01J212L71J56n32J045O70n40
$$ -733 -1201 -194 1040 2044 820 648 1107 -823 -2184 -1383 -171 200 356 -176 869 1539 999
36317I99J827k11j601o16L40j201j179O87J859N21q48j628j60Q65k36j057Q3
$$ 999 2826 2615 1014 398 738 -463 -1642 -955 904 1425 577 -1051 -1211 -346 -582 -1639 -1556
37354a556J219M77J435O10j509j220j277K69n7K08j78k47no27p91K2m17j06L93
$$ -1556 -337 140 1575 2185 676 -544 -1821 -1552 -1609 -1401 -1579 -1826 -1831 -2458 -3249 -3227 -3644 -3750 -3357
38514c357J64j682l15J51R78K06M87K050P25k65L93p79j488j336j93J846J620
$$ -3357 -3193 -4875 -5190 -5039 -4061 -3855 -3368 -1318 -593 -858 -465 -1244 -2732 -4068 -4261 -2415 -795
39552g95j353j379J708J816O82k9o0j141j265p14OK319J505O6r91j0p39m73m22
$$ -795 -2148 -3527 -1819 -3 679 650 590 -551 -1816 -2530 -2524 -205 1300 1366 375 365 -374 -847 -1269
40712a269j92o71m25j315O71P24J125J134J457L23j541k01j067m39K320R80j53
$$ -1269 -1461 -2132 -2557 -3872 -3201 -2477 -1352 -218 1239 1562 21 -180 -1247 -1686 634 1614 1461
41749A461J243J032j905n25L38J099L39j41r07k492k209K00Q79n8P02n0L49j23
$$ 1461 2704 3736 1831 1306 1644 2743 3082 2941 2034 -458 -2667 -2467 -1588 -1646 -944 -994 -645 -768
42848g68j356P95J271R6o56j539j270r05n04J530K93Q05J445J564Q57L07q96
$$ -768 -2124 -1329 -58 38 -618 -2157 -3427 -4332 -4836 -3306 -3013 -2208 -763 801 1658 1965 1069
43886A069k14M61Q84J66j813j730N18J918K56j928k806j029k64L77J423J641
$$ 1069 855 1316 2200 2366 553 -1177 -659 1259 1515 -413 -3219 -4248 -4512 -4135 -2712 -1071
44862a071J160R20j4q5j635j270j211M02R31J158P8m37k44m57n50n0N28J60J050
$$ -1071 89 1009 995 910 -725 -1995 -3206 -2804 -1873 -715 -637 -1074 -1318 -1775 -2325 -2375 -1847 -1687 -637
46022f37K92P50l06r37JM7j022j257p96K52p87o26J502P81p82J66L41J249N86
$$ -637 -345 405 99 -838 -837 -790 -1812 -3069 -3865 -3613 -4400 -5026 -3524 -2743 -3525 -3359 -3018 -1769 -1183
47182a183J97k84r29M20K76j554j508K23J514j63j093J34J177k15O94J082J594
$$ -1183 -986 -1270 -2199 -1779 -1503 -3057 -4565 -4342 -2828 -2991 -4084 -3950 -2773 -2988 -2294 -1212 382
48219C82N76J017J124j00j33M15N69j266k299m29M18L08K74N38J79L87L94k93
$$ 382 958 1975 3099 2999 2866 3281 3850 2584 285 -144 274 582 856 1394 1573 1960 2354 2061
49318B061j853j810k367K45J072j245j74L010L34K94R68j80l39m0K70K055K328
$$ 2061 208 -1602 -3969 -3724 -2652 -3897 -4071 -1061 -727 -433 535 355 16 -24 246 2301 4629
50356D629k21k920k177L24j510k601O29l12k58J736J779M4n22j914m09Q1J293
$$ 4629 4408 1488 -689 -365 -1875 -4476 -3847 -4159 -4417 -2681 -902 -858 -1380 -3294 -3703 -3622 -2329
51393b329J298M41R60N21P30L95l41k021M0r21k44K19L30q5q33O2j074J067K649
$$ -2329 -1031 -590 370 891 1621 2016 1675 -346 -306 -1227 -1471 -1252 -922 -1007 -1840 -1778 -2852 -1785 864
52553H64P80K73M68J01r7j177j580O85Q75P73j05l96Q35J569J778j19j811j777
$$ 864 1644 1917 2385 2486 2389 1212 -368 317 1192 1965 1860 1464 2299 3868 5646 5527 3716 1939
53652A939j233J066M31o27k076j208o38J88O98L47O84J270K403j615k885n67
$$ 1939 706 1772 2203 1576 -500 -1708 -2346 -2158 -1460 -1113 -429 841 3244 1629 -1256 -1823
54629a823o20j95R45q4j503n44J149j11J586L305J752M52j648j774k09R2L70
$$ -1823 -2443 -2638 -1693 -1777 -3280 -3824 -2675 -2786 -1200 2105 3857 4309 2661 887 678 770 1140
55666A140k85k02m42n8N03l84l20n20O35J068p82J71K163L94j335j340l18p66
$$ 1140 855 653 211 153 656 272 -48 -568 67 1135 353 524 2687 3081 1746 406 88 -678
56765f78j586j465j246N11J936K178O69K37J74j010p58p40Q6K58O67O7J30l44
$$ -678 -2264 -3729 -4975 -4464 -2528 -350 319 556 730 -280 -1038 -1778 -1692 -1434 -767 -700 -570 -914
57863i14o53J91K038N80j09P96j21k944j221J189M96l36q25r03k06k54j046J187
$$ -914 -1567 -1376 662 1242 1133 1929 1808 -1136 -2357 -1168 -672 -1008 -1833 -2736 -2942 -3196 -4242 -3055
58962c055L886L002L86j72q54j050J75l55m85j01k96j862O71J831r4j043j028
$$ -3055 831 3833 4219 4047 3193 2143 2318 1963 1478 1377 1081 -781 -110 1721 1627 584 -444
60000d44J04J772K116O15j471j519l1J783O80j631j753q11m41j776o71J178O30
$$ -444 -340 1432 3548 4163 2692 1173 1142 2925 3605 1974 221 -590 -1031 -2807 -3478 -2300 -1670
61038a670l43M31M63n38Q60P79m90n12k97r9J279N40M6m42P30Q09J89L54l30
$$ -1670 -2013 -1582 -1119 -1657 -797 -18 -508 -1020 -1317 -1416 -137 403 449 7 737 1546 1735 2089 1759
62197A759J54j616j829o67R90q09O51J171M40r06P06O53K92k430r45J523J135
$$ 1759 1913 297 -1532 -2199 -1209 -2018 -1367 -196 244 -662 44 697 989 -1441 -2386 -863 272
63235B72j055K93J448J079p95r44j292p15J377J463n63j017l6M50L92L48q30
$$ 272 -783 -490 958 2037 1242 298 -994 -1709 -332 1131 568 -449 -485 -35 357 705 -125
64273a25j679N26J816l83m45l52l58k14Q58J07R08j484k35J179q19p81l18l64
$$ -125 -1804 -1278 538 155 -290 -642 -1000 -1214 -356 -249 659 -825 -1060 119 -700 -1481 -1799 -2163
65371b163p47L31J369J067J31j23L81L97l57r4l02K51j340j222J060J857P24
$$ -2163 -2910 -2579 -1210 -143 -12 -135 246 643 286 192 -110 141 -1199 -2421 -1361 496 1220
66409A220K6O71m35k551k242J137K579J591L55p46J015q74j643o73j61J97J176
$$ 1220 1246 1917 1482 -1069 -3311 -2174 405 1996 2351 1605 2620 1746 103 -570 -731 -534 642
67447F42J64q11j842j498J069m01o44N38J120K106P45n5K61j190J253R69k95
$$ 642 806 -5 -1847 -3345 -2276 -2677 -3321 -2783 -1663 443 1188 1133 1394 204 1457 2426 2131
68484B131K45M6P52M15q82j604j98l09K34P92L10n77O53R07p82j843K5M50k82
$$ 2131 2376 2422 3174 3589 2707 1103 905 596 830 1622 1932 1355 2008 2915 2133 290 315 765 483
69644D83k69Q72P67r6p0K10L9K92o1J48j239o73N77l97j233oK19o19j081J08
$$ 483 214 1086 1853 1757 1687 1897 1936 2228 2167 2315 1076 403 980 583 -650 -656 -437 -1056 -2137 -2029
70865b029K77N83J294P58m61o44j035j93O51kk673j488J981j93L98M85r06j624
$$ -2029 -1752 -1169 125 883 422 -222 -1257 -1450 -799 -801 -3474 -4962 -2981 -3174 -2776 -2291 -3197 -4821
71964d821J00J268J135J674J283n16K63p33j182j98O65J205M25P06j2o30j243
$$ -4821 -4721 -3453 -2318 -644 639 123 386 -347 -1529 -1727 -1062 143 568 1274 1262 632 -611
73001f11j482l51L43J373R80O31p43m9K281O52p33m65O95L72j47j236o65K03
$$ -611 -2093 -2444 -2101 -728 252 883 140 91 2372 3024 2291 1826 2521 2893 2746 1510 845 1048
74100A048K73R56O40k01k83l60j5l96k816j643K75M65N26J546J256L363Q22k247
$$ 1048 1321 2277 2917 2716 2433 2073 2058 1662 -1154 -2797 -2522 -2057 -1531 15 1271 4634 5456 3209
75199C209k868j892j85J43j211J379J916O74k1k14l03j59q56o20P78K291Q64
$$ 3209 341 -1551 -1736 -1593 -2804 -1425 491 1165 1144 930 627 468 -388 -1008 -230 2061 2925
76236B925k381j145O53m09o83N38J145J85r24p07K81R43K83O03Q37j331j245
$$ 2925 544 -601 52 -357 -1040 -502 643 828 -96 -803 -522 421 704 1307 2144 813 -432
77274d32J033K14r78o50M81O64p9l82R87n50J52J606O24J94j048j710p07K70
$$ -432 601 815 -163 -813 -332 332 253 -129 858 308 460 2066 2690 2884 1836 126 -581 -311
78373c11j107j27N67j598Q4J903Q11j651NJ710J673q21j313m23j567n54J579
$$ -311 -1418 -1545 -978 -2576 -2492 -589 222 -1429 -1424 286 1959 1138 -175 -598 -2165 -2719 -1140
79410a140J643N46j015q00n71N65J706o73o63l05k55M97M58R0j550j36Q77J379
$$ -1140 503 1049 34 -766 -1337 -772 934 261 -402 -707 -962 -465 -7 83 -1467 -1603 -726 653
80509F53O51L98L54J52k50k32r7o92P62P50N84L27j256n4p15m21M86o8K28j055
$$ 653 1304 1702 2056 2208 1958 1726 1629 937 1699 2449 3033 3360 2104 2050 1335 914 1400 1332 1560 505
81730E05j095L13J172M64P01P92p59j110K76J580L45k207k586P58J93K5J164
$$ 505 -590 -277 895 1359 2060 2852 2093 983 1259 2839 3184 977 -1609 -851 -658 -633 531
82768E31O36J174K715K550j57l4R69J557p47j984j423M2J098J204J407K53Q9
$$ 531 1167 2341 5056 7606 7449 7415 8384 9941 9194 7210 5787 5829 6927 8131 9538 9791 9880
83805I880Q17m10K406M286L887M124N362Q361J1936J9391L4801O7802J49571
$$ 9880 10697 10287 12693 16979 20866 24990 30352 38713 50649 70040 104841 172643 322214
84599C22214L36317L34286k06012k40596j59217j10182o9928m5274l8180l4106
$$ 322214 658531 992817 786805 546209 386992 276810 206882 161608 123428 89322
85209H9322k5674j5212q257n949n390l949l765l080k507j461j031j225J010L24
$$ 89322 63648 48436 40179 34230 28840 24891 21126 18046 15539 14078 13047 11822 12832 13156
86063A3156k094k105M13R25k2k90n61o86o54L14m39o36p52j63j7j043j419m11
$$ 13156 11062 8957 9370 10295 10273 9983 9422 8736 8082 8396 7957 7321 6569 6406 6389 5346 3927 3516
87162C516J726R05r52k797k432p80J111M02o15q48q71L90M77o20q7J285L84L54
$$ 3516 5242 6147 5195 2398 -34 -814 297 699 84 -764 -1635 -1245 -768 -1388 -1475 -190 194 548
88261E48J76k87N86J089r29j455K21J177j00q38J131O01j22o60j697J0R3J906
$$ 548 724 437 1023 2112 1183 -272 -51 1126 1026 188 1319 1920 1798 1138 -559 -549 -456 1450
89360A450J958LQ95Q59j671r18j97N17J527L42j025j435k33k75K93M08n41q45
$$ 1450 3408 3411 4306 5165 3494 2576 2379 2896 4423 4765 3740 2305 2072 1797 2090 2498 1957 1112
90458A112r21q38L53Q09Q95Q25J091l36j184p42J452J542Q00L73M97j381k034
$$ 1112 191 -647 -294 515 1410 2235 3326 2990 1806 1064 2516 4058 4858 5231 5728 4347 2313
91496B313n22r42J29J485L734K126p70p17P12J855J416Q95K265N522R053J1946
$$ 2313 1791 849 978 2463 6197 8323 7553 6836 7548 9403 10819 11714 13979 19501 28554 40500
92472D0500K4340N2566J07742L2747q0902n2840l3999k4205j4670r165q439r083
$$ 40500 64840 117406 225148 257895 176993 124153 90154 65949 51279 42114 33675 24592
93205B4592o903n232l091j703q98o64m03r00n2k27j392o75o21o40J77J20j1O02
$$ 24592 17689 12457 9366 7663 6765 6101 5698 4798 4746 4519 3127 2452 1831 1191 1368 1488 1477 2079
94304B079m57m5P07J100l65j704o68l22j777j227jJ964K346O44J16q72j009p99
$$ 2079 1622 1577 2284 3384 3019 1315 647 325 -1452 -2679 -2680 -716 1630 2274 2390 1518 509 -290
95403b90m77j053k06J444K84o14k84J710o73p75q21K19J270Q87J107j245k069
$$ -290 -767 -1820 -2026 -582 -298 -912 -1196 514 -159 -934 -1755 -1536 -266 621 1728 483 -1586
96440a586P02K54o70O76M96J161J124m99j32J269M47N25p69k57J071J126j992
$$ -1586 -884 -630 -1300 -624 -128 1033 2157 1658 1526 2795 3242 3767 2998 2741 3812 4938 2946
97478B946j455k06j647k241n92R3n51J18l80j00R72m80M5N64R75m74q35J758
$$ 2946 1491 1285 -362 -2603 -3195 -3102 -3653 -3535 -3915 -4015 -3043 -3523 -3478 -2914 -1939 -2413 -3248 -1490
98577a490K150P59K290Q31M37Q2l030k665r94N93Q04o05p47M54J869L6l99l11
$$ -1490 660 1419 3709 4540 4977 5059 2029 -636 -1630 -1037 -233 -838 -1585 -1131 738 774 375 64
99675F4K68k40q64j31n12p93n03k383m31J776L58k236n60J414K112J017J222
$$ 64 332 92 -772 -903 -1415 -2208 -2711 -5094 -5525 -3749 -3391 -5627 -6187 -4773 -2661 -1644 -422
100713d22J80q23j726j159J971N95j509M3M83J117J805L61k44j79L14J367L69
$$ -422 -242 -1065 -2791 -3950 -1979 -1384 -2893 -2850 -2367 -1250 555 916 672 493 807 2174 2543
101750B543K94j76J22P40o97m60O81Q47l66l70R18L60j590j231J6j012k583j822
$$ 2543 2837 2661 2783 3523 2826 2366 3047 3894 3528 3158 4076 4436 2846 1615 1631 619 -1964 -3786
102849c786j507N90K093K187M37L6R26J619j231k594j046O05J283P14J070j306
$$ -3786 -5293 -4703 -2610 -423 14 50 976 2595 1364 -1230 -2276 -1671 -388 326 1396 90
103826I0o27K64j75k97j11J65N24J73J928K270k48p76p55k223j953r40k55J56
$$ 90 -537 -273 -448 -745 -856 -691 -167 6 1934 4204 3956 3180 2425 202 -1751 -2691 -2946 -2790
104925b790Q73J299Q33N49N75m8j29k52k79m30k5K02P69J896L53j565j586q27
$$ -2790 -1917 -618 215 764 1339 1291 1162 910 631 201 176 378 1147 3043 3396 1831 245 -582
106023e82O5J62l89N20L11J240J483K80n36n38o81k878o12J029k03j168m84q75
$$ -582 -517 -355 -744 -224 87 1327 2810 3090 2554 2016 1335 -1543 -2155 -1126 -1329 -2497 -2981 -3856
107122c856k86J385J382N39R51J089J041L62j502k774j676K87J14J201Q76P49
$$ -3856 -4142 -2757 -1375 -836 115 1204 2245 2607 1105 -1669 -3345 -3058 -2944 -1743 -867 -118
108099a18J134L24k32j98Q5o16o23J051J329r15o49q4J71J44K043J284k427j927
$$ -118 1016 1340 1108 910 995 379 -244 807 2136 1221 572 488 659 803 2846 4130 1703 -224
109197b24K63n22r48n89O24J073j123j713M51Q35J423l49n90P58K64n54q87j007
$$ -224 39 -483 -1431 -2020 -1396 -323 -1446 -3159 -2708 -1873 -450 -799 -1389 -631 -367 -921 -1808 -2815
110296b815K65L6J5J985J126j653k90O64J38J042J270j859j492R98Q37K87r90
$$ -2815 -2550 -2514 -2499 -514 612 -1041 -1331 -667 -529 513 1783 -76 -1568 -570 267 554 -436
111334d36o11O78m26j716n99k4J802K719J817k30j371n37l61o98n25L83o73k69
$$ -436 -1047 -369 -795 -2511 -3110 -3134 -1332 1387 3204 2974 1603 1066 705 7 -518 -135 -808 -1077
112432a077J77J595O85j893j485J108J631N80O10O12r72j337l60J089Q53o30K73
$$ -1077 -900 695 1380 -513 -1998 -890 741 1321 1931 2543 1571 234 -126 963 1816 1186 1459
113470A459l8L11L156L714L707M815R360K2279N0338P8284L980m6861l3794k4376
$$ 1459 1421 1732 4888 8602 12309 17124 26484 48763 99101 177385 181365 134504 100710 76334
114325G6334j9297j1868r399q261o837n275l141r28l91j778j063j570j863K71
$$ 76334 57037 45169 35770 27509 20672 15397 12256 11328 10937 9159 8096 6526 4663 4934
115179D934o05j137k0N46K88P96j122p36p46p96J051L03q20J02k62p00r32q70
$$ 4934 4329 3192 3172 3718 4006 4802 3680 2944 2198 1402 2453 2756 1936 2038 1776 1076 144 -726
116278g26P6J483K306K049k129k014j016j236n04k80o56j79J331Q69L71n30J8
$$ -726 -650 833 3139 5188 3059 1045 29 -1207 -1711 -1991 -2647 -2826 -1495 -626 -255 -785 -767
117315g67k25k99j022M31O57J320q21k40M96K66P6R69O53q73p35k96O74J678R10
$$ -767 -992 -1291 -2313 -1882 -1225 95 -726 -966 -470 -204 -128 841 1494 621 -114 -410 264 1942 2852
118475B852j39J257k57k491p56k81q55j929j289J749K137Q2J71K38J17j6r31j948
$$ 2852 2713 3970 3713 1222 466 185 -670 -2599 -3888 -2139 -2 80 251 489 606 590 -341 -2289
119574b289k09J468k86m20k4R67p30j195j27K768J996N04k105r52j62m14j003
$$ -2289 -2498 -1030 -1316 -1736 -1760 -793 -1523 -2718 -2845 -77 1919 2423 318 -634 -796 -1210 -2213
120612b213Q86K361k53q67j748k241q27O52J186N64m01m20N62P78J623l1j677
$$ -2213 -1327 1034 781 -86 -1834 -4075 -4902 -4250 -3064 -2500 -2901 -3321 -2759 -1981 -358 -389 -2066
121649b066Q9J331l33j074J562J626L34J399j325j719q6L67j160O37J035j156
$$ -2066 -1977 -646 -979 -2053 -491 1135 1469 2868 1543 -176 -262 105 -1055 -418 617 -539
122626e39n57o13Q94J814l85p10J34K33J75l06o51J58R8J111m02j410o73M09k40
$$ -539 -1096 -1709 -815 999 614 -96 38 271 446 140 -511 -353 -255 856 454 -956 -1629 -1220 -1460
123785a460m50K91R43N02l4j082j490k57M15P56J454P92j698K84j68m55J50l29
$$ -1460 -1910 -1619 -676 -174 -208 -1290 -2780 -3037 -2622 -1866 -412 380 -1318 -1034 -1202 -1657 -1507 -1836
124884a836J182j82k389k69j520j946M27K652K942K035N42N44l3j019j000q62
$$ -1836 -654 -836 -3225 -3494 -5014 -6960 -6533 -3881 -939 1096 1638 2182 2149 1130 130 -732
125861g32K80j098m29K79N92o64j38K0k88J60J789N87k087j579P95P87M76J713
$$ -732 -452 -1550 -1979 -1700 -1108 -1772 -1910 -1890 -2178 -2018 -229 358 -1729 -3308 -2513 -1726 -1250 463
126960D63l68q38J309R30p30n64k94O21n8j116p47p88Q36P19J905J134j361j645
$$ 463 95 -743 566 1496 766 202 -92 529 471 -645 -1392 -2180 -1344 -625 1280 2414 1053 -592
128058e92j113J29O88K49J334L69o35j357K90M02j376j656j467k52P59J988J373
$$ -592 -1705 -1576 -888 -639 695 1064 429 -928 -638 -236 -1612 -3268 -4735 -4987 -4228 -2240 -867
129096h67r87K10o72j58j24M63q05M62N12m17j578q97k84k91k43N10K485K732
$$ -867 -1854 -1644 -2316 -2474 -2598 -2135 -2940 -2478 -1966 -2383 -3961 -4858 -5142 -5433 -5676 -5166 -2681 51
130194E1Q60K52n94j312J03J317M73j183P26R84j743r80Nr07J610K949L84j711
$$ 51 911 1163 569 -743 -640 677 1150 -33 693 1677 -66 -1046 -1041 -1948 -338 2611 2995 1284
131293A284K12pj864n07J72N86k2L81j237p56M79O22p69j095o23J608J655j1j857
$$ 1284 1496 1489 -375 -882 -710 -124 -146 235 -1002 -1758 -1279 -657 -1426 -2521 -3144 -1536 119 108 -1749
132453a749k427J63O27J394J206K28p7o15m23j85k50J226Q19K33J693R72m32k30
$$ -1749 -4176 -4013 -3386 -1992 -786 -558 -635 -1250 -1673 -1858 -2108 -882 -63 170 1863 2835 2403 2173
133552B173K05q49j149K4N08l54r64k35J046M11k516l284k11M52k9l24N0p56j318
$$ 2173 2378 1529 380 404 912 558 -406 -641 405 816 -1700 -4984 -5195 -4743 -4772 -5096 -5046 -5802 -7120
134711g120R16J579K789J165o02o14K069J728P51r06J01J885O48r17r75m45r78
$$ -7120 -6204 -4625 -1836 -671 -1273 -1887 182 1910 2661 1755 1856 3741 4389 3472 2497 2052 1074
135749A074k276j680m85l40n30R56J460J626J468j90k154k249j3R49J57j177L24
$$ 1074 -1202 -2882 -3367 -3707 -4237 -3281 -1821 -195 1273 1083 -1071 -3320 -3333 -2384 -2227 -3404 -3080
136787c080l98j98l5j30J769l33l97j08j413J306J279K15Q49M49k30j11J29r41
$$ -3080 -3478 -3676 -3711 -3841 -2072 -2405 -2802 -2910 -4323 -3017 -1738 -1523 -674 -225 -455 -566 -437 -1378
137886a378Q79K4j003J145K231N21j14n31l48m57n25j208j602k586j194J256K594
$$ -1378 -499 -475 -1478 -333 1898 2419 2305 1774 1426 969 444 -764 -2366 -4952 -6146 -4890 -2296
138923b296J117K031L20r54j02r16M33J92j217Q01J503Q63J44O93J9k223k855
$$ -2296 -1179 852 1172 218 116 -800 -367 -175 -1392 -591 912 1775 1919 2612 2631 408 -2447
139961b447N57J704J48n40j754j90R17P89K38K88J95O4R49N29k56r47J114R38
$$ -2447 -1890 -186 -38 -578 -2332 -2522 -1605 -816 -578 -290 -95 -31 918 1447 1191 244 1358 2296
141060B296J88k95K55M14n88n36j094j508k74Q06k7L33N77J3r80j033l70o50j009
$$ 2296 2484 2189 2444 2858 2270 1734 640 -868 -1142 -336 -363 -30 547 560 -420 -1453 -1823 -2473 -3482
142219c482K00J579J338j320J22K703J64j542o47M5J277J037p05mL38O08N62j377
$$ -3482 -3282 -1703 -365 -1685 -1563 1140 1304 -238 -885 -840 437 1474 769 765 1103 1711 2273 896
143318H96j394L30K93j70Q51K12Q82K26j486o87j676j262J118l72k11K070K25
$$ 896 -498 -168 125 -45 806 1018 1900 2126 640 -47 -1723 -2985 -1867 -2239 -2450 -380 -155
144356a55j274K79R6M32J33P01L86R44K00j06n03j328J289M74r66k012n54R39
$$ -155 -1429 -1150 -1054 -622 -489 212 598 1542 1742 1636 1133 -195 1094 1568 602 -1410 -1964 -1025
145454a025J777R49P99R33m21j705K4N8k004j002N15J784J323j871k096q1q6Q01
$$ -1025 752 1701 2500 3433 3012 1307 1331 1389 -615 -1617 -1102 682 2005 134 -1962 -2043 -2129 -1328
146553a328L120K079j363k989l78j41j466n60J267J062j54q29r49L04j37P75J337
$$ -1328 1792 3871 2508 -481 -859 -1000 -2466 -3026 -1759 -697 -851 -1680 -2629 -2325 -2462 -1687 -350
147591c50J175J113k46l99M87J388L88j658k778k640q5J68J167J496R95o4J41
$$ -350 825 1938 1692 1293 1780 3168 3556 1898 -880 -3520 -3605 -3437 -2270 -774 221 157 298
148628B98o85k83M34j339q46Q67M38O0M54M36Q82j254k864o49O96J468J673j014
$$ 298 -387 -670 -236 -1575 -2421 -1554 -1116 -1056 -602 -166 716 -538 -3402 -4051 -3355 -1887 -214 -1228
149727a228m34l79J233K068j056j010n63j364k87l5P73R76J42l33R35M42P5r35
$$ -1228 -1662 -2041 -808 1260 204 -806 -1369 -2733 -3020 -3055 -2282 -1306 -1164 -1497 -562 -120 -45 -980
150826i80j217P73j110n17J057K016K09j211L18P40j35j717l3K236J162O3q00
$$ -980 -2197 -1424 -2534 -3051 -1994 22 231 -980 -662 78 -57 -1774 -1807 429 1591 1654 854
151863H54m26J17q07m05J070L78n14q9J02n77Q01J137K37r73j364j697P9N4j218
$$ 854 428 545 -262 -667 403 781 267 178 280 -297 504 1641 1878 905 -459 -2156 -2077 -2023 -3241
153023c241j161m96J183R10Q29N7r71j645p49R96J84Q98O97q4J13r00k24m06K27
$$ -3241 -4402 -4898 -3715 -2805 -1976 -1919 -2890 -4535 -5284 -4288 -4104 -3206 -2509 -2593 -2480 -3380 -3604 -4010 -3783
154183c783K482O06k61n34q52J290J210r55q11l38O68r11o00J308K830P67j408
$$ -3783 -1301 -695 -956 -1490 -2342 -1052 158 -797 -1608 -1946 -1278 -2189 -2789 -1481 1349 2116 708
155221G08j165M89j2j336p73J014j35O93J256l26j27N27j9j665p12k32j410o81
$$ 708 -457 32 20 -1316 -2089 -1075 -1210 -517 739 413 286 813 794 -871 -1583 -1815 -3225 -3906
156319c906J88M83N08N62J442K85k093j999P37J937R87k54j135j422M78N70J09
$$ -3906 -3718 -3235 -2727 -2165 -723 -438 -2531 -4530 -3793 -1856 -869 -1123 -2258 -3680 -3202 -2632 -2523
157357b523k9q13o18R11K207M53m0j031k221r4K267J193O25Q73j18p80k121j520
$$ -2523 -2552 -3365 -3983 -3072 -865 -412 -452 -1483 -3704 -3798 -1531 -338 287 1160 1042 262 -1859 -3379
158456c379k45K513R35Q14K24q03j741J46P73O58Q7J127j806j575L65O9j91N46
$$ -3379 -3624 -1111 -176 638 862 59 -1682 -1536 -763 -105 -18 1109 -697 -2272 -1907 -1838 -2029 -1483
159554a483J026q7p03P9k96j598L5Q65m88j543o28K52J206L24m94j45J944L029
$$ -1483 -457 -544 -1247 -1168 -1464 -3062 -3027 -2162 -2650 -4193 -4821 -4569 -3363 -3039 -3533 -3678 -1734 1295
160653A295K169J69k47m38j037j331k20j271r28l9j47O53p05q24J76n68R67lm37
$$ 1295 3464 3633 3386 2948 1911 580 360 -911 -1839 -1878 -2025 -1372 -2077 -2901 -2725 -3293 -2326 -2329 -2766
161813b766n86J105J648O19j1N29J678l71j387O08J137j13j585j577j28O17J768
$$ -2766 -3352 -2247 -599 20 9 538 2216 1845 458 1066 2203 2090 505 -1072 -1200 -583 1185
162850A185N27L76q4o05M23J593j16j190n68o84j59J61K49n2p5j477k37R66O33
$$ 1185 1712 2088 2004 1399 1822 3415 3299 2109 1541 857 698 859 1108 1056 981 -496 -733 233 866
164010H66J422O12R74Q19j543l99l53O62J04j035o50J225Q08q03j244m30J37O11
$$ 866 2288 2900 3874 4693 3150 2751 2398 3060 3164 2129 1479 2704 3512 2709 1465 1035 1172 1783
165109A783q65k241j949J81R26P50J580J763j522k234m31N05P58Q02j01J220J356
$$ 1783 918 -1323 -3272 -3091 -2165 -1415 165 1928 406 -1828 -2259 -1754 -996 -194 -295 925 2281
166147B281M16o21r43O77J045J48O29m04k102Q27J344M19Q07j267j542j710j805
$$ 2281 2697 2076 1133 1810 2855 3003 3632 3228 1126 1953 3297 3716 4523 3256 1714 4 -1801
167184a801O77R64K024R43j703q63l23j24M8J013J339m86l71o16K091J017o24
$$ -1801 -1124 -160 1864 2807 1104 241 -82 -206 -158 855 2194 1708 1337 721 2812 3829 3205
168222C205k065j891j005J094J931J095L5j637q41k25K08Q14N75O83M37j615j851
$$ 3205 1140 -751 -1756 -662 1269 2364 2399 762 -79 -304 -96 718 1293 1976 2413 798 -1053
169260a053L8J374o77j218J4j275q74J049J042P60l3j686r61J537Q03J422K936
$$ -1053 -1015 359 -318 -1536 -1522 -2797 -3671 -2622 -1580 -820 -853 -2539 -3500 -1963 -1160 262 3198
170297C198K414p09l400k335l32o67q2M15J777M84L0j366k120k27k3J066K77K34
$$ 3198 5612 4903 1503 -832 -1164 -1831 -1913 -1498 279 763 793 -573 -2693 -2920 -2943 -1877 -1600 -1366
171396a366l99J106P30q23j179o47N31O66J007J033J9j07M70M43o61j218r18P66
$$ -1366 -1765 -659 71 -752 -1931 -2578 -2047 -1381 -374 659 678 571 1041 1484 823 -395 -1313 -547
172494e47K109p35j159r15K7N37L50l94Q26J318J197Q61r46j319m61j259p64q54
$$ -547 1562 827 -332 -1247 -1220 -683 -333 -727 99 1417 2614 3475 2529 1210 749 -510 -1274 -2128
173593b128p76m36L4L69K561R61p97q20N56J867K139m81J50r78J55M22j106o04
$$ -2128 -2904 -3340 -3306 -2937 -376 585 -212 -1032 -476 1391 3530 3049 3199 2221 2376 2798 1692 1088
174692A088O71K074P3k310q20J227N69p28l28j575j165P63J867O39P06j058j261
$$ 1088 1759 3833 3906 1596 776 2003 2572 1844 1516 -59 -1224 -461 1406 2045 2751 1693 432
175730D32J081P01O46j976l235j479q67J98K075J878O20q31r61j65N49O47K36
$$ 432 1513 2214 2860 884 -2351 -3830 -4697 -4499 -2424 -546 74 -757 -1718 -1883 -1334 -687 -451
176767d51O65r61j295J060J784n78p13j210j159J124O69J69J459J98J059J057
$$ -451 214 -747 -2042 -982 802 224 -489 -1699 -2858 -1734 -1065 -896 563 761 1820 2877
177744B877r44k399k067J185J118J270J318j026j556j598M73O88k73K97k92j290
$$ 2877 1933 -466 -2533 -1348 -230 1040 2358 1332 -224 -1822 -1349 -661 -934 -637 -929 -2219
178720b219J03J13K83R28Q14L46M83R58o41l52m21n44j116j546l5j84l05Q89J240
$$ -2219 -2116 -2003 -1720 -792 22 368 851 1809 1168 816 395 -149 -1265 -2811 -2846 -3030 -3335 -2446 -1206
179880a206J031j123j212j069j071K76K752J797M44j491j616m14J02k98O41J06
$$ -1206 -175 -1298 -2510 -3579 -4650 -4374 -1622 175 619 -872 -2488 -2902 -2800 -3098 -2457 -2351
180857b351J725J129K24J185P38k123n55J074k17j083J509J250p34K4Q87J925
$$ -2351 -626 503 727 1912 2650 527 -28 1046 829 -254 1255 2505 1771 1795 2682 4607
181834D607J367l16l118l580k37R8l59J063J418M16k10l14N80M46m62o44N5J97
$$ 4607 5974 5658 2540 -1040 -1277 -1179 -1538 -475 943 1359 1149 835 1415 1861 1399 755 810 1007
182932A007K066K319m71k081j491J75j655k613J63R88N08O30J082p39j519q62
$$ 1007 3073 5392 4921 2840 1349 1524 -131 -2744 -2581 -1593 -1085 -455 627 -112 -1631 -2493
183909b493J78j35R71M70j82m95K90J7k57R54K37J022M62j25o64j84N2J020j448
$$ -2493 -2315 -2450 -1479 -1009 -1191 -1686 -1396 -1379 -1636 -682 -445 577 1039 914 250 66 118 1138 -310
185069c10j370j25J92n14j932k002J16K751J133p53p08O98l79p74J357P02J296
$$ -310 -1680 -1805 -1613 -2127 -4059 -6061 -5945 -3194 -2061 -2814 -3522 -2824 -3203 -3977 -2620 -1918 -622
186106f22Q35j369n75L48j871j249J378M60J128K740J394k4j30k99p10j557k983
$$ -622 213 -1156 -1731 -1383 -3254 -4503 -3125 -2665 -1537 1203 2597 2573 2443 2144 1434 -123 -3106
187144c106j311K307K462O3J26Q98k5N09L80q20j158q1j403l66M06l59L53J108
$$ -3106 -4417 -2110 352 415 541 1439 1414 1923 2303 1483 325 244 -1159 -1525 -1119 -1478 -1125 -17
188242a7R4j947j152M56l3P48J808J376q02q98N09K28j087m00J276N23j085l59
$$ -17 77 -1870 -3022 -2566 -2599 -1851 -43 1333 531 -367 142 370 -717 -1117 159 682 -403 -762
189341g62J113Q24j30j050k65K35J90N36M16l35Q35M25J205r0j719K48k49k446
$$ -762 351 1175 1045 -5 -270 -35 155 691 1107 772 1607 2032 3237 3147 1428 1676 1427 -1019
190440a019j326J711N47M26J020J0q82N70p57j792r88J442K160J135K44M90J686
$$ -1019 -2345 -634 -87 339 1359 1369 487 1057 300 -1492 -2480 -1038 1122 2257 2501 2991 4677
191478D677R16p12j729k95j729j238j56j68J55k19k04j246J57J457K008L37j038
$$ 4677 5593 4881 3152 2857 1128 -110 -266 -434 -279 -498 -702 -1948 -1791 -334 1674 2011 973
192515I73j293K29J089J11O48o3k46L49O81l3j322j489j703k030n02J958O06R46
$$ 973 -320 -91 998 1109 1757 1694 1448 1797 2478 2445 1123 -366 -2069 -4099 -4601 -2643 -2037 -1091
193614a091J577R5m52j956j153K98J815Q70l54Q98m24j240J39J090J894K48o3
$$ -1091 486 581 129 -1827 -2980 -2682 -867 3 -351 547 123 -1117 -978 112 2006 2254 2191
194652B191p35p65R70J988K000m95k734k720o54N51k60j468R77L290P62J41r4
$$ 2191 1456 691 1661 3649 5649 5154 2420 -300 -954 -403 -663 -2131 -1154 2136 2898 3039 2945
195689B945j486j641k30J670R59Q4m12j525M3r3m16J95J114k90m9O73M22j373
$$ 2945 1459 -182 -412 1258 2217 2301 1889 364 407 314 -102 93 1207 917 868 1541 1963 590
196788E90j600j477l35n44L99J725M67M45R66m7J837J752M11p96j825j617j145
$$ 590 -1010 -2487 -2822 -3366 -2967 -1242 -775 -330 636 589 2426 4178 4589 3793 1968 351 -794
197826g94J748K807K441K305J132j213k344o45O39J761L086L620O236J2836K2469
$$ -794 954 3761 6202 8507 9639 8426 6082 5437 6076 7837 10923 14543 20779 33615 56084
198741E6084M2433J01798J89716n113j21011p7584n2570l3850j9775j5909j5048
$$ 56084 98517 200315 390031 384918 263907 186323 133753 99903 80128 64219 49171
199413D9171j1755r644o695k810k41j861k363j409j112j577k112j433j647q62
$$ 49171 37416 27772 21077 18267 18026 16165 13802 12393 11281 9704 7592 6159 4512 3650
200267C650L5O28N20M30j58l0P02m54p29m29j433j54l68j391j075q19O48K466
$$ 3650 3685 4313 4833 5263 5105 5075 5777 5323 4594 4165 2732 2578 2210 819 -256 -1075 -427 2039
201366B039J335q93k181j420p73n03O58j729j269o64J764K590N81k327p55J491
$$ 2039 3374 2481 300 -1120 -1893 -2396 -1738 -3467 -4736 -5400 -3636 -1046 -465 -2792 -3547 -2056
202343b056K938J23j698n88J012K51j466j49p66j088K71J14J60Q42J13P61J107
$$ -2056 882 1005 -693 -1281 -269 -18 -1484 -1633 -2399 -3487 -3216 -3102 -2942 -2100 -1987 -1226 -119
203380a19L97j724j660M75J690P72o1j110n7J865Q23K95O0j472n46J271P9p35
$$ -119 278 -1446 -3106 -2631 -941 -169 -230 -1340 -1397 468 1291 1586 1646 174 -372 899 978 243
204479B43m96K74J003K84j535l4O89K05J31o55m92M24O2J59K122L75k216r57O30
$$ 243 -253 21 1024 1308 -227 -261 428 633 764 109 -383 41 103 262 2384 2759 543 -414 216
205639B16L84o69j385j478J308J781o21r23P79N60K1m02L40J678J198j60j256
$$ 216 600 -69 -1454 -2932 -1624 157 -464 -1387 -608 -48 -27 -429 -89 1589 2787 2627 1371
206676A371o55L93j805j409m85j276m37J760K134K775O6j828j698j185p66j240
$$ 1371 716 1109 -696 -2105 -2590 -3866 -4303 -2543 -409 2366 2432 604 -1094 -2279 -3045 -4285
207653d285N21J818M01k143l36J853J26j151r25J72K766J372M10L82K47m07j743
$$ -4285 -3764 -1946 -1545 -3688 -4024 -2171 -2045 -3196 -4121 -3949 -1183 189 599 981 1228 821 -922
208691i22k585j670Q69J316o20l86Q91J932J097j125j457M00n13n90R47J663O47
$$ -922 -3507 -5177 -4308 -2992 -3612 -3998 -3107 -1175 -78 -1203 -2660 -2260 -2773 -3363 -2416 -753 -106
209728a06q26K02Q12J400M44j860k379j447p32q24J073R12Q06j19n90N02J384
$$ -106 -932 -730 82 1482 1926 66 -2313 -3760 -4492 -5316 -4243 -3331 -2525 -2644 -3234 -2732 -1348
210766a348J978m59q70k85J449J958P72j4o15J99n62j899j145p48M9R84j164m49
$$ -1348 630 171 -699 -984 465 2423 3195 3181 2566 2765 2203 304 -841 -1589 -1540 -556 -1720 -2169
211864b169N09J655P45J76J61R38N23k57m65k264q36J240M94K94p00q46N02m94
$$ -2169 -1660 -5 740 916 1077 2015 2538 2281 1816 -448 -1284 -44 450 744 44 -802 -300 -794
212963g94L23J251J182L73j388n59n67j151q46P88J221j500j289N89J307J370
$$ -794 -471 780 1962 2335 947 388 -179 -1330 -2176 -1388 -167 -1667 -2956 -2367 -1060 310
213940C10J5N37n0j797j04Q93j198j330p23J113j38k0R40N11J103k49r16j012
$$ 310 325 862 812 -985 -1089 -196 -1394 -2724 -3447 -2334 -2472 -2492 -1552 -1041 62 -187 -1103 -2115
215039b115J35L32K448K137J203q81p91j094j043Q94P26j5p16k298j727j012m77
$$ -2115 -1980 -1648 800 2937 4140 3259 2468 1374 331 1225 1951 1936 1220 -1078 -2805 -3817 -4294
216076d294M02q5J84L4M84K430O93r80M02j9j851m55P29Q3L83P59Q27p7J76j79
$$ -4294 -3892 -3977 -3793 -3759 -3275 -845 -152 -1132 -730 -749 -2600 -3055 -2326 -2243 -1860 -1101 -274 -351 -175 -354
217297c54k00j497j770O03K41l96j266o09J730J120L09m4j95r0K27Q57J256M67
$$ -354 -554 -2051 -3821 -3218 -2977 -3373 -4639 -5248 -3518 -2398 -2089 -2133 -2328 -2418 -2191 -1334 -78 389
218396C89j262m29l2m51l63J68J376K42j477m84J437O92K85j407j795l0O54N82
$$ 389 -873 -1302 -1334 -1785 -2148 -1980 -604 -362 -1839 -2323 -886 -194 91 -1316 -3111 -3141 -2487 -1905
219494a905J77J512J963O33r28j801o09p07j228K13p1K657K840m66k776k124M74
$$ -1905 -1728 -216 1747 2380 1452 -349 -958 -1665 -2893 -2680 -2751 -94 2746 2280 -496 -2620 -2146
220532b146M12k81j360p47M37J379O54k03j60p8J624K110l86o72R59l50j594n85
$$ -2146 -1734 -2015 -3375 -4122 -3685 -2306 -1652 -1855 -2015 -2093 -469 1641 1255 583 1542 1192 -402 -987
221631i87n57Q98O19K28J733J164m90j78J147j67j470k746k978l02K039J077m47
$$ -987 -1544 -646 -27 201 1934 3098 2608 2430 3577 3410 1940 -806 -3784 -4086 -2047 -970 -1417
222669a417O11k85o2J470J726N75j346j730j329R66P07k162j065J587J951J210
$$ -1417 -806 -1091 -1153 317 2043 2618 1272 -458 -1787 -821 -114 -2276 -3341 -1754 197 1407
223645A407j500j812p91J863Q47J44j0l35r83j532O39K102K05M12K33l99Oq6K10
$$ 1407 -93 -1905 -2696 -833 14 158 148 -187 -1170 -2702 -2063 39 244 656 889 490 496 410 620
224805F20j089j836P05J151l04k044j134J34J341R00o84j10J106J806J001P09
$$ 620 -469 -2305 -1600 -449 -753 -2797 -3931 -3797 -2456 -1556 -2240 -2350 -1244 562 1563 2272
225782B272J610j038l68k05R47Q47K18L17J190j015j001j884l58P30r11k059n55
$$ 2272 3882 2844 2476 2271 3218 4065 4283 4600 5790 4775 3774 1890 1532 2262 1351 -708 -1263
226819a263n62J681K346J19K33R72m50q06j80Q40j73j058j83M72j23J004n66j808
$$ -1263 -1825 -144 2202 2321 2554 3526 3076 2270 2090 2930 2757 1699 1516 1988 1865 2869 2303 495
227918D95q10k31J16L9j52P18L64k67j267L53J206K12Q0K07K68k2n2k190j949
$$ 495 -315 -546 -430 -391 -543 175 539 272 -995 -642 564 776 856 1063 1331 1309 1257 -933 -2882
229078b882J085l66j632J29j87O94mq0J028K088J434O72R2j233q84m23P61J082
$$ -2882 -1797 -2163 -3795 -3666 -3853 -3159 -3163 -3243 -2215 -127 1307 1979 2071 838 -46 -469 292 1374
230176A374k94p7J6k30Q32J094P88p54m91J21N42r07K20j66k156r80o25J13J621
$$ 1374 1080 1003 1019 789 1621 2715 3503 2749 2258 2379 2921 2014 2234 2068 -88 -1068 -1693 -1580 41
231336D1J138O65k74j038O43j386k374p13J872J786O23k93J58L0J4l76q61L11
$$ 41 1179 1844 1570 532 1175 -211 -2585 -3298 -1426 360 983 690 848 878 892 516 -345 -34
232435c4L92l71o67j95j69k03j04o07P28J710J45j446k039p9Q45Q65Q80P33P60
$$ -34 358 -13 -680 -875 -1044 -1247 -1351 -1958 -1230 480 625 -821 -2860 -2939 -2094 -1229 -349 384 1144
233594A144m49r73M3J40O01q67j879l56J267J374R76l04o7o83Q1j82k23J559J524
$$ 1144 695 -278 -235 -95 506 -361 -2240 -2596 -1329 45 1021 717 650 -33 48 -134 -357 1202 2726
234754B726J338k009l461j790J59j80J420J940k95n86K02K031n24j339p27k52
$$ 2726 4064 2055 -1406 -3196 -3037 -3217 -1797 143 -152 -738 -536 1495 971 -368 -1095 -1347
235731a347J053J90k02Q62M11j271r50J412J236L45R8n34j73j5J40o98m84o75
$$ -1347 -294 -104 -306 556 967 -304 -1254 158 1394 1739 1837 1303 1130 1115 1255 557 73 -602
236830f02P54O43Q84o97k134j397O00O37j462j200N49M40j171l6J501L107J618
$$ -602 152 795 1679 982 -1152 -2549 -1949 -1312 -2774 -3974 -3425 -2985 -4156 -4192 -2691 416 2034
237867B034N4q54Q46J154Q64j474j812p50n4M5l07L45R41N51r60m89M81R85q9
$$ 2034 2088 1234 2080 3234 4098 2624 812 62 8 53 -254 91 1032 1583 623 134 615 1600 1511
239027A511M37o36j527j288n8R09O41Q96q11r29m70r17j734l61J784M169K707
$$ 1511 1948 1312 -215 -1503 -1561 -652 -11 885 74 -855 -1325 -2242 -3976 -4337 -2553 1616 4323
240065D323l52k343j083Q45n65k429j618j305j26J231m21o59R34J466J430O70
$$ 4323 3971 1628 545 1390 825 -1604 -3222 -4527 -4653 -3422 -3843 -4502 -3568 -2102 -672 -2
241041bQ03k14l64N1j66k37q96m81J103K86p69m02n28j054j16J775J254J54j06
$$ -2 801 587 223 274 108 -129 -1025 -1506 -403 -117 -886 -1288 -1816 -2870 -2986 -1211 43 197 91
242201I1n31Q15k6o09J75R87J074K64R1k664j418P26J604p84m43Q22J015R24N58
$$ 91 -440 375 349 -260 -85 902 1976 2240 2331 -333 -1751 -1025 579 -205 -648 174 1189 2113 2671
243361B671p46p99MR02l27k178l77P05K2O2P10j49o86j44q4j109J993K466K87
$$ 2671 1925 1126 1130 2032 1705 -473 -850 -145 -123 -61 649 500 -186 -330 -414 -1523 470 2936 3223
244520C223o75K03j892j271N32n2nm70j05l80r13r30m5L180J333k80k309o14J775
$$ 3223 2548 2751 859 -412 120 68 63 -407 -512 -892 -1805 -2735 -2780 400 1733 1453 -856 -1470 305
245680C05J96m17j299j643q61Q95J180R13J198K47r39p85l64m18o75m03RR01J612
$$ 305 501 84 -1215 -2858 -3719 -2824 -1644 -731 467 714 -225 -1010 -1374 -1792 -2467 -2870 -2861 -1960 -348
246840c48J020p40p11L04J337J339K53l34NL66q52N5r05j351m82j982k255J056
$$ -348 672 -68 -779 -475 862 2201 2454 2120 2125 2491 1639 1694 789 -562 -1044 -3026 -5281 -4225
247938d225J727k96n63P85M53L59Q85Q23N24r3J405Rn35J594m47j760j516r91
$$ -4225 -2498 -2794 -3357 -2572 -2119 -1760 -875 -52 472 379 1784 1793 1258 2852 2405 645 -871 -1862
249037a862O17J243N8J168M77L39j88q13k397j311m58n18N9kM86mJ128J366M80
$$ -1862 -1245 -2 56 1224 1701 2040 1852 1039 -1358 -2669 -3127 -3645 -3586 -3588 -3102 -3106 -1978 -612 -132
250197a32K01p09n94J81K75L40o34n56j052j189Q32J410J062m03j931j281p56
$$ -132 69 -640 -1234 -1053 -778 -438 -1072 -1628 -2680 -3869 -3037 -1627 -565 -968 -2899 -4180 -4936
251235d936J606K372Q22P56J625j51j501j685j028p25o19l53K79P47o7Q59k62
$$ -4936 -3330 -958 -136 620 2245 2094 593 -1092 -2120 -2845 -3464 -3817 -3538 -2791 -2858 -1999 -2261
252272b261N24L47j44P85J29p69q52Q42J217J083J639P29l66l06j314j049O57
$$ -2261 -1737 -1390 -1534 -749 -620 -1389 -2241 -1399 -182 901 2540 3269 2903 2597 1283 234 891
253310H91R82L30k51j047r09j155m13J129R6j487l79M82o43k24J818O74m38p51
$$ 891 1873 2203 1952 905 -4 -1159 -1572 -443 -347 -1834 -2213 -1731 -2374 -2598 -780 -106 -544 -1295
254409a295j595l78K22o45L00J755J198P61j028p27P65P86J164Q81r31l59N32
$$ -1295 -2890 -3268 -3046 -3691 -3391 -1636 -438 323 -705 -1432 -667 119 1283 2164 1233 874 1406
255446A406J140J033K2k503k263j356k16R17q73j066L39j3Q2O18J319P80j433
$$ 1406 2546 3579 3601 1098 -1165 -2521 -2737 -1820 -2693 -3759 -3420 -3433 -3351 -2733 -1414 -634 -2067
256484b067j283j211J175K200J671Q49J965Pr41k801k007j305p24N22J209J086
$$ -2067 -3350 -4561 -3386 -1186 485 1334 3299 3306 2365 -436 -2443 -3748 -4472 -3950 -2741 -1655
257461a655J438J169J576J554m93k31M06j153p49M8N71K33j079R07P9j121n66
$$ -1655 -217 952 2528 4082 3589 3358 3764 2611 1862 1910 2481 2714 1635 2542 2621 1500 934
258498I34J213L26l5o75L35k16k98o12n28k94N50J380Q95n22j894n93J042L1q47
$$ 934 2147 2473 2438 1763 2098 1882 1584 972 444 150 700 2080 2975 2453 559 -34 1008 1039 192
259658A92j63l48j492O15K043J366P09j391n73m87j08j109n97Q22R26j83P53l9
$$ 192 29 -319 -1811 -1196 847 2213 2922 1531 958 471 363 -746 -1343 -521 405 222 975 936
260757I36r31J077k36j408J366K080k64j446j39Q95M65R41K58p50M74J44j933
$$ 936 5 1082 846 -562 804 2884 2620 1174 1035 1930 2395 3336 3594 2844 3318 3462 1529
261795A529j246j425N32J45j574l01J136J257J446J77l43J171N2r23j278k18k4
$$ 1529 283 -1142 -610 -465 -2039 -2340 -1204 53 1499 1676 1333 2504 2556 1633 355 137 113
262832A13j58j466j793L70J053n89l80J465Q06O41Q15O8m04m7Q71j02m91j508
$$ 113 -45 -1511 -3304 -2934 -1881 -2470 -2850 -1385 -579 62 877 945 541 494 1365 1263 772 -736
263931g36m35L5K3j052k48l79J367J880K67m83k299M48J720M80j015j159k365
$$ -736 -1171 -1136 -1113 -2165 -2413 -2792 -1425 455 722 239 -2060 -1612 108 588 -427 -1586 -3951
264968c951k17R60M99J915K731J013O85R31j323k098j706j028l46Q7q5m00n25
$$ -3951 -4168 -3208 -2709 -794 1937 2950 3635 4566 3243 1145 -561 -1589 -1935 -1848 -1933 -2333 -2858
266006b858J640J150o72q84j467j584Q63J036P68K763J310n2n92j665j71o74K26
$$ -2858 -1218 -68 -740 -1624 -3091 -4675 -3812 -2776 -2008 755 2065 2013 1421 -244 -415 -1089 -863
267044h63Q60M41j175j156J130N6L02J76J73K49J772p1k287j744n49P59J651J635
$$ -863 -3 438 -737 -1893 -763 -707 -405 -229 -56 193 1965 1894 -393 -2137 -2686 -1927 -276 1359
268142A359j065j210J035Q31P07P75j30j174Q0k7j307k006j849L16R04M69J324
$$ 1359 294 -916 119 950 1657 2432 2302 1128 1208 1181 -126 -2132 -3981 -3665 -2761 -2292 -968
269180i68K052N98k07r95M53j38K72L0j122O3m52N05Q82J90j57p64k124j031J65
$$ -968 1084 1682 1475 480 933 795 1067 1097 -25 38 -414 91 973 1163 1006 242 -1882 -2913 -2748
270340b748r6R1o7M7P91k39j722j054J861J820J193J019J342Q74J421p07j822
$$ -2748 -2844 -2753 -2820 -2773 -1982 -2221 -3943 -4997 -3136 -1316 -123 896 2238 3112 4533 3826 2004
271378B004j168j150j23j49K58j262o40R17R94J51L7M59j74j222n73n70j191J035
$$ 2004 836 -314 -437 -586 -328 -1590 -2230 -1313 -319 -168 -131 328 154 -1068 -1641 -2211 -3402 -2367
272476b367J686J318N42J031o71j767q4L06k014j584j523J421K878J547K3J10
$$ -2367 -681 637 1179 2210 1539 -228 -312 -6 -2020 -3604 -5127 -3706 -828 719 742 852
273453H52p8j356m34J02J273J636J265K92J05o81j567M45J17J542O90j187j209
$$ 852 774 -582 -1016 -914 359 1995 3260 3552 3657 2976 1409 1854 1971 3513 4203 3016 1807
274491A807m92J89j330j353j191P25O60l9k340j565J168J036Q02J324J799J703
$$ 1807 1315 1504 174 -1179 -2370 -1645 -985 -1024 -3364 -4929 -3761 -2725 -1923 -599 1200 2903
275467B903M47j584j459J90J780M05q72n52J421N12j395k282n39J023J887O36
$$ 2903 3350 1766 307 497 2277 2682 1810 1258 2679 3191 1796 -486 -1025 -2 1885 2521
276444B521L25j048k107o42O03k21L28K60j79L5L24L63l12N70K59p98q23O89J416
$$ 2521 2846 1798 -309 -951 -348 -569 -241 19 -160 -125 199 562 250 820 1079 281 -542 147 1563
277604A563Q80p79l40l40k126j205M87k75j116j714K122J901n46j133j184L48
$$ 1563 2443 1664 1324 984 -1142 -2347 -1860 -2135 -3251 -4965 -2843 -942 -1488 -2621 -3805 -3457
278580c457j518m44M95j01p3J097J900L47j229j368p6j74K28J529R48j9q48j217
$$ -3457 -4975 -5419 -4924 -5025 -5098 -4001 -2101 -1754 -2983 -4351 -4427 -4601 -4373 -2844 -1896 -1915 -2763 -3980
279679c980q49R9J26J360J349j251q21L9O48J270J303k55j204J249J035j09k3
$$ -3980 -4829 -4730 -4604 -3244 -1895 -3146 -3967 -3928 -3280 -2010 -707 -962 -2166 -917 118 9 -14
280716a4J62o29N47J44j238P18K00N09N94j524L10J997K40o59Qn4l96l33m15J187
$$ -14 148 -481 66 210 -1028 -310 -110 399 993 -531 -221 1776 2016 1357 1365 1311 915 582 167 1354
281937A354K5j631j356J154M99o69m27p60m18k93P14J815J603L72j946k398m17
$$ 1354 1379 -252 -1608 -454 45 -624 -1051 -1811 -2229 -2522 -1808 7 1610 1982 36 -2362 -2779
282975b779r31l15J517K357J700J446n4j364j928j165K42J831K551Q95q46j726
$$ -2779 -3710 -4025 -2508 -151 1549 2995 2941 1577 -351 -1516 -1274 557 3108 4003 3157 1431
283952A431q37j834k065Q67J570J388R90J74k467j381m57j63O12J619J890K038
$$ 1431 594 -1240 -3305 -2438 -868 520 1510 1684 -783 -2164 -2621 -2784 -2172 -553 1337 3375
284928C375p50j360O42J08p17j165q14L46M51o0K43J26K86J899K481O51k035j290
$$ 3375 2625 1265 1907 2015 1298 133 -681 -335 116 56 299 425 711 2610 5091 5742 3707 2417
286027B417n05j575j445o07P94J973J476J97l50k00O32l73K78K39M8O22j438n80
$$ 2417 1912 337 -1108 -1715 -921 1052 2528 2725 2375 2175 2807 2434 2712 2951 2999 3621 2183 1603
287125A603N34M80r96j031P04N82J90L9o81p64J34lL33j24J21j358j377n96m73
$$ 1603 2137 2617 1621 590 1294 1876 2066 2105 1424 660 794 791 1124 1000 1121 -237 -1614 -2210 -2683
288285b683J430J385J633O14j342r5K412J175n97K661L614O274J6257L0000K6613
$$ -2683 -1253 132 1765 2379 1037 942 3354 4529 3932 6593 10207 16481 32738 62738 89351
289201H9351n16j2399j2635j0790p417m344o034p429o017m156k893j431p31m0
$$ 89351 88835 76436 63801 53011 45594 41250 35216 27787 21770 17614 14721 13290 12559 12519
290055A2519r60k109k038k288O6K641K991K820N135J3275K5891L0067N574r979
$$ 12519 11559 9450 7412 5124 5190 7831 10822 13642 18777 32052 57943 88010 93584 83605
290910H3605j2314j1932q667o437p340p207m900m935l457j972j46j593k812j700
$$ 83605 71291 59359 50692 44255 36915 29708 24808 19873 16416 14444 14298 12705 9893 8193
291764H193N63J845J662j68J51L096O277J2012K2435K9958R363r914j3450j1407
$$ 8193 8756 10601 12263 12095 12246 15342 21619 33631 56066 86024 95387 85473 72023 60616
292619F0616q859o117m423m611n089n209o022l241j103M65j065k487l209r74j116
$$ 60616 51757 45640 41217 36606 31517 26308 20286 17045 15942 16407 15342 12855 9646 8672 7556
293534G556j71j88j693m75N4n85p2Q88R33N28K30N03N11j262k152q52J484J699
$$ 7556 7385 7197 5504 5029 5083 4498 4426 5314 6247 6775 7005 7508 8019 6757 4605 3753 5237 6936
294633F936Q7K59m71n40j071q66l69q18j836Q02J554L42j461j91N25K628J935
$$ 6936 7023 7282 6811 6271 5200 4334 3965 3147 1311 2113 3667 4009 2548 2357 2882 5510 7445
295671G445k495j458p58q52J35m05r14P37J39K136J067r47j714p98o78K3J770
$$ 7445 4950 3492 2734 1882 2017 1612 698 1435 1574 3710 4777 3830 2116 1318 640 663 2433
296709B433l02J56Q32l09k431j588L53K319R99P04q55j721q19j378n9K45K97j179
$$ 2433 2131 2287 3119 2810 379 -1209 -856 1463 2462 3166 2311 590 -229 -1607 -1666 -1421 -1124 -2303
297807b303L03K022K135J768j65p65q06q17n6P56J015P42n27j815j157j10K57
$$ -2303 -2000 22 2157 3925 3760 2995 2189 1372 1316 2072 3087 3829 3302 1487 330 220 477
298845D77J485J650J34R76P6k053j019j029j76j197j391N09K818M06j95L24r4
$$ 477 1962 3612 3746 4722 4798 2745 1726 697 521 -676 -2067 -1558 1260 1666 1471 1795 1701
299883A701j254n55P0q27k56j839L63J052N30j33l02J417J706Q56q8K1Q0L88K67
$$ 1701 447 -108 -38 -865 -1121 -2960 -2597 -1545 -1015 -1148 -1450 -33 1673 2529 2441 2462 2542 2930 3197
301042C197m88Q51K995J589J923n1j885m469k967r41P56N80n71q80P85K479J619
$$ 3197 2709 3560 6555 8144 10067 10016 8131 3662 695 -246 510 1090 519 -361 424 2903 4522
302080D522M26n49j173n91k69L57L6P97n23j436o17q74L20J586K741K58n71j346
$$ 4522 4948 4399 3226 2635 2366 2723 2759 3556 3033 1597 980 106 426 2012 4753 5011 4440 3094
303179C094j546k7j5o97J072P67j6j700l578n72K982L090l06k850j529M50m85
$$ 3094 1548 1521 1506 809 1881 2648 2632 932 -2646 -3218 -236 2854 2548 -302 -1831 -1381 -1866
304216a866j903l22m21j002O61M6J443K163J532P05J868J550O2j581l99n38K96
$$ -1866 -3769 -4091 -4512 -5514 -4853 -4807 -3364 -1201 331 1036 2904 4454 4516 2935 2536 1998 2294
305254B294P83K03k608k082k0Q41p68Q05K470K298j79k607j436r32l61M55m84
$$ 2294 3077 3280 672 -1410 -1430 -589 -1357 -552 1918 4216 4037 1430 -6 -938 -1299 -844 -1328
306292a328k1K34K45n79R79J28o16j054j286N97J504J441k62o7M25J368J61k393
$$ -1328 -1349 -1115 -870 -1449 -470 -342 -958 -2012 -3298 -2701 -1197 244 -18 -85 340 1708 1869 -524
307390e24j618j685m9K098P61n8J663J081J108J694l67j823j240j09L54L51l52
$$ -524 -2142 -3827 -3876 -1778 -1017 -1075 588 1669 2777 4471 4104 2281 1041 932 1286 1637 1285
308428A285k81j25n95q38k09J089r15j256n54n06K74L75J613R37m8J665M20L02
$$ 1285 1004 879 284 -554 -763 326 -589 -1845 -2399 -2905 -2631 -2256 -643 294 246 1911 2331 2633
309527B633R57j64o71L27O48R94K02j059j757j546p3J337K086O18l37p63j366
$$ 2633 3590 3426 2755 3082 3730 4724 4926 3867 2110 564 491 1828 3914 4532 4195 3432 2066
310565B066l446l484L7M543L097q5n23P43J305r07k381j467j657Q99j43L76R47
$$ 2066 -1380 -4864 -4827 -284 2813 2728 2205 2948 4253 3346 965 -502 -2159 -1260 -1403 -1027 -80
311602h0k508j817J91J146J035M05K93L00J108O28j33k303m64J483K250j192j923
$$ -80 -2588 -4405 -4214 -3068 -2033 -1628 -1335 -1035 73 701 568 -1735 -2199 -716 1534 342 -1581
312640a581j481j26q7M84O60N62J25L04n53R65K431J695J94p19p73j014K86k2
$$ -1581 -3062 -3188 -3275 -2791 -2131 -1569 -1444 -1140 -1693 -728 1703 3398 3592 2873 2100 1086 1372 1350
313738A350M16J053N71n70j653j187O24Q33J533J215Q1J188j056j065O64j362
$$ 1350 1766 2819 3390 2820 1167 -20 604 1437 2970 4185 4266 5454 4398 3333 3997 2635
314715B635o83J1j084M49l4N19J146l3l66l36k99j031n05l15J231Q31j65Q42j414
$$ 2635 1952 1963 879 1328 1294 1813 2959 2926 2560 2224 1925 894 389 74 1305 2136 1971 2813 1399
315875A399k075K4J205N11M27J646m0r6R70q81j402J045N35j700j974R97J147
$$ 1399 -676 -652 553 1064 1491 3137 3097 3001 3971 3090 1688 2733 3268 1568 -406 591 1738
316912A738j65m7K8r62j294N35J369J620P21o99k097l06Q46M24K87O22J301l75
$$ 1738 1573 1526 1554 592 -702 -167 1202 2822 3543 2844 747 441 1287 1711 1998 2620 3921 3546
318011C546j595j754q97j58R56L54q01L19K690J659J26l30r35j850k592n6K014
$$ 3546 1951 197 -700 -858 98 452 -349 -30 2660 4319 4445 4115 3180 1330 -1262 -1318 696
319049F96J613m52j849j555j4j0K924J010j682l3J129j014K89m24j382j158P04
$$ 696 2309 1857 8 -1547 -1561 -1571 1353 2363 681 648 1777 763 1052 628 -754 -1912 -1208
320087a208J850J446q25l501k18J620k2j573k140J30R16Q54P60J847J244J584
$$ -1208 642 2088 1263 -2238 -2456 -836 -858 -2431 -4571 -4441 -3525 -2671 -1911 -64 1180 2764
321063B764J416o12j091r36n91L39J604k99j184n60l09K17N62J88m42j249N45
$$ 2764 4180 3568 2477 1541 950 1289 2893 2594 1410 850 541 758 1320 1508 1066 -183 362
322101C62Q72L1J396J396O80p9k379o58J210o21p33o39j42l16R8k93Q24J250o9
$$ 362 1234 1265 2661 4057 4737 4658 2279 1621 2831 2210 1477 838 696 380 478 185 1009 2259 2190
323261B190r36K33N62j166j151J010M9j301K45M93l31j267N48Q26P22O13L05m3
$$ 2190 1254 1487 2049 883 -268 742 791 -510 -265 228 -103 -1370 -822 4 726 1339 1644 1601
324359A601M82l81j311R34J716m36p07O76p52k43J60J27m00j41pl19J537J266
$$ 1601 2083 1702 391 1325 3041 2605 1898 2574 1822 1579 1739 1866 1466 1325 1318 999 2536 3802
325458C802j631j039m58n56K09n16o83q75k26m14M9J711J048l55J23R6Q6R11M07
$$ 3802 2171 1132 674 118 327 -189 -872 -1747 -1973 -2387 -2338 -627 421 66 189 285 371 1282 1689
326618A689J20P75K51j290j309O37L12L65J144Q70m98N32n15k70k58n11j573o46
$$ 1689 1809 2584 2835 1545 236 873 1185 1550 2694 3564 3066 3598 3083 2813 2555 2044 471 -175
327716a75k12J115J890J095p33k245jJ675R23P23k67r70K12K12l34J124J172j686
$$ -175 -387 728 2618 3713 2980 735 734 2409 3332 4055 3788 2818 3030 3242 2908 4032 5204 3518
328815C518l064j164J50RK38l51N52K08r22k024j055j95J694K417j68n00r88o4
$$ 3518 454 -710 -560 -551 -313 -664 -112 96 -826 -2850 -3905 -4100 -2406 11 -157 -657 -1645 -1709
329914a709R30j65J855J028n19q69l37R91J377m9j03r80q86Q35J739J59Q53o01
$$ -1709 -779 -944 911 1939 1420 551 214 1205 2582 2533 2430 1450 564 1399 3138 3297 4150 3549
331012C549j043J77o19j286J949p43k213k72J325j9R10J072j037j992l36O81J886
$$ 3549 2506 2683 2064 778 2727 1984 -229 -501 824 805 1715 2787 1750 -242 -578 103 1989
332050A989K506O36J77p56j617o5o41o93p72j64j59m41k45l57p55p47p93N3J127
$$ 1989 4495 5131 5308 4552 2935 2870 2229 1536 764 600 441 0 -245 -602 -1357 -2104 -2897 -2844 -1717
333210a717J761Q47J070L4J402j496j544l3N33J087L30k02k81j206m77P65N7j300
$$ -1717 44 891 1961 1995 3397 1901 357 324 857 1944 2274 2072 1791 585 108 873 930 -370
334309c70J519Q76k178j527R56M98r96p37l22n08J32P57Rk75J073J139Q19O65
$$ -370 1149 2025 -153 -1680 -724 -226 -1222 -1959 -2281 -2789 -2657 -1900 -1891 -2166 -1093 46 865 1530
335407A530n80M34Q0k353p04R17J581Q42j7J377p29j335m68o17P4%K33m17r05
$$ 1530 950 1384 1464 -889 -1593 -676 905 1747 1730 3107 2378 1043 575 -42 32 32 265 -152 -1057
336567a057J306P06p61j272j974r84J644K286K72K34J497j156k040j622j471j47
$$ -1057 249 955 194 -1078 -3052 -4036 -2392 -106 166 400 1897 741 -1299 -2921 -4392 -4539
337544d539Q94L5J467K661K98j824n90J652L49J048N92j464q54j567Q1K263K151
$$ -4539 -3645 -3610 -2143 518 816 -1008 -1598 54 403 1451 2043 579 -275 -1842 -1761 502 2653
338581B653J661J423P10j029k509p65j089lM64J446J488q57j210j16j386k162
$$ 2653 4314 5737 6447 5418 2909 2144 1055 1052 1516 2962 4450 3593 2383 2267 881 -1281
339558a281J401J231J229L05Qj454j373j294L10J735N29M04n53j076L97J175J72
$$ -1281 120 1351 2580 2885 2893 1439 66 -1228 -918 817 1346 1750 1197 121 518 1693 1865
340595A865n77r46j621l88k07R19J263J083k80M00Q19j782q58O75Q74ql24n74
$$ 1865 1288 342 -1279 -1667 -1874 -955 308 1391 1111 1511 2330 548 -310 365 1239 1231 907 333
341694C33n49l74k7K88k83p0P68K747R37j045N40J682k56j596q50j037l50m87
$$ 333 -216 -590 -617 -329 -612 -682 86 2833 3770 2725 3265 4947 4691 3095 2245 1208 858 371
342793C71M15L33L44L99k72r58j190n20J632J328n0N04Q2M74R92L03j292k81J32
$$ 371 786 1119 1463 1862 1590 632 -558 -1078 554 1882 1832 2336 2418 2892 3884 4187 2895 2614 2746
343953B746J240P05l9j030k161j893M19J218K843J695J41k343k675j159M47M37
$$ 2746 3986 4691 4652 3622 1461 -432 -13 1205 4048 5743 5884 3541 866 -293 154 591
344929E91m36K19L03j609n55Q1L46k05m46m38J807K519J083k73m69k90j681j232
$$ 591 155 374 677 -932 -1487 -1406 -1060 -1265 -1711 -2149 -342 2177 3260 2987 2518 2228 547 -685
346028f85J708J521j84j141j254N72L18J961J345j532l122k052M25J222j61m3
$$ -685 1023 2544 2360 1219 -35 537 855 2816 4161 2629 -493 -2545 -2120 -898 -1059 -1102
347005a102N60J970J824n97j775j299o87m1O2l35n5R32m59K5L53n43J58R46O59
$$ -1102 -542 1428 3252 2655 880 -419 -1106 -1147 -1085 -1420 -1475 -543 -1002 -977 -624 -1167 -1009 -63 596
348164E96j12L05p44n2J519J147Q89j885k239Q21J675j45j664J35j23J47N94R3
$$ 596 484 789 45 -7 1512 2659 3548 1663 -576 245 1920 1775 111 246 123 270 864 957
349263I57m50N36l52j160j68Q86K424Q22j075j415k045L5J75Q18q54j050m00M94
$$ 957 507 1043 691 -469 -637 249 2673 3495 2420 1005 -1040 -1005 -830 -12 -866 -1916 -2316 -1822
350362a822R98J143J079R54J690J207p56j529J3K00j766o24J304N52J221N65o77
$$ -1822 -824 319 1398 2352 4042 5249 4493 2964 2977 3177 1411 787 2091 2643 3864 4429 3752
351399C752n28M81O29j636j327j444J118K175m93p71l49r86j985o02L470K587
$$ 3752 3224 3705 4334 2698 1371 -73 1045 3220 2727 1956 1607 621 -1364 -1966 1504 4091
352376D091L18j126k668j093P62l70k65k70L46k53R93K34q37j27L77o38j015J7
$$ 4091 4409 3283 615 -478 284 -86 -351 -621 -275 -528 465 699 -138 -265 112 -526 -1541 -1524
353475a524J090R48p34l63P2J396J066j059r22P81k48J7J511J084KM61p18l64
$$ -1524 -434 514 -220 -583 -511 885 1951 892 -30 751 503 520 2031 3115 3117 3578 2860 2496
354574B496n58j138p98j516n99J198J840N00PP42q1n8J69k15q47j106J41l18q59
$$ 2496 1938 800 2 -1514 -2113 -915 925 1425 1432 2174 2093 2035 2204 1989 1142 36 177 -141 -1000
355733a000J340R87j078j502o73P0Q19R50J215j31l19P50J237j96n90O51n93o59
$$ -1000 340 1327 249 -1253 -1926 -1856 -1037 -87 1128 997 678 1428 2665 2469 1879 2530 1937 1278
356832A278O37k08j59r47q81J127J425j378j552j787J129J085J393J375j40o40
$$ 1278 1915 1707 1548 601 -280 847 2272 894 -658 -2445 -1316 -231 1162 2537 2397 1757
357808A757m33J407J325J68p11j63j123j370j766k213m48k12P47K576L17j533
$$ 1757 1324 2731 4056 4224 3513 3350 2227 857 -909 -3122 -3570 -3782 -3035 -459 -142 -1675
358785a675k92n18J42Q48L74J17O10J904Q41L36j360k089l60j6j643m8R34K374
$$ -1675 -1967 -2485 -2343 -1495 -1121 -1004 -394 1510 2351 2687 1327 -762 -1122 -1138 -2781 -2829 -1895 479
359884D79K53o85p26J453K604K69K44j092n78o8k146q32M15K005J477n64j588
$$ 479 732 47 -679 774 3378 3647 3891 2799 2221 2153 7 -825 -410 1595 3072 2508 920
360922I20k75N7N92j045k253k66J011k56j198J040J602P59q8r8l42L13N62K57
$$ 920 645 702 1294 249 -2004 -2270 -1259 -1515 -2713 -1673 -71 688 600 502 160 473 1035 1292
362020A292J62J201K7j00o21k002p54L46P87P0o41q29O13Q31q0j377j008o84R99
$$ 1292 1454 2655 2682 2582 1961 -41 -795 -449 338 408 -233 -1062 -449 382 302 -1075 -2083 -2767 -1768
363180a768k8j325J79O14Q19J208J896R30J84J73M9o42l87L04j234K41K391N19
$$ -1768 -1796 -3121 -2942 -2328 -1509 -301 1595 2525 2709 2882 2931 2289 1902 2206 972 1213 3604 4123
364279D123p60p16J093Q60j55N43k68K75N46j377M66j98j573Q73R48J33P50M24
$$ 4123 3363 2647 3740 4600 4445 4988 4720 4995 5541 4164 4630 4432 2859 3732 4680 4813 5563 5987
365378E987k70J5L63j102j48K39k118j062Q28j509q88l20L93J738N67P49R87j857
$$ 5987 5717 5732 6095 4993 4845 5084 2966 1904 2732 1223 335 15 408 2146 2713 3462 4449 2592
366476B592j666m57j24R43L26k33N63L28j290q29M77L94J422J335L5L67J019j359
$$ 2592 926 469 345 1288 1614 1381 1944 2272 982 153 630 1024 2446 3781 3816 4183 5202 3843
367575C843k819o07L21j08L14m96q88J84q62q81m42J95K073J389n17O80P14L88
$$ 3843 1024 417 738 630 944 448 -440 -256 -1118 -1999 -2441 -2246 -173 1216 699 1379 2093 2481
368673B481n05r72j508M6L33k01j082P0Q81Q66J713Q63l15k456l190j125Q58K951
$$ 2481 1976 1004 -504 -458 -125 -326 -1408 -1338 -457 409 2122 2985 2670 214 -2976 -4101 -3243 -292
369772b92K585L81r21k086J4R63m2k53o96J31J065J450k40r30P93R86j253j019
$$ -292 2293 2674 1753 -333 -319 644 602 349 -347 -216 849 2299 2059 1129 1922 2908 1655 636
370871F36j177J65P95K525j66j709m71M1Q46M18J597J795O52M7k00r70j747j117
$$ 636 -541 -376 419 2944 2778 1069 598 639 1485 1903 3500 5295 5947 5994 5794 4824 3077 1960
371970A960L80k39J96N61P30n12j073m07l35M54N57m86j216j256J45O98R17k23
$$ 1960 2340 2101 2297 2858 3588 3076 2003 1596 1261 1715 2272 1786 570 -686 -541 157 1074 851
373068H51J79n10m17J5N66m06j246O17j61L61O11N24P37J336J179j378j481n28
$$ 851 1030 520 103 118 684 278 -968 -351 -512 -151 460 984 1721 3057 4236 2858 1377 849
374167H49m76l42n97m85K18L59M84n36j345p72O00Q18j81J334K221J448p76N70
$$ 849 373 31 -566 -1051 -833 -474 10 -526 -1871 -2643 -2043 -1225 -1406 -72 2149 3597 2821 3391
375266C391j020p47J70M51R8m95j164j530R2R32k1J07Q54J8M33k73j573j21J868
$$ 3391 2371 1624 1794 2245 2343 1848 684 -846 -754 178 157 264 1118 1136 1569 1296 -277 -398 1470
376426A470p26j568j339P6Q42O56J727P87o83J120m42q53j51o88L42J559j43o9
$$ 1470 744 -824 -2163 -2087 -1245 -589 1138 1925 1242 2362 1920 1067 916 228 570 2129 1986 1917
377524A917j571j378j160L13J956K304R13q46l53J107N63n20J585J536p86j529
$$ 1917 346 -1032 -2192 -1879 77 2381 3294 2448 2095 3202 3765 3245 4830 6366 5580 4051
378501D051j347m56M06r19j033Q24j61q8J308Q43j082k500j462L70J073K209K063
$$ 4051 2704 2248 2654 1735 702 1526 1365 1277 2585 3428 2346 -154 -1616 -1246 -173 2036 4099
379539D099m73j029M76Q96o97k624k372l85J474K116J504J3N85o26J24L69Rk48
$$ 4099 3626 2597 3073 3969 3272 648 -1724 -2109 -635 1481 2985 2998 3583 2957 3081 3450 3459 3211
380637C211j119j114J66n09n89K35Q09p19o75p68R00J107j743j310K15J812R98
$$ 3211 2092 978 1144 635 46 281 1090 371 -304 -1072 -172 935 -808 -2118 -1903 -91 907
381675I07J46j604j350J757P39j813j730K6M56O56J068N68J388K827N11k186k170
$$ 907 1053 -551 -1901 -144 595 -1218 -2948 -2922 -2466 -1810 -742 -174 1214 4041 4552 2366 196
382712A96J48J262J483l06j689R79Kj721q51K191K591m86j331L1L53j006l57O99
$$ 196 344 1606 3089 2783 1094 2073 2075 354 -497 1694 4285 3799 2468 2499 2852 1846 1489 2188
383811B188k18k0J59J70n17J422j473k117M32K31P98N17O44Q36l78J47P90J13
$$ 2188 1970 1950 2109 2279 1762 3184 1711 -406 26 257 1055 1572 2216 3052 2674 2821 3611 3724
384910C724o17p06J625p10o83q25j203l26k12q44q03O17J092J37j5J011m56j518
$$ 3724 3107 2401 4026 3316 2633 1808 605 279 67 -777 -1580 -963 129 266 251 1262 806 -712
386009g12j374k016j143J606L063K174J328k222j771j033o34J220o78j37O29N92
$$ -712 -2086 -4102 -5245 -3639 -576 1598 2926 704 -1067 -2100 -2734 -1514 -2192 -2329 -1700 -1108
386985a108O94J099O40o69P41N46N83L34Q19j295o57P56l22m35P84J17j302j461
$$ -1108 -414 685 1325 656 1397 1943 2526 2860 3679 2384 1727 2483 2161 1726 2510 2627 1325 -136
388084a36K57J418J433M2m34o7l39n54J33O49r45r79p29K774K120j358k295l34
$$ -136 121 1539 2972 3014 2580 2513 2174 1620 1753 2402 1457 478 -251 2523 4643 3285 990 656
389182F56M25K027L059R5k743k570j992J335J321J611J876k74p03J1K61OK26j294
$$ 656 1081 3108 6167 6262 3519 949 -1043 292 1613 3224 5100 4826 4123 4134 4395 4401 4627 3333
390281C333j474n44R95j06m65P14n06m24l17L29k458n67K098J116L46k050j688
$$ 3333 1859 1315 2310 2204 1739 2453 1947 1523 1206 1535 -923 -1490 608 1724 2070 20 -1668
391319a668o61J82K930K384J546J162j09k55o33j036k88J140J254J96p32n35p82
$$ -1668 -2329 -2147 783 3167 4713 5875 5766 5511 4878 3842 3554 4694 5948 6144 5412 4877 4095
392357D095j302l51n72J87N84J595m95k100l35P35L22k245j034Q61O80j347l54
$$ 4095 2793 2442 1870 2057 2641 4236 3741 1641 1306 2041 2363 118 -916 -55 625 -722 -1076
393394a076j75K63l01j33r4j33O05m65O33J414J136p95j494K24R04j489j083J199
$$ -1076 -1251 -988 -1289 -1422 -1516 -1649 -1044 -1509 -876 538 1674 879 -615 -391 513 -976 -2059 -860
394493h60Q66R3O60r9o03j261p54N58J411M35R3M10j7j892j419m28j283J067R2
$$ -860 6 99 759 660 57 -1204 -1958 -1400 11 446 539 949 932 -960 -2379 -2807 -4090 -3023 -2931
395653b931m30K189J965J509N00O86j382j653P83J837M28j832j84M24j098n52
$$ -2931 -3361 -1172 793 2302 2802 3488 2106 453 1236 3073 3501 1669 1485 1909 811 259
396629B59Q33J110n59j891j126J033J378p00k242J396J018P1o13m62O21K075Q19
$$ 259 1092 2202 1643 -248 -1374 -341 1037 337 -1905 -509 509 580 -33 -495 126 2201 3020
397667C020N31j004j570j633m79P69R66r05q87r27P93J973Q74p49K84j27O19K18
$$ 3020 3551 2547 977 -656 -1135 -366 600 -305 -1192 -2119 -1326 647 1521 772 1056 929 1548 1766
398766A766J70m69o76k87J771M68j92j908k213o36N81K029K413J047N1Q1n38L86
$$ 1766 1936 1467 791 504 2275 2743 2551 643 -1570 -2206 -1625 404 2817 3864 3915 3996 3458 3844
399864C844k6n65n94r57l46J17Q32Q55Q49j052L4l22j580r78K378K216o23k447
$$ 3844 3818 3253 2659 1702 1356 1473 2305 3160 4009 2957 2991 2669 1089 111 2489 4705 4082 1635
400963A635j023MN81J54j067q16k79Q18J76R22K82j125j520L79J629L93n21q36
$$ 1635 612 616 1197 1351 284 -532 -811 7 183 1105 1387 262 -1258 -879 750 1143 622 -214
402062b14k15N39K465J068j97p9m26L94j78j422j497J055J024r19K46r38j133
$$ -214 -429 110 2575 3643 3446 3367 2941 3335 3157 1735 238 1293 2317 1398 1644 706 -427
403100d27j35P28Q51k27n89K23k92l15R23n98p6K20j93N91K582J521j148j223
$$ -427 -562 166 1017 790 201 424 132 -183 740 142 66 286 93 684 3266 4787 3639 2416
404198B416N68N53j756j615J154J307r47j267k55k77r2L8J91n30r76J71N16P84
$$ 2416 2984 3537 1781 166 1320 2627 1680 413 158 -119 -211 -173 18 -512 -1488 -1317 -801 -17
405297a7J2K75N3P91Q19o05n48M87O23o71j18M4Q0j06j07J112r2l46l02r33N03
$$ -17 -5 270 323 1114 1933 1328 780 1267 1890 1219 1101 1145 1225 1119 1012 2124 2032 1686 1384 451 954
406579I54J263j81O2M36j434p26M60j46n36J852J529J160L14q83j503j376j118
$$ 954 2217 2036 2098 2534 1100 374 834 688 152 2004 3533 4693 5007 4124 2621 1245 127
407616A27k91K185K236r10l69L21J54lj078k99J140P03m47j951J34J273j24r7
$$ 127 -164 2021 4257 3347 2978 3299 3453 3450 2372 2073 3213 3916 3469 1518 1652 2925 2801 2704
408715B704M04j048j407p6p68Q54K902J440j472j09J40m52j634j023N80K76k95
$$ 2704 3108 2060 653 577 -191 663 3565 5005 3533 3424 3564 3112 1478 455 1035 1311 1016
409753A016Q35m38m40Q3R9L6p23n36J240J343k17n96p68m25L21P33J542L05j842
$$ 1016 1851 1413 973 1056 1155 1191 468 -68 1172 2515 2298 1702 934 509 830 1563 3105 3410 1568
410912A568l72J013J363j722k655r48K9J285J481n12j861N40J285J331K34O43
$$ 1568 1196 2209 3572 1850 -805 -1753 -1724 -439 1042 530 -1331 -791 494 1825 2059 2702
411889B702j19o97o61q56m57r33qR85J252L86q87o47J547J764L28m72J14N83j12
$$ 2702 2583 1886 1225 369 -88 -1021 -1029 -44 1208 1594 707 60 1607 3371 3699 3227 3341 3924 3812
413049C812q2J25K22o58j115k68Q36l80p74r77p70Q15k59P4J24P77q20o12J539
$$ 3812 3730 3855 4077 3419 2304 2036 2872 2492 1718 741 -29 786 527 601 725 1502 682 70 1609
414209A609L08q45N40j8L01K65j95k39j45p81l38j091p10J543J580j099j017l3
$$ 1609 1917 1072 1612 1594 1895 2160 1965 1726 1581 800 462 -629 -1339 204 1784 685 -332 -365
415307c65n1R76M02M23M49O4J38L10J520N96m86O71P86m4m94l48j040q30K04J943
$$ -365 -416 560 962 1385 1834 1898 2036 2346 3866 4462 3976 4647 5433 5389 4895 4547 3507 2677 2881 4824
416528D824N20j459k242q92m19p95n53q06J638J220n72l80l61k018l59J738J515
$$ 4824 5344 3885 1643 751 332 -463 -1016 -1822 -184 1036 464 84 -277 -2295 -2654 -916 599
417566E99N69K79r64j792K64K192j9m08J059Q91j92r19k26r58j039p30j160r46
$$ 599 1168 1447 483 -1309 -1045 1147 1128 720 1779 2670 2478 1559 1333 375 -664 -1394 -2554 -3500
418664c500o31N34R39K870J111j006J41j325J68J287L15k72K2QQ88R52N10j875
$$ -3500 -4131 -3597 -2658 212 1323 317 458 -867 -699 588 903 631 653 661 1549 2501 3011 1136
419763A136q52p01j149n61L21k06R64J052j021K02J543M59n44n98J706Q87j892
$$ 1136 284 -417 -1566 -2127 -1806 -2012 -1048 4 -1017 -815 728 1187 643 45 1751 2638 746
420801G46J32J199M12l60L8J367J217M25k028j568j347l95J267n67p06k3N76L20
$$ 746 878 2077 2489 2129 2167 3534 4751 5176 3148 1580 233 -162 1105 538 -168 -191 385 705
421899G05m38r00j252N62K529J870r76j961k039j049O12L84K19M40j284l17P50
$$ 705 267 -633 -1885 -1323 1206 3076 2100 139 -1900 -2949 -2337 -1953 -1734 -1294 -2578 -2895 -2145
422937b145R95Q95n55r70o03J471N19j548K13l87L35J868J659J294J136M44o69
$$ -2145 -1150 -255 -810 -1780 -2383 -912 -393 -1941 -1728 -2115 -1780 88 1747 3041 4177 4621 3952
423975C952j022J115K651P78j309Q27j152k818k495l98K28q64j099J304M80O29
$$ 3952 2930 4045 6696 7474 6165 6992 5840 3022 527 129 357 -507 -1606 -302 178 807
424951H07P44m9n25j0L50q29k71J09N32J932J740q24l88K56m43R2l63o47J324
$$ 807 1551 1502 977 967 1317 488 217 326 858 2790 4530 3706 3318 3574 3131 3223 2860 2213 3537
426111C537J182M34l029j772K557p82k936L49L87J784K060M37o78k4K037Q92O77
$$ 3537 4719 5153 2124 352 2909 2127 -809 -460 -73 1711 3771 4208 3530 3506 5543 6435 7112
427149G112M77j861k777r04K13J07j07N0M29k22r50j731k289j378J562J440K29
$$ 7112 7589 5728 2951 2047 2260 2367 2260 2310 2739 2517 1567 -164 -2453 -3831 -2269 -829 -600
428186f00O26K082J562N1k522k491K29j33n01j337j218j57R72J046K915J013k41
$$ -600 26 2108 3670 3721 1199 -1292 -1063 -1196 -1697 -3034 -4252 -4409 -3437 -2391 524 1537 1296
429224A296m46L51N32o17j575n10J039O93P97k84n63j086q92J248J032q64R1K556
$$ 1296 850 1201 1733 1116 -459 -969 70 763 1560 1276 713 -373 -1265 -17 1015 151 242 2798
430323B798J156j467j492J69j19k245m87N11J053J666J259N01K99J513j522j825
$$ 2798 3954 2487 995 1164 1045 -1200 -1687 -1176 -123 1543 2802 3303 3602 5115 3593 1768
431299A768j317Q46K150j199K26N22k007j055J562J693L3n74j99N80O87p15r40
$$ 1768 451 1297 3447 2248 2474 2996 989 -66 1496 3189 3222 2648 2449 3029 3716 3001 2061
432337B061m72j125K80J758k62R18O35m36L79j297R89o1k81j207p60O58P08m89
$$ 2061 1589 464 744 2502 2240 3158 3793 3357 3736 2439 3428 3367 3086 1879 1119 1777 2485 1996
433436A996q63j232J047K40n13M42J336J210n74O72J208k11k33j61j597o58J34
$$ 1996 1133 -99 948 1188 675 1117 2453 3663 3089 3761 4969 4758 4525 4364 2767 2109 2243
434474B243L6j186j694k88J84j53k22N28n67R19J452j18j30K91o70j284m61J70
$$ 2243 2279 1093 -601 -889 -705 -858 -1080 -552 -1119 -200 1252 1134 1004 1295 625 -659 -1120 -950
435572i50M23J747J359r25n31L12j022p01L81l54K44J808m41J161N5K66J39J04
$$ -950 -527 1220 2579 1654 1123 1435 413 -288 93 -261 -17 1791 1350 2511 2566 2832 2971 3075
436671C075K336j088k112p68M69P51P76O21r31n50q64L27l41M15J567l12n26j693
$$ 3075 5411 4323 2211 1443 1912 2663 3439 4060 3129 2579 1715 2042 1701 2116 3683 3371 2845 1152
437769A152J48O12M78J345Q77o17P7K15J3j27q15j614j116J094J330M39j61j845
$$ 1152 1300 1912 2390 3735 4612 3995 4072 4287 4300 4173 3358 1744 628 1722 3052 3491 3330 1485
438868A485k081k78J548J057M72m61o11L21O38n02l53K124L652J010k090j206
$$ 1485 -596 -874 674 1731 2203 1742 1131 1452 2090 1588 1235 3359 7011 8021 5931 4725
439845D725j010j657j517n34J037Q62M22J941Q77j460j317j101k103j99J220K43
$$ 4725 3715 2058 541 7 1044 1906 2328 4269 5146 3686 2369 1268 -835 -1034 186 429
440822D29Q53L5r85j27J28j678q38P88K192K94r75j199p65o0J469J653m38n61
$$ 429 1282 1317 332 205 333 -1345 -2183 -1395 797 1091 116 -1083 -1848 -1908 -439 1214 776 215
441920B15R71O09j385j844o50O27K259J874N95l66j156j920q24J388J276J90r
$$ 215 1186 1795 410 -1434 -2084 -1457 802 2676 3271 2905 1749 -171 -995 393 1669 1859 1850
442958A850n17Mk25M21P03q21k27n34o06J069pj21L35R56k08p12J96r0J29R48
$$ 1850 1333 1337 1112 1533 2236 1415 1188 654 48 1117 1110 989 1324 2280 2072 1360 1556 1466 1595 2543
444178B543j38j393K20N51J385M26K9N72m76m44q19j353L24J184K69K38q09j581
$$ 2543 2405 1012 1232 1783 3168 3594 3623 4195 3719 3275 2456 1103 1427 2611 2880 3118 2309 728
445277G28r36J038q1j210N02R37J905n67k444N39J832N37P1j000R20P13M01M08
$$ 728 -208 830 749 -461 41 978 2883 2316 -128 411 2243 2780 2851 1851 2771 3484 3885 4293
446376D293j270j634o58j78N38q5N67L30j558k164N43L019J713m55j236j478k46
$$ 4293 3023 1389 731 553 1091 1006 1573 1903 345 -1819 -1276 1743 3456 3001 1765 287 41
447414D1P94L54N77J299J15P76N25j199k731j407n38J233L397K62j588r37k104
$$ 41 835 1189 1766 3065 3180 3956 4481 3282 551 -856 -1394 -161 3236 3498 1910 973 -1131
448451a131o60J641J699m85p43k00p5O0J494J613J60n60J100l12j894K62J570
$$ -1131 -1791 -150 1549 1064 321 121 46 106 1600 3213 3373 2813 3913 3601 1707 1969 3539
449489C539r83o71l76J60J106j122j570Q86P90J072M63j716j724P63R46l21j468
$$ 3539 2556 1885 1509 1669 2775 1653 83 969 1759 2831 3294 1578 -146 617 1563 1242 -226
450527b26r55n60N87P16M27P90k47l82J53o77l52j10N67J047N56K6o84r37R58
$$ -226 -1181 -1741 -1154 -438 -11 779 532 150 303 -374 -726 -836 -269 778 1334 1360 676 -261 697
451686F97J616L36l6j254p90J356l8k68K1l63j008j057J022K364J485o67q21M25
$$ 697 2313 2649 2613 1359 569 1925 1887 1619 1640 1277 269 -788 234 2598 4083 3416 2595 3020
452785C020o54q05K04k5J022J28r05j593M57J655R07J14j289r57m8j140L77R49
$$ 3020 2366 1561 1765 1740 2762 2890 1985 392 849 2504 3411 3525 2236 1279 1231 91 468 1417
453884A417N4r21m8M16m15M00P15l1M9J26L24p07Q83j058m44K383J358R7K46j332
$$ 1417 1471 550 502 918 503 903 1618 1587 1636 1762 2086 1379 2262 1204 760 3143 4501 4598 4844 3512
455104C512j409j261M03J716p80N57J259k7j513n81R80p75o89K38M6J140L31N97
$$ 3512 2103 842 1245 2961 2181 2738 3997 3970 2457 1876 2856 2081 1392 1630 1676 2816 3147 3744
456203C744P11J64p83Rn95p82J70o70k52j440k879r02J891K611J585J339J868
$$ 3744 4455 4619 3836 3845 3250 2468 2638 1968 1716 276 -2603 -3505 -1614 997 2582 3921 5789
457241E789O7k111j072j808l87J303J435K65L66J45p57j165q66p91J23O46M63
$$ 5789 5856 3745 2673 865 478 1781 3216 3481 3847 3992 3235 2070 1204 413 536 1182 1645
458278A645l14M38P20J797J368j173j313M18J637l9j213k36m48j868q68J771J213
$$ 1645 1331 1769 2489 4286 5654 4481 3168 3586 5223 5184 3971 3735 3287 1419 551 2322 3535
459316C535m93p75n06R02q20j063J049J312M35j198m23L06k37k37J548j01L05
$$ 3535 3042 2267 1761 2663 1843 780 1829 3141 3576 2378 1955 2261 2024 1787 3335 3234 3539
460354C539J308j045k789n70K59l09M60J083J482P25j457k266o90O85J634J581
$$ 3539 4847 3802 1013 443 702 393 853 1936 3418 4143 2686 420 -270 415 2049 3630
461330C630P15M70p19k45j30k05n34j575j157m81J66L64K74o84O16l96L46K372
$$ 3630 4345 4815 4096 3851 3721 3516 2982 1407 250 -231 -65 299 573 -111 505 109 455 2827
462429B827J3q40o33K53J927J243k158j000O65m72k79M45J015J258Q89j774j713
$$ 2827 2840 2000 1367 1620 3547 4790 2632 1632 2297 1825 1546 1991 3006 4264 5153 3379 1666
463467A666R47J476m62j474j250m06p25P27K279m11j090K50O99p41n61R28P12
$$ 1666 2613 4089 3627 2153 903 497 -228 499 2778 2367 1277 1527 2226 1485 924 1852 2564
464504B564J239N06r52p25k95L97N30J274J196m07k318j923j424J31o02L3J581
$$ 2564 3803 4309 3357 2632 2337 2734 3264 4538 5734 5327 3009 1086 -338 -207 -809 -776 805
465542H05R98j35j745M19K366J819O45p63N74N19j128m56N2n50j361o45R93n18
$$ 805 1803 1668 -77 342 2708 4527 5172 4409 4983 5502 4374 3918 3970 3420 2059 1414 2407 1889
466641A889n5J825j065j412j25q01l80q78N83R6n73L61R89J287N19J64M53m70
$$ 1889 1834 3659 2594 1182 1057 256 -124 -1002 -419 -323 -896 -535 454 1741 2260 2424 2877 2407
467740B407k91r79j873m88J082J392J155J07o68j267L25K348K56m82p20r72J482
$$ 2407 2116 1137 -736 -1224 -142 1250 2405 2512 1844 577 902 3250 3506 3024 2304 1332 2814
468777B814J754j47P19q88j083j274m75q23m34M78O52J103K74R03J106j37j585
$$ 2814 4568 4421 5140 4252 3169 1895 1420 597 163 641 1293 2396 2670 3573 4679 4542 2957
469815B957j775j076k089j347j65J247J602N11j92j522n93J592J411O93l89m65
$$ 2957 1182 106 -1983 -3330 -3495 -2248 -646 -135 -327 -1849 -2442 -850 561 1254 865 400
470791D00K27K040J186j608j198j074j064j075k58J205J632M07J022N64j81m31
$$ 400 627 2667 3853 2245 1047 -27 -1091 -2166 -2424 -1219 413 820 1842 2406 2225 1794
471768A794P38k37q49M95K51Q63m70j387j012p87j391j87L08n61l96L49J801K195
$$ 1794 2532 2295 1446 1941 2192 3055 2585 1198 186 -601 -1992 -2179 -1871 -2432 -2828 -2479 -678 1517
472867A517k52l65j486k065J574K717q4P37n4r82j366J39N87J076k90m18q34p53
$$ 1517 1265 900 -586 -2651 -1077 1640 1556 2293 2239 1257 -109 30 617 1693 1403 985 151 -602
473966f02J45M88L10j465k43P79K26M1Q90R07l76j313q07N12J470J494J158j030
$$ -602 -457 31 341 -1124 -1367 -588 -362 -321 569 1476 1100 -213 -1020 -508 962 2456 3614 2584
475064B584j83R84K79k41J30r0J383Q71m92n06j961j028K0M63l40l35J71j87j14
$$ 2584 2401 3385 3664 3423 3553 3463 4846 5717 5225 4719 2758 1730 1750 2213 1873 1538 1709 1522 1408
476224A408L47r05M54N53j94m43K16r33j741r62P9Q43m75Q50K88M5J604P03n5
$$ 1408 1755 850 1304 1857 1663 1220 1436 503 -1238 -2200 -2121 -1278 -1753 -903 -615 -570 1034 1737 1682
477384A682Q59J437j28j677j053J097K371J389Q66j447k234j7l79j017j141k49
$$ 1682 2541 3978 3850 2173 1120 2217 4588 5977 6843 5396 3162 3145 2766 1749 608 359
478360C59Q84P13j18P27j678r51J180M34k88n05N59r8j919o15K291J581k418j091
$$ 359 1243 1956 1838 2565 887 -64 1116 1550 1262 757 1316 1218 -701 -1316 975 2556 138 -953
479459i53J123k88R49n6R4J527k45r86j08N88R9M09K103J182r02k534k160n50
$$ -953 170 -118 831 775 869 2396 2151 1165 1057 1645 1744 2153 4256 5438 4536 2002 -158 -708
480558g08J116R05L44p34j390o50q75J54k08p4P25K6J008J202N22N59K02p19q60
$$ -708 408 1313 1657 923 -467 -1117 -1992 -1838 -2046 -2120 -1395 -1369 -361 841 1363 1922 2124 1405 545
481717E45M75N1m14r8j40J27M28K26J659J87n71J006r58p78K82l74j215N30j494
$$ 545 1020 1071 657 559 419 546 974 1200 2859 3046 2475 3481 2523 1745 2027 1653 438 968 -526
482877e26k169J274J292j49k2M81j068K39R30J314J436M39M61J078O34o02j564
$$ -526 -2695 -1421 -129 -278 -300 181 -887 -648 282 1596 3032 3471 3932 5010 5644 5042 3478
483915C478k131j793PJ346J213j55m62L82K41m70l96K76j66J62k357j201Q46J940
$$ 3478 1347 -446 -439 907 2120 1965 1503 1885 2126 1656 1260 1536 1370 1532 -825 -2026 -1180 760
485014G60J560P49J317J1J143K369n66l58j12j850k848j786o66L68J205O28j163
$$ 760 2320 3069 4386 4397 5540 7909 7343 6985 6873 5023 2175 389 -277 91 1296 1924 761
486051G61K11J57P78N93J687j34K8n78j641M35o50q16k22o75Q2L17l41J63k34
$$ 761 972 1129 1907 2500 4187 4053 4081 3503 1862 2297 1647 831 609 -66 16 333 -8 155 -79
487211g9k12j11M93Q20j08j307r42L18Q47J282M01m42q29j28M0O51R84j332j66
$$ -79 -291 -402 91 911 803 -504 -1446 -1128 -281 1001 1402 960 131 3 43 694 1678 346 180
488371A80J71r27N33J409k83J020P22O85r18j734l29M24o62j712j168M24J810
$$ 180 351 -576 -43 1366 1083 2103 2825 3510 2592 858 529 953 291 -1421 -2589 -2165 -355
489408c55n49P95L62P99J016K5j252j648n21j05o99K51L48J167P40j706j376L73
$$ -355 -904 -109 253 1052 2068 2093 841 -807 -1328 -1433 -2132 -1881 -1533 -366 374 -1332 -2708 -2335
490507b335J822L261R94R35J550q86j617k48j198j153J128J848J5J226L66k783
$$ -2335 -513 2748 3742 4677 6227 5341 3724 3476 2278 1125 2253 4101 4116 5342 5708 2925
491484B925j007K89N93P15q47j414k57r47m28K22J581J818O65M65p80l17K92J015
$$ 2925 1918 2207 2800 3515 2668 1254 997 50 -378 -156 1425 3243 3908 4373 3593 3276 3568 4583
492582D583M94j938k648o87J323j47K25J635Q14n87l48O57R24o1k81j018n9O11
$$ 4583 5077 3139 491 -196 1127 980 1205 2840 3654 3067 2719 3376 4300 4239 3958 2940 2881 3492
493681C492r02j442m7j62O66R48q02k17n7P44M72K05L7L4O43P09K71j163j522
$$ 3492 2590 1148 1101 939 1605 2553 1751 1534 1477 2221 2693 2898 2935 2969 3612 4321 4592 3429 1907
494841A907q43j410o11l92m8O33J406m37p10n3q79n44J326J455j130j44P75K78
$$ 1907 1064 -346 -957 -1349 -1397 -764 642 205 -505 -558 -1437 -1981 -655 800 -330 -474 301 579
495939E79J023m83j317k60R11P76l02m33L03m69M80P04M74k38K020J875L06j054
$$ 579 1602 1119 -198 -458 453 1229 927 494 797 328 808 1512 1986 1748 3768 5643 5949 4895
497038D895m442k529R00K011P31l26Q62J303P03L05q73M64Kj710j664k00J92J073
$$ 4895 453 -2076 -1176 835 1566 1240 2102 3405 4108 4413 3540 4004 4006 2296 632 432 624 1697
498137A697R13j647j72J276l07N36J902J37j261j66L61j705k381Q09J187J008
$$ 1697 2610 963 791 2067 1760 2296 4198 4335 3074 2908 3269 1564 -817 -8 1179 2187
499113B187Q89J017J015k615k563Q57J489k08L33J069K84P96p91n53p15J300P68
$$ 2187 3076 4093 5108 2493 -70 787 2276 2068 2401 3470 3754 4550 3759 3206 2491 3791 4559
500151D559j490l53L9o90J70l86m38J466Q95r57J80K07q60J57J00M2r21R21N97
$$ 4559 3069 2716 2755 2065 2235 1849 1411 2877 3772 2815 2995 3202 2342 2499 2599 2641 1720 2641 3238
501311C238j401j177q40P09J256j44j700p64J638P02j403j170K29J740J446R94
$$ 3238 1837 660 -180 529 1785 1641 -59 -823 815 1517 114 -1056 -827 913 2359 3353
502288C353P96l65K13K29j008j281n58M27R53J060J428jj632q10J9j43j616m04
$$ 3353 4149 3784 3997 4226 3218 1937 1379 1806 2759 3819 5247 5246 3614 2804 2823 2680 1064 660
503386F60J166O83r4k128p02Q31j397n44L00r9J512Q88n92P40K715K083L84j255
$$ 660 1826 2509 2415 287 -415 416 -981 -1525 -1225 -1324 188 1076 484 1224 3939 6022 6406 5151
504485E151j953j123r61n90J358J723K42j548m97J07k37m36Q03N21jj110Q41J507
$$ 5151 3198 2075 1114 524 1882 3605 3847 2299 1802 1909 1672 1236 2039 2560 2559 1449 2290 3797
505584C797K5j365q52m53j377j389k36J722J283R49Q44l33o46j942n80k82K70
$$ 3797 3822 2457 1605 1152 -225 -1614 -1850 -128 1155 2104 2948 2615 1969 27 -553 -835 -565
506621e65J038J30O54j2n45r40N19K024Q0j710j688j006K01n98M30O39J462M48
$$ -565 473 603 1257 1245 700 -240 279 2303 2383 673 -1015 -2021 -1820 -2418 -1988 -1349 113 561
507720E61j070R02J681N76j254j218j016n4R07R90Q21p2N90J167J439J647l41
$$ 561 -509 393 2074 2650 1396 178 -838 -892 15 1005 1826 1754 2344 3511 4950 6597 6256
508758F256j504j642l12j38l94o1p50o14J66k23j319j054J594R44L02j23m15j593
$$ 6256 4752 3110 2798 2660 2266 2205 1455 841 1007 784 -535 -1589 5 949 1251 1128 713 -880
509856h80k86J051J913J422k52k138q66k93m9O58K15r80J147O17R89n41m32n81
$$ -880 -1166 -115 1798 3220 2968 830 -36 -329 -378 280 495 -485 662 1279 2268 1727 1295 714
510955G14j947p35K424J594L05N85O53j392J54N95p71k794j084P66L07R45N32
$$ 714 -1233 -1968 456 2050 2355 2940 3593 2201 2355 2950 2179 -615 -1699 -933 -626 319 851
511993H51K32N1q99p0j97J207J085j102m57J059K18q66p05p11K75J251K435J175
$$ 851 1083 1134 235 165 -32 1175 2260 1158 701 1760 1978 1112 407 -304 -29 1222 3657 4832
513091D832n84k821j102M70R76J807N18J314m89j417r14O23l43l82O84l91o0Q77
$$ 4832 4248 1427 325 795 1771 3578 4096 5410 4921 3504 2590 3213 2870 2488 3172 2781 2721 3598
514190C598k09L10M15j272k524q81j395j23O87Q01j25j23Q61p72J369J742L16
$$ 3598 3389 3699 4114 2842 318 -563 -1958 -2081 -1394 -593 -718 -841 20 -752 617 2359 2675
515228B675J62R48k87j85J32M62j30j636r83J542J908M56Q85j11r36k786k015
$$ 2675 2837 3785 3498 3313 3445 3907 3777 2141 1158 2700 4608 5064 5949 5838 4902 2116 101
516265A01P87J081J662J066l03o38j349j725r21N38K332k33j529j230j355p08
$$ 101 888 1969 3631 4697 4394 3756 2407 682 -239 299 2631 2398 869 -361 -1716 -2424
517242b424M61J118J555K821R80j748l146k235N69K199k02Q9j655n68J233J258
$$ -2424 -1963 -845 710 3531 4511 2763 -383 -2618 -2049 150 -52 37 -1618 -2186 -953 305
518219C05J082r4P36k17k60K97j541j229n0J624J475L38k32j220k60N34p2J010
$$ 305 1387 1293 2029 1812 1552 1849 308 -921 -971 653 2128 2466 2234 1014 754 1288 1216 2226
519317B226K212J274J93j915j567j515k605J13j99K95L30q87O44n5j299K81Q46
$$ 2226 4438 5712 5905 3990 2423 908 -1697 -1584 -1783 -1488 -1158 -2045 -1401 -1456 -2755 -2474 -1628
520355a628N66K17M6q4j083L20K433J768J89j173q31j04J82k02p4J994K36j035
$$ -1628 -1062 -845 -799 -883 -1966 -1646 787 2555 2744 1571 740 636 818 616 542 2536 2772 1737
521454A737j025N26J312J757Q2j097q83L6M91J698J110j211q40p14r94p24l48
$$ 1737 712 1238 2550 4307 4389 3292 2409 2445 2936 4634 5744 4533 3693 2979 1985 1261 913
522492I13K94j096j331L34p41o24N24J809K481R07j687L8M71K27J91M12O21m60
$$ 913 1207 111 -1220 -886 -1627 -2251 -1727 82 2563 3470 1783 1821 2292 2519 2710 3122 3743 3283
523590C283Q6Q05J1j230r70j010m25O03j820M00J753J714L95l124k207O96J224
$$ 3283 3369 4174 4185 2955 1985 975 550 1153 -667 -267 1486 3200 3595 471 -1736 -1040 184
524628A84l25k03L42P24p10l230j3J668J212J742L86j112N04R11pk61O60O9m62
$$ 184 -141 -344 -2 722 12 -3218 -3231 -1563 -351 1391 1777 665 1169 2080 2073 1812 2472 2541 2079
525787B079O76J516j422k351k549j194K58J361J439j051j174R82R81m59k624j011
$$ 2079 2755 4271 2849 498 -2051 -3245 -2987 -1626 -187 -1238 -2412 -1430 -449 -908 -3532 -4543
526764d543R36Q14J80m97J533J815K18q57j08j59p24Q60K553J557O7r66j111k053
$$ -4543 -3607 -2793 -2613 -3110 -1577 238 456 -401 -509 -668 -1392 -532 2021 3578 3645 2679 1568 -485
527863d85j187N24j4J838J221o9M49J85j01l63J87j40l49l14J163p07k479j280
$$ -485 -1672 -1148 -1162 676 1897 1828 2277 2462 2361 1998 2185 2045 1696 1382 2545 1838 -641 -1921
528961a921Q36J762O56J14q34n68n04M67o82j132K18Q82l17P87m29j029J03P07
$$ -1921 -1085 677 1333 1447 613 45 -459 8 -674 -1806 -1588 -706 -1023 -236 -665 -1694 -1591 -884
530060h84P12J17K30P42P03j935j229J187K59j070K073J523j122o95O64J85o97
$$ -884 -172 -55 175 917 1620 -315 -1544 -357 -98 -1168 905 2428 1306 611 1275 1460 763
531098G63N15J308j04K92K111p69k696j003M40J096j028N88P48n85L21l88k197
$$ 763 1278 2586 2482 2774 4885 4116 1420 417 857 1953 925 1513 2261 1676 1997 1609 -588
532136e88m90J671J069k67l55j138N24l09j341q48j72J43Q20J169Q17J067L30
$$ -588 -1078 593 1662 1395 1040 -98 426 117 -1224 -2072 -2244 -2101 -1281 -112 705 1772 2102
533173B102j36r45R40J797J83K77J458p12k53l85k463j807J417M56p48j727r33
$$ 2102 1966 1021 1961 3758 3941 4218 5676 4964 4711 4326 1863 56 1473 1929 1181 -546 -1479
534211a479n2j20L015K234K78j312k235q70RJ512J129j170j100j719J66P94J591
$$ -1479 -1531 -1651 1364 3598 3876 2564 329 -541 -532 980 2109 939 -161 -1880 -1714 -920 671
535249F71J762k95j74O98m05q71o6r40K9P65K42r0n6Q77J292j9n63J50l56m82
$$ 671 2433 2138 1964 2662 2257 1386 1320 380 409 1174 1416 1326 1270 2147 3439 3420 2857 3007 2651 2169
536469B169K50J99O26k41K36j70J8J61j210n47O42O43j501k16Q94l36r87N04K160
$$ 2169 2419 2618 3244 3003 3239 3069 3087 3248 2038 1491 2133 2776 1275 1059 1953 1617 630 1134 3294
537629C294P32j253L79j655k588k187j018P90J405J004Q93J946K189j6l094j100
$$ 3294 4026 2773 3152 1497 -1091 -3278 -4296 -3506 -2101 -1097 -204 1742 3931 3915 821 -279
538606b79J285J826R14j491J8J302J70L46L19j556k578L07J610l50K60J009N58
$$ -279 1006 2832 3746 2255 2273 3575 3745 4091 4410 2854 276 583 2193 1843 2103 3112 3670
539643C670k208j750m84q99M53P72J124J420nM94P63r0r64R45J696J032j523k721
$$ 3670 1462 -288 -772 -1671 -1218 -446 678 2098 2093 2587 3350 3260 2296 3241 4937 5969 4446 1725
540742A725m87J339J695O18L24j109q95p12k22M63j25M14R30J71j312m78J331
$$ 1725 1238 2577 4272 4890 5214 4105 3210 2498 2276 2739 2614 3028 3958 4129 2817 2339 3670
541780C670L56m37r32j325j282N96K091Q55J383j186j730J30R09L56r38q1Q57
$$ 3670 4026 3589 2657 1332 50 646 2737 3592 4975 3789 2059 2189 3098 3454 2516 2435 3292
542817C292K90R58P9j207j262p74q31o37l15n34O97j80J233J918N59J20k30o42
$$ 3292 3582 4540 4619 3412 2150 1376 545 -92 -407 -941 -244 -424 809 2727 3286 3406 3176 2534
543916B534j115q5J353J976J589r31k173k262p80l69J39k21l73L02M77P47kl58
$$ 2534 1419 1334 2687 4663 6252 5321 3148 886 106 -263 -124 -345 -718 -416 61 808 806 448
545015D48q42j56p38O18R79J365J029k18m64j07M62r81j123n0j224L70J646N55
$$ 448 -394 -550 -1288 -670 309 1674 2703 2485 2021 1914 2376 1395 272 222 -1002 -632 1014 1569
546113A569j243N10N10q47m01o93J53M92J195K322N99P37K12j662j389p86p10
$$ 1569 326 836 1346 499 98 -595 -442 50 1245 3567 4166 4903 5115 3453 2064 1278 568
547151E68p1N5J055L1l47L34N41J352J621M35K90k16j053j875m20o46R3O15j28
$$ 568 497 552 1607 1638 1291 1625 2166 3518 5139 5574 5864 5648 4595 2720 2300 1654 1747 2362 2234
548311B234j66L79Q91J638K94k582k239r49m7J305m94j298n67p39J626R64p59
$$ 2234 2068 2447 3338 4976 5270 2688 449 -500 -547 758 264 -1034 -1601 -2340 -714 250 -509
549349e09k43j428L7J359K176J241J61j212j191j202Q56J311M86j225j682N97
$$ -509 -752 -2180 -2143 -784 1392 2633 2794 1582 391 -811 45 1356 1842 617 -1065 -468
550325d68J067p06r79L77j78O62J234L79k41L02Q82R78p1j37j041O17q11k288
$$ -468 599 -107 -1086 -709 -887 -225 1009 1388 1147 1449 2331 3309 3238 3101 2060 2677 1866 -422
551424d22k376l44L521L997L82j143j57j156j019r2j99q44r86j576M38N13J000
$$ -422 -2798 -3142 379 4376 4758 3615 3458 2302 1283 1191 992 148 -838 -2414 -1976 -1463 -463
552461d63Q01M38J317J034j31l92q49j148N78J458J020p51n71m23q23n66O61l83
$$ -463 338 776 2093 3127 2996 2604 1755 607 1185 2643 3663 2912 2341 1918 1095 529 1190 807
553560H07k82J727J550l0k102j301J122J924R38j20m77r05k999j422J813K144
$$ 807 525 2252 3802 3772 1670 369 1491 3415 4353 4233 3756 2851 -148 -1570 243 2387
554537B387M23M0j840k200K0Q1J485J363K701P64j330k387p66J544J292m35q37
$$ 2387 2810 2850 1010 -1190 -1170 -1089 396 1759 4460 5224 3894 1507 741 2285 3577 3142 2305
555575B305j003j813J84j72j379R44Q84J69L99m04J063K037J858j71n58j453l22
$$ 2305 1302 -511 -327 -499 -1878 -934 -50 119 518 114 1177 3214 5072 4901 4343 2890 2568
556612B568m6N23P08j470j718k031k169j148J392K796O30l22N11J059p41k251
$$ 2568 2522 3045 3753 2283 565 -1466 -3635 -4783 -3391 -595 35 -287 224 1283 542 -1709
557589a709r05R30K0M99J312J010J04o22l9J479J348P35M22N57j839j124J13J302
$$ -1709 -2614 -1684 -1664 -1165 147 1157 1261 639 600 2079 3427 4162 4584 5141 3302 2178 2291 3593
558687C593n29M89P94j040j831p6o59n7J93M49m91o78J5j7O46P84M86R82O38m68
$$ 3593 3064 3553 4347 3307 1476 1400 741 684 877 1326 835 157 172 155 801 1585 2071 3053 3691 3223
559908C223l03Q23N68j494j936J05O58j263j495p13J49K11J236P33K00m74J43
$$ 3223 2920 3743 4311 2817 881 986 1644 381 -1114 -1827 -1678 -1467 -231 502 702 228 371
560946C71M21q8p15l49k99K50R73J416Q81k06k308j876q78q26pM59J371R81l98
$$ 371 792 704 -11 -360 -659 -409 564 1980 2861 2655 347 -1529 -2407 -3233 -3240 -2781 -1410 -429 -827
562106h27j707L3J253J193L49M47J917O48j588k385j041K67J995l77k215n88J520
$$ -827 -2534 -2501 -1248 -55 294 741 2658 3306 1718 -667 -1708 -1441 554 177 -2038 -2626 -1106
563143a106Q09J055J032L99P22P07j175q33j60l96Q44K52j38jj08m39L84k67P65
$$ -1106 -297 758 1790 2189 2911 3618 2443 1610 1450 1054 1898 2150 2012 2011 1903 1464 1848 1581 2346
564303B346K258R28L79k08m96j771l96J87j25R58p09j224oq48p79Q84O02p75p07
$$ 2346 4604 5532 5911 5703 5207 3436 3040 3227 3102 4060 3351 2127 2121 1273 494 1378 1980 1205 498
565463D98q66J121o33j431N50R95R77r21k789j418K11J689O44M5J176O8p30j572
$$ 498 -368 753 120 -1311 -761 234 1211 290 -2499 -3917 -3706 -2017 -1373 -1328 -152 -84 -814 -2386
566561b386m97L44L135K853m85j886j65L76R62P11J415K48j100k914k404M02J206
$$ -2386 -2883 -2539 596 3449 2964 1078 913 1289 2251 2962 4377 4625 3525 611 -1793 -1391 -185
567599a85O15j189M74J776L67R8r85j396r6N12J124K50n54K66n46j096p24q06
$$ -185 430 -759 -285 1491 1858 1956 971 -425 -521 -9 1115 1365 811 1077 531 -565 -1289 -2095
568698b095p8M58J454J445J728j0j756o99m74N16J840L47j293j180k27R62l76
$$ -2095 -2173 -1715 -261 1184 2912 2902 1146 447 -27 489 2329 2676 1383 203 -24 938 562
569735E62m11o77K3m40r2J003K329J09l026k319n39J683J086j301m13o2L89n1
$$ 562 151 -526 -503 -943 -1035 -32 2297 2406 -620 -2939 -3478 -1795 -709 -2010 -2423 -2485 -2096 -2147
570834b147k39J786J566J812J883k37l33R02J291q7N2j698p54J306R49M78k17
$$ -2147 -2386 -600 966 2778 4661 4424 4091 4993 6284 6197 6249 4551 3797 5103 6052 6530 6313
571872F313K62j047J11k169k195k70q79N68p43j15Q06M78j050j69J220M51J27
$$ 6313 6575 5528 5639 3470 1275 1005 126 694 -49 -164 642 1120 70 -99 1121 1572 1699
572909A699M00k15L81Q91P9O80Q1J97P81k87j844p0J91j377j393L14K509N36p88
$$ 1699 2099 1884 2265 3156 3235 3915 3996 4193 4974 4687 2843 2773 2964 1587 194 508 3017 3553 2765
574069B765r91m16K72j463R53O22N95M59L15r72m45Q59J071p90J55O50j164p34
$$ 2765 1774 1358 1630 167 1120 1742 2337 2796 3111 2139 1694 2553 3624 2834 2989 3639 2475 1741
575168A741P71m03R77J23n70j181j60k18L31q07J16J141J376N83k3j12n05j246
$$ 1741 2512 2109 3086 3209 2639 1458 1298 1080 1411 604 720 1861 3237 3820 3797 3685 3180 1934
576267A934o05J88O52Q58K30n96j065j002l61J0qL12J39O08J077L46j011j72J812
$$ 1934 1329 1517 2169 3027 3257 2661 1596 594 233 243 235 547 686 1294 2371 2717 1706 1534 3346
577426C346J244O14j463j786J83O73o94j683j223j856J411K698R69l13r28j045
$$ 3346 4590 5204 3741 1955 2138 2811 2117 434 -789 -2645 -1234 1464 2433 2120 1192 147
578403A47o35J423J002R57P13j034l09j922j623q12q62J459K374M48M87N20M66
$$ 147 -488 935 1937 2894 3607 2573 2264 342 -1281 -2093 -2955 -1496 878 1326 1813 2333 2799
579440B799R6j44k35L44j402k52N17L10J965J053j358p36J187Q6j415j61K20k2
$$ 2799 2895 2751 2516 2860 1458 1206 1723 2033 3998 5051 3693 2957 4144 4230 2815 2654 2874 2852
580539B852L37r28o40Q11J554J471j138n31j373j299j652k260j848J482K138J146
$$ 2852 3189 2261 1621 2432 3986 5457 4319 3788 2415 1116 -536 -2796 -4644 -3162 -1024 122
581516A22J574N20Q5N2J51L76l07M25j835k307n88J793J861K079O1p0j313R73
$$ 122 1696 2216 2301 2353 2504 2880 2573 2998 1163 -1144 -1732 61 1922 4001 4062 3992 2679 3652
582615C652J333j96o62J879j48j570p19j011n35Q32J209l55j158P14Q55L77l66
$$ 3652 4985 4789 4127 6006 5858 4288 3569 2558 2023 2855 4064 3709 2551 3265 4120 4497 4131
583652D131q00L91O08Rm03j115j107m01P8K40M21q19L90J803m83p41N26R18K31
$$ 4131 3331 3722 4330 4339 3936 2821 1714 1313 1391 1631 2052 1233 1623 3426 2943 2202 2728 3646 3877
584812C877q6n27p9J357o4j287j744r80ON58j4k74j600j446J392J577K81p45k096
$$ 3877 3791 3264 3185 4542 4478 3191 1447 467 473 1031 1017 743 -857 -2303 -911 666 947 202 -1894
585972a894L7K081P52j249m25J370Q58J96M33J08q94j557n84Q06J125J561O58
$$ -1894 -1857 224 976 -273 -698 672 1530 1726 2159 2267 1373 -184 -768 38 1163 2724 3382
587010C382j132n73J291J30n68q16j08J111p13k83O43p53K80P67J23J063k87k219
$$ 3382 2250 1677 2968 3098 2530 1714 1606 2717 2004 1721 2364 1611 1891 2658 2781 3844 3557 1338
588108A338j580p26j74J166L92P51K3j197j571j037Q97K44K98j577p63r4K6J824
$$ 1338 -242 -968 -1142 24 416 1167 1190 -7 -1578 -2615 -1718 -1474 -1176 -2753 -3516 -3610 -3584 -1760
589207a760J233K328J866l14k23o13j982j471M7j5q86j49J769J641P76R0l1j865
$$ -1760 -527 1801 3667 3353 3130 2517 535 -936 -889 -904 -1790 -1939 -170 1471 2247 2337 2306 441
590305D41l144j149J197N87J266J794J687L43j95O3J298J805q29k530k013m39
$$ 441 -2703 -3852 -2655 -2068 -802 992 2679 3022 2827 2890 4188 5993 5164 2634 621 182
591282A82L69k22n62O91J39r22P03N31j181M18J320n32j214O04K05j258O66J361
$$ 182 551 329 -233 458 597 -325 378 909 -272 146 1466 934 -280 324 529 -729 -63 1298
592381A298K27j032n96J083M82j60j8n40N64J379J008q89r00p82K36M92L38J57
$$ 1298 1525 493 -103 980 1462 1302 1284 744 1308 2687 3695 2806 1906 1124 1360 1852 2190 2347
593480B347N1L70n08k99Rk46N00n41Q24K045Q98j332j173J30K41n54p08j069n90
$$ 2347 2398 2768 2260 1961 1970 1724 2224 1683 2507 4552 5450 4118 2945 3075 3316 2762 2054 985 395
594639C95q81q70R03O65m79l91J686J440q7K21j640j904J656j69j379pj356J160
$$ 395 -486 -1356 -453 212 -267 -658 1028 2468 2381 2602 962 -942 714 545 -834 -841 -2197 -1037
595738a037K283l01J47j221j902m41K384K158P1j325M6P98J346J607k08J119N99
$$ -1037 1246 945 1092 -129 -2031 -2472 -88 2070 2141 816 862 1660 3006 4613 4405 5524 6123
596776F123j022n7M15J58l63r21N52K539j06j770j837L73J696P25m47o58j408
$$ 6123 5101 5044 5459 5617 5254 4333 4885 7424 7318 5548 3711 4084 5780 6505 6058 5400 3992
597813C992j680n68L88J257J192J335q3r97J307J754q52j644j369L08L82j082
$$ 3992 2312 1744 2132 3389 4581 5916 5833 4836 6143 7897 7045 5401 4032 4340 4722 3640
598790C640k055j126L54k65P09K98J83K195o58n17J159N36r39K04J277K165j97
$$ 3640 1585 459 813 548 1257 1555 1738 3933 3275 2758 3917 4453 3514 3718 4995 7160 6963
599828F963j078k147k983j532L44J542k66n72J007R60k37j067J61J049J283N26
$$ 6963 5885 3738 755 -777 -433 1109 843 271 1278 2238 2001 934 1095 2144 3427 3953
600804C953k48o03l02j01J91l3j21j545J225K415r2j147q2j881j398N86L85j002
$$ 3953 3705 3102 2800 2699 2890 2857 2736 1191 2416 4831 4739 3592 3510 1629 231 817 1202 200
601903B00j76p76O86K590K262j069p75O76N3o80p1K94M18r08l66M48K46l67M49
$$ 200 24 -752 -66 2524 4786 3717 2942 3618 3671 2991 2920 3214 3632 2724 2358 2806 3052 2685 3134
603063C134m27j751j202j009j281J13J420J783j08o45M50l2o15j52l91K059J318
$$ 3134 2707 956 -246 -1255 -2536 -2423 -1003 780 672 27 477 445 -170 -322 -713 1346 2664
604101B664k21l50n12m83r19p35Q0J157M73r18O7O89N53K171Q43j99j569l01j426
$$ 2664 2443 2093 1581 1098 179 -556 -476 681 1154 236 303 992 1545 3716 4559 4360 2791 2490 1064
605260A064r92j082j060K242L021O72J541J237M27j569r40N30O08o07j985j046
$$ 1064 72 -1010 -2070 172 3193 3865 5406 6643 7070 5501 4561 5091 5699 5092 3107 2061
606237B061q68j035L84R69N58p84q83N87j85l98m62J117R55j42l25l8l37jR09
$$ 2061 1193 158 542 1511 2069 1285 402 989 804 406 -56 1061 2016 1874 1549 1511 1174 1173 2082
607396B082o40k62j126j499J141J878j05o86R30j272j096N46O38J088J23Q99m89
$$ 2082 1442 1180 54 -1445 -304 1574 1469 783 1713 441 -655 -109 529 1617 1740 2639 2150
608434B150j693O56J369k50j080l46J85J665N15q42k98j391k40R72P58L28j203
$$ 2150 457 1113 2482 2232 1152 806 991 2656 3171 2329 2031 640 400 1372 2130 2458 1255
609472A255N12J001O55J309J534j84o73J05p67j198j523j318k94k93J040O45L99
$$ 1255 1767 2768 3423 4732 6266 6082 5409 5514 4747 3549 2026 708 414 121 1161 1806 2205
610509B205O07M80l97p14j41P16R92j777o20j080o17M25J261J068N04J284J402
$$ 2205 2812 3292 2895 2181 2040 2756 3748 1971 1351 271 -346 79 1340 2408 2912 4196 5598
611547E598J090k78j285l645j317n40k61K74J433J542k36m68J57l68O11o68k79
$$ 5598 6688 6410 5125 1480 163 -377 -638 -364 1069 2611 2375 1907 2064 1696 2307 1639 1360
612585A360p08j068O0N49J507k80k04J010J266J661k32r3K0k142k690r80M75O27
$$ 1360 652 -416 -356 193 1700 1420 1216 2226 3492 5153 4921 4828 4848 2706 16 -964 -489 138
613683A38j69n08L05J064R66J799J852q3k082j589m40Q70K52J09k44K21j98j506
$$ 138 -31 -539 -234 830 1796 3595 5447 5364 3282 1693 1253 2123 2375 2484 2240 2461 2263 757
614782G57j97J405J372k2k578j189j66Q87J726N7M20O53L33J62o48k036j415p6
$$ 757 560 1965 3337 3315 737 -452 -618 269 1995 2052 2472 3125 3458 3620 2972 936 -479 -555
615881e55L45J225M29j018L14K915J470q4k83j946k416j49L79J276J470N88l00
$$ -555 -210 1015 1444 426 740 3655 5125 5041 4758 2812 396 247 626 1902 3372 3960 3660
616919C660p82j249M68k34j082m50J488P68j169j642n28o12R90J716J180L00r5
$$ 3660 2878 1629 2097 1863 781 331 1819 2587 1418 -224 -752 -1364 -374 1342 2522 2822 2727
617956B727r18p12j135j028Q47M66J191J495j177j289O93J615O88p69j320j221
$$ 2727 1809 1097 -38 -1066 -219 247 1438 2933 1756 467 1160 2775 3463 2694 1374 153
618933A53n08p38L83J017J11O17K177N37N3j30o34J24j69r6o05j368k025j836
$$ 153 -355 -1093 -710 307 418 1035 3212 3749 3802 3672 3038 3162 2993 2897 2292 924 -1101 -2937
620032b937l62J220J922Q34M23J55j231l86J700J498K42o30n40Q72k16k64k470
$$ -2937 -3299 -2079 -157 677 1100 1255 24 -362 1338 2836 3078 2448 1908 2780 2564 2300 -170
621069a70j731J287J864K176Q35q47q57M78N26q76j352j107q90J052K717J693
$$ -170 -1901 -614 1250 3426 4261 3414 2557 3035 3561 2685 1333 226 -664 388 3105 4798
622046D798N75n59j987j885j01Q02J611J037j079q4K088J604kq19j066j183k481
$$ 4798 5373 4814 2827 942 841 1643 3254 4291 3212 3128 5216 6820 6818 5999 4933 3750 1269
623083A269k147k81P02l75j370M3M80N2O36j3J36J057J692J672j219j159P47J683
$$ 1269 -878 -1159 -457 -832 -2202 -2159 -1679 -1627 -991 -1004 -868 189 1881 3553 2334 1175 1922 3605
624182C605o91p78j77J77k31j128N5J204L79j318k390j362J61K93J426J634l87
$$ 3605 2914 2136 1959 2136 1905 777 832 2036 2415 1097 -1293 -2655 -2494 -2201 -775 859 472
625220D72r24j290J372K810J85k2R50Q13k19J1j053k92O03j40q04j020l62j010
$$ 472 -452 -1742 -370 2440 2625 2603 3553 4366 4147 4158 3105 2813 3416 3276 2472 1452 1090 80
626319H0j419J586L76J443P48l58L67J721m18j479m62n78K7R84M73j192j519J494
$$ 80 -1339 247 623 2066 2814 2456 2823 4544 4126 2647 2185 1607 1634 2618 3091 1899 380 1874
627417A874J251j95M55P84K92j70m28k026p67J68J364J57l56O77P17l35P81L12
$$ 1874 3125 2930 3385 4169 4461 4291 3863 1837 1070 1238 2602 2759 2403 3080 3797 3462 4243 4555
628516D555l74J899J204j618j990j649r07J527R55p19k62Q94J339l44j274j071
$$ 4555 4181 6080 7284 5666 3676 2027 1120 2647 3602 2883 2621 3515 4854 4510 3236 2165
629492B165L64J421J50j373n0J010M75l30j327o46p2q47j0j382J75J273J472J744
$$ 2165 2529 3950 4100 2727 2677 3687 4162 3832 2505 1859 1787 940 930 -452 -277 996 2468 4212
630591D212P79o97j904M79K181J747r00k021j547M1P26O75l90p20j94K5L18k02
$$ 4212 4991 4294 2390 2869 5050 6797 5897 3876 2329 2370 3096 3771 3381 2661 2467 2492 2810 2608
631690B608k71P95p74j595J42J280j236k04J635O30L1o88M00J856O02m81j2q31
$$ 2608 2337 3132 2358 763 905 2185 949 745 2380 3010 3041 2353 2753 4609 5211 4730 4718 3887
632789C887k869k328m92k64P35J792O38M34P63o26J413J377J81k273j538O80J371
$$ 3887 1018 -1310 -1802 -2066 -1331 461 1099 1533 2296 1670 3083 4460 4641 2368 830 1510 2881
633826B881L81j527j777p88J98K78m8k12J23P2N39J277J194p28k32J953Q25n39
$$ 2881 3262 1735 -42 -830 -632 -354 -402 -614 -491 -419 120 1397 2591 1863 1631 3584 4409 3870
634925C870j127K3l12O28K60M97J568J90j177k05m92p22o98k53O8O84J810L55
$$ 3870 2743 2766 2454 3082 3342 3839 5407 5597 4420 4215 3723 3001 2303 2050 2118 2802 4612 4967
636024D967j681j873L46j97J156l62K2J52P26o96j664J177J733Q21j92l372k647
$$ 4967 3286 1413 1759 1562 2718 2356 2378 2530 3256 2560 896 2073 3806 4627 4435 1063 -1584
637061a584J210J352j91M09O42k71l40q83n02k56r67O39J912J172R23k90j12K25
$$ -1584 -374 978 787 1196 1838 1567 1227 344 -158 -414 -1381 -742 1170 2342 3265 2975 2863 3088
638160C088K405J463l298j664J163M76p35n41L69j06k93q07o90O7N26l76j95R15
$$ 3088 5493 6956 3658 1994 3157 3633 2898 2357 2726 2620 2327 1520 830 897 1423 1047 852 1767
639259A767L43p58k46P21j133J403K872M5M49j4j127j284j444j64K24J934N06
$$ 1767 2110 1352 1106 1827 694 2097 4969 5014 5463 5449 4322 3038 1594 1430 1654 3588 4094
640297D094k129j366m67J001K019K20k84m05k35l46l13p55Q65P53n2J445J306
$$ 4094 1965 599 132 1133 3152 3372 3088 2683 2448 2102 1789 1034 1899 2652 2600 4045 5351
641334E351l90Q56P46j936l400r42J527J466j00q95K45P70k21O44Q85K92j768
$$ 5351 4961 5817 6563 4627 1227 285 1812 3278 3178 2283 2528 3298 3077 3721 4606 4898 3130
642372C130r14j58N2J906J776j360j397m96k30J213R15O41J559m43k048k871k059
$$ 3130 2216 2058 2110 4016 5792 4432 3035 2539 2309 3522 4437 5078 6637 6194 4146 1275 -784
643409g84O19K123O40R42K083q82k401k076k90M47L35L25o28j198p17R50j2J254
$$ -784 -165 1958 2598 3540 5623 4741 2340 264 -26 421 756 1081 453 -745 -1462 -512 -524 730
644508G30J062q34j701p06J237J179O0j987j099P71ON41O45R67O48k65j260J345
$$ 730 1792 958 -743 -1449 -212 967 1027 -960 -2059 -1288 -1282 -741 -96 871 1519 1254 -6 1339
645607A339o57J62J693l6m77M56P3r41J83L17J092K679O26j339k91K45q33L33
$$ 1339 682 844 2537 2501 2024 2480 2553 1612 1795 2112 3204 5883 6509 5170 4879 5124 4291 4624
646706D624P66j425o1M02j711K98L286J273k63k092k269o81o59M04o00m77J98
$$ 4624 5390 3965 3904 4306 2595 2893 6179 7452 7189 5097 2828 2147 1488 1892 1292 815 1013
647743A013M59m95J23m70j062L75K41J0m76L81J387N58r53j146J782K351J51M02
$$ 1013 1472 977 1100 630 -432 -57 184 194 -282 99 1486 2044 1091 -55 1727 4078 4229 4631
648842D631m34j603j536O08Q88J356j045k812j678P70K254K20J160N90n58K47
$$ 4631 4197 2594 1058 1666 2554 3910 2865 53 -1625 -855 1399 1619 2779 3369 2811 3058
649818C058J41p44j594o22p52O53J609J160L88r51j457j814j374J068K172J169
$$ 3058 3199 2455 861 239 -513 140 1749 2909 3297 2346 889 -925 -2299 -1231 941 2110
650795B110J16O1k28O56K354j253j504m23K16L76r79m23Q4J007P38P69n32k620
$$ 2110 2226 2287 2059 2715 5069 3816 2312 1889 2105 2481 1502 1079 1163 2170 2908 3677 3145 525
651894E25L4M64q13r75j312k60J521J846K245J059Mk90k020j496L5p0N64L66l16
$$ 525 559 1023 210 -765 -2077 -2337 -816 1030 3275 4334 4338 4048 2028 532 567 497 1061 1427 1111
653054A111J07N00J388M77l12L03m78J39J15j541j208J479O10k14k5p47j224m4
$$ 1111 1218 1718 3106 3583 3271 3574 3096 3235 3350 1809 601 2080 2690 2476 2451 1704 480 436
654152D36j06j10Qk28J312N36J267L90j123j226l6j17P71Nk90j212j545p50J26
$$ 436 330 220 228 0 1312 1848 3115 3505 2382 1156 1120 1003 1774 1779 1489 277 -1268 -2018 -1892
655312a892j118J240J052L6R41R6j578J13J038l40j271P8K124M03p00j090l52
$$ -1892 -3010 -1770 -718 -682 259 355 -1223 -1110 -72 -412 -1683 -1605 519 922 222 -868 -1220
656350a220K66n13m23N77L212L070J757O59P07k72Q0m88l94j497j076l45j181
$$ -1220 -954 -1467 -1890 -1313 1899 4969 6726 7385 8092 7820 7900 7412 7018 5521 4445 4100 2919
657387B919j587N00J849k7j277L51J069j99p16J63J12q53k86j028j417O09J334
$$ 2919 1332 1832 3681 3654 2377 2728 3797 3598 2882 3045 3157 2304 2018 990 -427 182 1516
658425A516n6n21J093O24m42q9j501j26J197l17n78K32M51J103j47k73n21q32
$$ 1516 1460 939 2032 2656 2214 2125 624 498 1695 1378 800 1032 1483 2586 2439 2166 1645 813
659524H13j291r72M61j88q35Q68L116M41j693l39J259L7j293j402J329O22R55
$$ 813 -478 -1450 -989 -1177 -2012 -1144 1972 2413 720 381 1640 1677 384 -1018 311 933 1888
660561A888K63j310j156L39p2R51J442J22J6j379j15J5O08M6J320n40k938N77
$$ 1888 2151 841 -315 24 -48 903 2345 2467 2483 1104 989 1004 1612 1658 2978 2438 -500 77
661660G7K362R69M03O2J70J065n66k03j141r52j198r22P8J061L16L3M83j234j54
$$ 77 2439 3408 3811 3873 4043 5108 4542 4339 3198 2246 1048 126 204 1265 1581 1614 2097 863 709
662820G09L14k52J46o25L87O75J171r8j870j744m38M37Q21J363J168n46m17N0
$$ 709 1023 771 917 292 679 1354 2525 2427 557 -1187 -1625 -1188 -367 996 2164 1618 1201 1251
663919A251n16j851j251m43P57J364j25j70p66J023N80o5M44k87R7O32J929K07
$$ 1251 735 -1116 -2367 -2810 -2053 -689 -814 -984 -1750 -727 -147 -212 232 -55 42 674 2603 2810
665017B810j156j020r97k36m96j037L39N34J72M20K232J728J008q59j250K39j387
$$ 2810 1654 634 -363 -599 -1095 -2132 -1793 -1259 -1087 -667 1565 3293 4301 3442 2192 2431 1044
666055A044l80n92p91K168K333j08o63l94R55J123q52j55J93p61n15j429k273
$$ 1044 664 72 -719 1449 3782 3674 3011 2617 3572 4695 3843 3688 3881 3120 2605 1176 -1097
667092a097p94K27L09P61J021J098n24N3M19M96M51q25j19J217l1J22J82J169
$$ -1097 -1891 -1664 -1355 -594 427 1525 1001 1054 1473 1969 2420 1595 1476 2693 2662 2784 2966 4135
668191D135m21j252j260K54l42p97L25j36j690n13J551K6j453l80J982K390J172
$$ 4135 3714 2462 1202 1456 1114 317 642 506 -1184 -1697 -146 -120 -1573 -1953 29 2419 3591
669229C591p32j165j137P19K64j759n32J453P67J782j166r88J422R64o98k36k85
$$ 3591 2859 1694 557 1276 1540 -219 -751 702 1469 3251 2085 1097 2519 3483 2785 2549 2264
670266B264k685n30J491J068N51p11J70J582J148Q06J082j075j975k01K14M93
$$ 2264 -421 -951 540 1608 2159 1448 1618 3200 4348 5154 6236 5161 3186 2985 3199 3692
671243C692M95k37j7Q51j521k562n78P90J755J84k308P69J489J13j03j018k572
$$ 3692 4187 3950 3933 4784 3263 701 123 913 2668 2852 544 1313 2802 2915 2812 1794 -778
672281g78l99J340J047O85j251r09R6k014j053J758j59j288R90J622M45J101O07
$$ -778 -1177 163 1210 1895 644 -265 -169 -2183 -3236 -1478 -1637 -2925 -1935 -313 132 1233 1840
673318A840q54j760O8L394J047J11K97J54j90p43nO66J314N36J285j07j454l30
$$ 1840 986 -774 -706 2688 3735 3846 4143 4297 4107 3364 3359 4025 5339 5875 7160 7053 5599 5269
674417E269l30j6q24o43j161n37l72j896j03J177P17k94j387j155r2m54M75K49
$$ 5269 4939 4923 4099 3456 2295 1758 1386 -510 -613 564 1281 987 -400 -1555 -1647 -2101 -1626 -1377
675516a377L71lj02O91O34J022Q78N00r5p06m93j595j033J153P80N80Q01P59J91
$$ -1377 -1006 -1009 -1111 -420 214 1236 2114 2614 2519 1813 1320 -275 -1308 -155 625 1205 2006 2765 2956
676676B956m42m34j171l34N99q37m62l92m11O66J517K76N7J187n50R9P03m08j261
$$ 2956 2514 2080 909 575 1174 337 -125 -517 -928 -262 1255 1531 1588 2775 2225 2324 3027 2619 1358
677835A358j111o08l13O81L34L96J256J169N03P7q37j541m87j67q46P90J467J086
$$ 1358 247 -361 -674 7 341 737 1993 3162 3665 3742 2905 1364 877 710 -136 654 2121 3207
678934C207J427M19k490k136o65r2j76j82J632J821M52l70j4l89L07j093j232
$$ 3207 4634 5053 2563 427 -238 -330 -506 -688 944 2765 3217 2847 2833 2444 2751 1658 426
679972D26r6l4K65J453J152n18p88j262Q49J866Q51L99m46j259m70j385k11r36
$$ 426 330 296 561 2014 3166 2648 1860 598 1447 3313 4164 4563 4117 2858 2388 1003 792 -144
681070a44j237R19L28N19J378J861n94P14J579J034p65q32j137m36r36n41J997
$$ -144 -1381 -462 -134 385 1763 3624 3030 3744 5323 6357 5592 4760 3623 3187 2251 1710 3707
682108C707N87l44K86q96Q10J561J151Q4j660k186k071j712j046J408J855O75
$$ 3707 4294 3950 4236 3340 4150 5711 6862 6946 5286 3100 1029 -683 -1729 -321 1534 2209
683085B209j272j535L07J403K085O30k07j040j091q0O35k18q12n83j003Q79N92
$$ 2209 937 -598 -291 1112 3197 3827 3620 2580 1489 1409 2044 1826 1014 431 -572 307 899
684122H99j21k03Q98L40o38k55Q49N0j362j697k33J1K55R37M11K536J350k015
$$ 899 778 575 1473 1813 1175 920 1769 1819 457 -1240 -1473 -1462 -1207 -270 141 2677 4027 2012
685221B012j751p17j012J465J050O07K79O94R68L05N02M19J38J30J43j077m5l7
$$ 2012 261 -456 -1468 -3 1047 1654 1933 2627 3595 3900 4402 4821 4959 5089 5232 4155 4110 4073
686320D073M24O62P5j646n73J517m49k291r23Q58N29M93m20J34l25n02r94q73
$$ 4073 4497 5159 5234 3588 3015 4532 4083 1792 869 1727 2256 2749 2329 2463 2138 1636 642 -231
687418b31j95N52J405N3j052l72j664k136K55j41k035L45J148j47J380J920K922
$$ -231 -426 126 1531 1584 532 160 -1504 -3640 -3385 -3526 -5561 -5216 -4068 -4215 -2835 -915 2007
688456B007J157l23j313N58N44N72N74j13n6L20M36j41j050m87n85o51J289N85
$$ 2007 3164 2841 1528 2086 2630 3202 3776 3663 3607 3927 4363 4222 3172 2685 2100 1449 2738 3323
689555C323p59p01j04j059j298j054Q46J718J905n29j088p86j194o12N67O40k61
$$ 3323 2564 1863 1759 700 -598 -1652 -806 912 2817 2288 1200 414 -780 -1392 -825 -185 -446
690593d46K89K657M05k335j716R76J347J92M62l1j005J076N90o36P32r24j256
$$ -446 -157 2500 2905 570 -1146 -170 1177 1369 1831 1800 795 1871 2461 1825 2557 1633 377
691630C77OP7J226Lm95J426J691L84J140J039j61k044j504L03o02K7R79O14J36
$$ 377 383 460 1686 1689 1194 2620 4311 4695 5835 6874 6713 4669 3165 3468 2866 2893 3872 4486 4622
692790D622J48j76j00j047k447k041J238K873J775Q91p61l44r18j719j90N69p84
$$ 4622 4770 4594 4494 3447 1000 -1041 197 3070 4845 5736 4975 4631 3713 1994 1804 2373 1589
693827A589M5k10o8K44p75j160o2K26M1j018R56J374r22P22K260J247p60k04j053
$$ 1589 1634 1424 1356 1600 825 -335 -397 -171 -130 -1148 -192 1182 260 982 3242 4489 3729 3525 2472
694987B472m63K009J845q90o48j6j57p28J084j06L32Q14m98l101j301K28J151
$$ 2472 2009 4018 5863 4973 4325 4309 4152 3424 4508 4402 4734 5548 5050 1949 648 876 2027
696025B027R15j05p41J223K288j068n95q71n58J526N98J82q45L96J864L8j272
$$ 2027 2942 2837 2096 3319 5607 4539 3944 3073 2515 4041 4639 4821 3976 4372 6236 6274 5002
697063E002j947p29p81j465j150M7J044R1n55P46J56k160P9L835J866j083Q83
$$ 5002 3055 2326 1545 80 -1070 -1023 21 112 -443 303 459 -1701 -1622 2213 4079 2996 3879
698100C879j13P5p81j060J564J075p38j64q47M5o60N95K43j060j771j860M67K099
$$ 3879 3766 3841 3060 2000 3564 4639 3901 3737 2890 2935 2275 2870 3113 2053 282 -1578 -1111 988
699199I88J236J039Q93n32q10P98J433j739k065p75Q90O53M92m32n89O57j70K31
$$ 988 2224 3263 4156 3624 2814 3612 5045 3306 1241 466 1356 2009 2501 2069 1480 2137 1967 2198
700298B198R24Po22p39Q8K011J055r00j316n02Q79M62j025M9R42J106J127L75
$$ 2198 3122 3129 2507 1768 1856 3867 4922 4022 2706 2204 3083 3545 2520 2569 3511 4617 5744 6119
701396F119j077j638j909K54o10k166L18K461J209j259q62j347p32m22J556Q59
$$ 6119 5042 3404 1495 1749 1139 -1027 -709 1752 2961 1702 840 -507 -1239 -1661 -105 754
702373G54pK46n21L09Q84O71j59Q88J488L52k191j760k7L10o90l76j177N9R87
$$ 754 747 993 472 781 1665 2336 2177 3065 4553 4905 2714 954 927 1237 547 171 -1006 -947 40
703533D0J320K03M61L66p94j635m73M45J054m40J46J550L59p20N7l18l69%n92
$$ 40 1360 1563 2024 2390 1596 -39 -512 -67 987 547 693 2243 2602 1882 1939 1621 1252 1252 660
704692F60n38N90l08k162j638J098R18j997k380K38K486K075L182j86J8J61j339
$$ 660 122 712 404 -1758 -3396 -2298 -1380 -3377 -5757 -5519 -3033 -958 2224 2038 2056 2217 878
705730H78j807N42o98j903m42K069J693m48J246N24M09l13q84n25R11l65l31O57
$$ 878 -929 -387 -1085 -2988 -3430 -1361 332 -116 1130 1654 2063 1750 866 341 1252 887 556 1213
706829A213k74j87Q70Q2N54O39J49m71j919l55J124M43j32J978Q64q41J33J17
$$ 1213 939 752 1622 1704 2258 2897 3046 2575 656 301 1425 1868 1736 3714 4578 3737 3870 3987
707927C987K55J378n7j660k388n07J607J828J472M36j053j269j100k63J442N37
$$ 3987 4242 5620 5563 3903 1515 1008 2615 4443 5915 6351 5298 4029 2929 2666 4108 4645
708904D645J170K44j976j140q30j858o46P00J195Q48J868J820j45j242r97L94
$$ 4645 5815 6059 4083 2943 2113 255 -391 309 1504 2352 4220 6040 5895 4653 3656 4050
709881D050Q59j048m80o47q74L8J155M05j780P2J145O76P52j54j450Q4K60j42
$$ 4050 4909 3861 3381 2734 1860 1898 3053 3458 1678 1750 2895 3571 4323 4169 2719 2803 3063 2921
710980B921j294l0p04j04J040N81o53k52J178L89o69j736j863L07J002J148J059
$$ 2921 1627 1597 893 789 1829 2410 1757 1505 2683 3072 2403 667 -1196 -889 113 1261 2320
712017B320Q41o28O76Q18J37J489k98j599j315r48J261K433J249j45m09q2j140
$$ 2320 3161 2533 3209 4027 4164 5653 5355 3756 2441 1493 2754 5187 6436 6291 5882 5800 4660
713055D660n17j190q73R24J481r8r17j167P41K560P97k82N48K46j133l65L67j061
$$ 4660 4143 2953 2080 3004 4485 4387 3470 2303 3044 5604 6401 6119 6667 6913 5780 5415 5782 4721
714153D721p28R0J830L95j049l21N99P53L54j257j665j204j76L42J53j129n36
$$ 4721 3993 4083 5913 6308 5259 4938 5537 6290 6644 5387 3722 2518 2342 2684 2837 1708 1172
715191A172M58n53p19R55M20q05P11L23L17K44j532o74K11M2l1J276K70k916o39
$$ 1172 1630 1077 358 1313 1733 928 1639 1962 2279 2523 991 317 528 570 539 1815 2085 -831 -1470
716351a470J075P15J183J488n58j660R4M33L02J823K710L78j165j573K33N89K12
$$ -1470 -395 320 1503 2991 2433 773 867 1300 1602 3425 6135 6513 5348 3775 4008 4597 4809
717389D809O1p15j437L45p47q46K13J437L54n19j544r53kJ61j149R82J043J41
$$ 4809 4870 4155 2718 3063 2316 1470 1683 3120 3474 2955 1411 458 456 617 -532 450 1493 1634
718487A634l74q75m26O22J115K012J925M81j113j355j478P3R00j032j493j656
$$ 1634 1260 385 -41 581 1696 3708 5633 6114 5001 3646 2168 2241 3141 2109 616 -1040
719464a040N56M59Q15n8l04J416J075O12m43j694j807K03J566Q17J61N79l5l169
$$ -1040 -484 -25 790 732 428 1844 2919 3531 3088 1394 -413 -210 1356 2173 2334 2913 2878 -291
720562b91j169J364J139J346N15p66n34J185Q31K52p61j96j774L08O11p74r31
$$ -291 -1460 -96 1043 2389 2904 2138 1604 2789 3620 3872 3111 2915 1141 1449 2060 1286 355
721600C55J94J69O28l70j295r62J257J596Q26J124o36j802J95J462J685n01j411
$$ 355 549 718 1346 976 -319 -1281 -24 1572 2398 3522 2886 1084 1279 2741 4426 3925 2514
722638B514J54Q48l6j280r81n23j17k35j81J136M62l66o35k46L48K35o52k95J273
$$ 2514 2668 3516 3480 2200 1219 696 579 344 163 1299 1761 1395 760 514 862 1097 445 150 1423
723798A423J641j49R81M3j110L63O3l2O0o67j614k085j330J378O07m89Q83J937
$$ 1423 3064 2915 3896 3939 2829 3192 3255 3223 3283 2616 1002 -1083 -2413 -1035 -428 -917 -34 1903
724896A903O15j332p3J31k48M7J8N7J016J73o80r06m57J465J232Q23K93n66n83
$$ 1903 2518 1186 1113 1244 996 1043 1061 1118 2134 2307 1627 721 264 1729 2961 3784 4077 3511 2928
726056B928q7R5j776j018N38R1O7O44J284J82p39J60N71r1k10j016j004m25r44
$$ 2928 2841 2936 1160 142 680 771 838 1482 2766 2948 2209 2369 2940 2849 2639 1623 619 194 -750
727216g50j86M26J24J221K97q91M71J067j51Q41J231N8j647R01J819l31j117p00
$$ -750 -936 -510 -386 835 1132 241 712 1779 1628 2469 3700 3758 2111 3012 4831 4500 3383 2683
728315B683m23l35J953N53j594M02P15R12l40m63q49K80J682M06Q69K0o87K31
$$ 2683 2260 1925 3878 4431 2837 3239 3954 4866 4526 4063 3214 3494 5176 5582 6451 6471 5784 6015
729413F015P5j49O1j146l663n80J037M79M66k34j312j635k06m69N74J251K52L39
$$ 6015 6090 5941 6002 4856 1193 613 1650 2129 2595 2361 1049 -586 -792 -1261 -687 564 816 1155
730512A155P36N8Q84O6Q23J92j908O71j67k136j216j147j195J85L536L178J72
$$ 1155 1891 1949 2833 2899 3722 3914 2006 2677 2510 374 -842 -1989 -3184 -2999 537 3715 3887
731549C887j370r28j16M47L37l66p01o7K14k21j611R89Q05l68j17L72o1J133K24
$$ 3887 2517 1589 1473 1920 2257 1891 1190 1123 1337 1116 -495 494 1299 931 814 1186 1125 2258 2482
732709B482j710n72N20j124j838j457J786K878K455k31j466O59N27R42M77j018
$$ 2482 772 200 720 -404 -2242 -3699 -1913 965 3420 3189 1723 2382 2909 3851 4328 3310
733686C310j260P83Qm17J51j100o59J074R45k209k118K5J144J753R71j243n73
$$ 3310 2050 2833 2841 2424 2575 1475 816 1890 2835 626 -1492 -1467 -323 1430 2401 1158 585
734724E85J091J378J022L39j022j652p19J815M35M4L97k23Q27M82p34N22o68m84
$$ 585 1676 3054 4076 4415 3393 1741 1022 2837 3272 3316 3713 3490 4317 4799 4065 4587 3919 3435
735822C435J421M0j063p10j112L63O91Q57j3j532q09K39j088j114R32J602L34
$$ 3435 4856 4896 3833 3123 2011 2374 3065 3922 3909 2377 1568 1807 719 -395 537 2139 2473
736860B473o05l73Q52R20n27q26n11j313p13J88Q57k47n78L75M65L96K345J485
$$ 2473 1868 1495 2347 3267 2740 1914 1403 90 -623 -435 422 175 -403 -28 437 833 3178 4663
737959D663M11q25j068l67P20p09j275j68K81q5j22J166lO9J038l42n53J500J04
$$ 4663 5074 4249 3181 2814 3534 2825 1550 1382 1663 1578 1456 2622 2619 2688 3726 3384 2831 4331 4435
739118D435k167j536l56N74K289l34r18o02q67j350p80R76P31O15J946Q16K34
$$ 4435 2268 732 376 950 3239 2905 1987 1385 518 -832 -1612 -636 95 710 2656 3472 3706
740156C706J064J208r16k577j254M19J61J161P35k450j189l70J513K299K01j967
$$ 3706 4770 5978 5062 2485 1231 1650 1811 2972 3707 1257 68 -302 1211 3510 3711 1744
741133A744j738q0l95R91K329J062K28j342k064n8n22n95K109J510j880m05k59
$$ 1744 6 -74 -469 522 2851 3913 4141 2799 735 677 155 -440 1669 3179 1299 894 635
742170F35J008J230j16k281j654J12J652J270L02J626K61l52r50j662L11P39Q50
$$ 635 1643 2873 2757 476 -1178 -1066 586 1856 2158 3784 4045 3693 2743 1081 1392 2131 2981
743208B981j899r93K81P97J054J646J756Q30K70N48r66k547k10P80j615L35N43
$$ 2981 1082 89 370 1167 2221 3867 5623 6453 6723 7271 6305 3758 3548 4328 2713 3048 3591
744246C591o00p03l60L51J46K45j035j218K89J058m94K21K186O23q65j851r41
$$ 3591 2991 2288 1928 2279 2425 2670 1635 417 706 1764 1270 1491 3677 4300 3435 1584 643
745283F43k57O03N50P43M5l50J40n63J45J202L42R5j36o96j635j568J243P13n74
$$ 643 386 989 1539 2282 2327 1977 2117 1554 1699 2901 3243 3338 3202 2506 871 -697 546 1259 685
746443F85n68o43J29J047O42J784J662j32k638k91P30J189l80M87J226q57r13
$$ 685 117 -526 -397 650 1292 3076 4738 4606 1968 1677 2407 3596 3216 3703 4929 4072 3159
747481C159j796j761j266l29K158J976p15p49M67m0J802J504o92l06l81j636j551
$$ 3159 1363 -398 -1664 -1993 165 2141 1426 677 1144 1104 2906 4410 3718 3412 3031 1395 -156
748518a56N88L99L43K239L63p18j406j306J34L69L78M85K569R23nk280k145p0
$$ -156 432 831 1174 3413 3776 3058 1652 346 480 849 1227 1712 4281 5204 5199 2919 774 704
749617G04P09R36M00j039k273j23J050o06N99J907l68p41J071J99j406k5P38K45
$$ 704 1413 2349 2749 1710 -563 -686 364 -242 357 2264 1896 1155 2226 2425 1019 994 1732 1977
750716A977J396R30m99k678m91K668P33j29j15j535k94P01K56k455j164L63j50
$$ 1977 3373 4303 3804 1126 635 3303 4036 3907 3792 2257 1963 2664 2920 465 -699 -336 -486
751753d86j245L49J541R64K366K043j42n57j788j023q85j918j046K63N92R08K135
$$ -486 -1731 -1382 159 1123 3489 5532 5390 4833 3045 2022 1137 -781 -1827 -1564 -972 -64 2071
752791B071J973j086k322k5J096r38j01J930P13m31r54Q88j265K17N79J49p70
$$ 2071 4044 2958 636 611 1707 769 668 2598 3311 2880 1926 2814 1549 1766 2345 2494 1724
753829A724q28p08K26K115L84J29L9o43p02o20j109l34R14K398J66j224R69J793
$$ 1724 896 188 414 2529 2913 3042 3081 2438 1736 1116 7 -327 587 2985 3151 1927 2896 4689
754928D689N92m16m87R4j42l31q71j118j684R24K198r02j489r68j75l98p48J012
$$ 4689 5281 4865 4378 4472 4330 3999 3128 2010 326 1250 3448 2546 1057 89 -86 -484 -1232 -220
756026b20J497J003P40J491N23j811k85P37J348n8l99j127j002%r31P92P68Q47
$$ -220 1277 2280 3020 4511 5034 3223 2938 3675 5023 4965 4566 3439 2437 2437 1506 2298 3066 3913
757125C913q16l42J49j766K25J040J185J788j03j313j04n73j699j619O99J856
$$ 3913 3097 2755 2904 1138 1363 2403 3588 5376 5273 3960 3856 3283 1584 -35 664 2520
758101B520j140J23K788K448J144n10p73k594k962j636p61K68O69Q28J425K31
$$ 2520 1380 1503 4291 6739 7883 7373 6600 4006 1044 -592 -1353 -1085 -416 412 1837 2068
759078B068p38l1J99Q28k78l316l441M70J295Q44r8J513J616O22J524R08J6J226
$$ 2068 1330 1299 1498 2326 2048 -1268 -4709 -4239 -2944 -2100 -2198 -685 931 1553 3077 3985 4001 5227
760177E227q16k814l09K400q8M69l14J46P13l35n41r61L26J330l83k237j263k61
$$ 5227 4411 1597 1288 3688 3600 4069 3755 3901 4614 4279 3738 2777 3103 4433 4050 1813 550 289
761276B89K20L44n90P08R60p14j262M33N84N5j60j545j334m5J198L08n15L69Q80
$$ 289 509 853 263 971 1931 1217 -45 388 972 1027 867 -678 -2012 -2057 -859 -551 -1066 -697 183
762435A83P30q31k29J711R70j50o13M09J585J514p57p49K79n56J882K588j75j588
$$ 183 913 82 -147 1564 2534 2384 1771 2180 3765 5279 4522 3773 4052 3496 5378 7966 7791 6203
763534F203j208l77j590k011P10J284J82p63j726r7J597Q36j499k85K536O32L51
$$ 6203 4995 4618 3028 1017 1727 3011 3193 2430 704 607 2204 3040 1541 1256 3792 4424 4775
764571D775J96j330k014o4J233J192J00K28n31j810j112P88K755P02r03j983O03
$$ 4775 4971 3641 1627 1563 2796 3988 4088 4316 3785 1975 863 1651 4406 5108 4205 2222 2825
765609B825l21j577M47J24q01J348J089Q48L05J189o69o35K6j118p69K20j578
$$ 2825 2504 927 1374 1498 697 2045 3134 3982 4287 5476 4807 4172 4198 3080 2311 2531 953
766647I53L81j3l25n87k38J120J814K16r42j335k03L25J62J45j526q72K007Q03
$$ 953 1334 1321 996 409 171 1291 3105 3321 2379 1044 841 1166 1328 1473 -53 -925 1082 1885
767745A885P72P16l05n18J83M11l4J311J012n48j484k32J331N57J72j276j026
$$ 1885 2657 3373 3068 2550 2733 3144 3110 4421 5433 4885 3401 3169 4500 5057 5229 3953 2927
768783B927O2K85o76o37Q17J244k74N59N20m80R2N12j189j060o82o99m82Q3J044
$$ 2927 2989 3274 2598 1961 2778 4022 3748 4307 4827 4347 4439 4951 3762 2702 2020 1321 839 922 1966
769943A966M56L2L64J738J643p6Kj9j18J1j152j351j542L59j006j404n70M86J901
$$ 1966 2422 2454 2818 4556 6199 6123 6125 6106 5988 5999 4847 3496 1954 2313 1307 -97 -667 -181 1720
771102A720J783K05m89j664o14O31j578j862k70J063p98J75N27j205J52q12j633
$$ 1720 3503 3708 3219 1555 941 1572 -6 -1868 -2138 -1075 -1873 -1698 -1171 -2376 -2224 -3036 -4669
772140d669J114J423L99J77J273R13J64p79Q00J646j95l66N16p27l16Q51p53l52
$$ -4669 -3555 -2132 -1733 -1556 -283 630 794 15 815 2461 2266 1900 2416 1689 1373 2224 1471 1119
773239A119M50n06L68J590J360Q3j011k700k590J72K128J279j032k55M29M17q38
$$ 1119 1569 1063 1431 3021 4381 4464 3453 753 -1837 -1665 463 1742 710 455 884 1301 463
774277D63p07j27J767J883m94q12L61m89k263p04j77m86J596J39j8J634M13M78
$$ 463 -244 -371 1396 3279 2785 1973 2334 1845 -418 -1122 -1299 -1785 -189 -50 -68 1566 1979 2457
775375B457k43J71p49r95L07Q9O06L96O77k30j459q04MQ74J757R28l9N7J98j954
$$ 2457 2214 2385 1636 641 948 1037 1643 2039 2716 2486 1027 223 227 1101 2858 3786 3747 3804 4002 2048
776596B048k19J149J33K77M38q2l32o09J08L25P5j343r49j840l66K83J426P93
$$ 2048 1829 2978 3111 3388 3826 3744 3412 2803 2911 3236 3311 1968 1019 -821 -1187 -904 522 1315
777695A315J399O01k25p59j141j285j27l75r67J628J171l99n32r26M24n32j367
$$ 1315 2714 3315 3090 2331 1190 -95 -222 -597 -1564 64 1235 836 304 -622 -198 -730 -2097
778732b097J471J778k63q59m71M11M21O87R2j021k49J631J101J026J375l16O80
$$ -2097 -626 1152 889 30 -441 -30 391 1078 1170 149 -100 1531 2632 3658 5033 4717 5397
779770E397n6o76j314k137Q09N07l5p7J81N87p61j603r65j070j321J45M06N33
$$ 5397 5341 4665 3351 1214 2023 2530 2495 2418 2599 3186 2425 822 -143 -1213 -2534 -2389 -1983 -1450
780869a450l45L13J176J064j70j590o66J052P51M5R8J207K284Q44j200j295J755
$$ -1450 -1795 -1482 -306 758 588 -1002 -1668 -616 135 180 278 1485 3769 4613 3413 2118 3873
781907C873J690j29O7j22r63q76M65j447j836j351L88j11j850j02K707K219o81
$$ 3873 5563 5434 5501 5379 4416 3540 4005 2558 722 -629 -241 -352 -2202 -2304 403 2622 1941
782944A941k274j341l7J358Q38n84l30J755J017j020n56n10n86j13J006J78j030
$$ 1941 -333 -1674 -1711 -353 485 -99 -429 1326 2343 1323 767 257 -329 -442 564 742 -288
783982b88P81J316q48p35J14N31L83K78j186K3Q25J81j006P23p09k720j592J266
$$ -288 493 1809 961 226 340 871 1254 1532 346 369 1194 1375 369 1092 383 -2337 -3929 -2663
785081b663J415J400P62R15o3m26p9n23m78o61J569J432M85n80j168j885r10J074
$$ -2663 -1248 152 914 1829 1766 1340 1261 738 260 -401 1168 2600 3085 2505 1337 -548 -1458 -384
786179c84J131M24n75k43N52N83J25o80j056j30q9R63J919j04j451N05L59j355
$$ -384 747 1171 596 353 905 1488 1613 933 -123 -253 -342 621 2540 2436 985 1490 1849 494
787278D94j413N29M25l84J10O55l53J103M846J2158J1773N814j29l909m431l408
$$ 494 -919 -390 35 -349 -239 416 63 1166 6012 18170 29943 35757 35628 31719 27288 23880
788255B3880k879l520k439o88j76q08k119r93L03j14q04J40l52j384j454q17k3
$$ 23880 21001 17481 15042 14354 14178 13370 11251 10258 10561 10447 9643 9783 9431 8047 6593 5776 5753
789292E753J497J553l82j197j710k097n55J277J429n38l45P4N7K5l37j37l75j004
$$ 5753 7250 8803 8421 7224 5514 3417 2862 4139 5568 5030 4685 4759 4816 4841 4504 4367 3992 2988
790391B988r73n85R09L27P24M07j400q11O09J631P19R5J24J301j072j242P04q80
$$ 2988 2015 1430 2339 2666 3390 3797 2397 1586 2195 3826 4545 4640 4764 6065 4993 3751 4455 3575
791490C575l116j117p8P51L41j14Q93O18K7J018R05J097K008J333j120n26m59
$$ 3575 459 -658 -736 15 356 242 1135 1753 1780 2798 3703 4800 6808 8141 7021 6495 6036
792527F036J08J131q0K5m84p16j514m75j206n9L35J834M31q34j442j321j604q94
$$ 6036 6144 7275 7195 7220 6736 6020 4506 4031 2825 2766 3101 4935 5366 4532 3090 1769 165 -729
793626g29m55J695l18L12J71R73J101J060j81j962j244J224R69o18j43q64q24
$$ -729 -1184 511 193 505 676 1649 2750 3810 3629 1667 423 1647 2616 1998 1855 991 167
794664A67n60Q01J185J6J553J749o26j487j597j250K34K51M01R18k36k44o91n05
$$ 167 -393 408 1593 1609 3162 4911 4285 2798 1201 -49 185 436 837 1755 1519 1275 584 79
795762G9P4l22k62Q41R44j944j592K62k11Q54J992J599O76j090j826j017J350
$$ 79 153 -169 -431 410 1354 -590 -2182 -1920 -2131 -1277 715 2314 2990 1900 74 -943 407
796800D07K194J038L22O12J341N10j532o49m76q25j721p33O83R85O32J519K42
$$ 407 2601 3639 3961 4573 5914 6424 4892 4243 3767 2942 1221 488 1171 2156 2788 4307 4549
797838D549k053m68J227M31j940K43L72j133O99m29j405L43J229Q97j234j757
$$ 4549 2496 2028 3255 3686 1746 1989 2361 1228 1927 1498 93 436 1665 2562 1328 -429
798814d29M04L85K31O91j63L33K27r71l53Q15J509J531J207q59j413j567j055
$$ -429 -25 360 591 1282 1119 1452 1679 708 355 1170 2679 4210 5417 4558 3145 1578 523
799852E23q46j955n37Q21R81J005J136J115l71r56q13Q80R25M95P64N96j383j121
$$ 523 -323 -2278 -2815 -1994 -1013 -8 1128 2243 1872 916 103 983 1908 2403 3167 3763 2380 1259
800951A259Q17J056O25P00l93K03L39j478p55Q8J296L56n88J99M46l09j470j609
$$ 1259 2076 3132 3757 4457 4064 4267 4606 3128 2373 2461 3757 4113 3525 3724 4170 3861 2391 782
802049G82J357K104j69j54O28j91k35n05j336p05k21J78P91O3L1N16Q14O22j80
$$ 782 2139 4243 4074 3920 4548 4357 4122 3617 2281 1576 1355 1533 2324 2387 2418 2934 3748 4370 4190
803209D190j538M5o6q23q96Lj5L05O69J862J640R48J21o55j61r25k486j402j83
$$ 4190 2652 2697 2631 1808 912 915 900 1205 1874 3736 5376 6324 6445 5790 5629 4704 2218 816 633
804369F33j588q9M33L11Q71r4J696J838P66l27J401K052m71j282mJ902J002r75
$$ 633 -955 -1044 -611 -300 571 477 2173 4011 4777 4450 5851 7903 7432 6150 6146 8048 9050 8075
805468H075j258o81L35j698j526J98j123j236J74J120j22J4j31O17J051j112k34
$$ 8075 6817 6136 6471 4773 3247 3445 2322 1086 1260 2380 2258 2272 2141 2758 3809 2697 2463
806505B463R92K010j330l557n03Q07P73L03j132QJ90q87J542K341R16O54O11n39
$$ 2463 3455 5465 4135 578 75 882 1655 1958 826 834 1024 137 1679 4020 4936 5590 6201 5662
807604E662k600j389M14L37j461j170p72M96L42j8k29L23O19N87n07K53J929J34
$$ 5662 3062 1673 2087 2424 963 -207 -979 -483 -141 -159 -388 -65 554 1141 634 887 2816 2950
808703B950k82k78j310Q29J512J458J993j858k285j592N8J688Q90j872j266r4
$$ 2950 2668 2390 1080 1909 3421 4879 6872 5014 2729 1137 1195 2883 3773 1901 635 541
809679E41R55J75m82q46k5P81R99J52n67l9J088p0O21K22j837k435M48J706J080
$$ 541 1496 1671 1189 343 318 1099 2098 2250 1683 1644 2732 2662 3283 3505 1668 -767 -319 1387 2467
810839B467J599kQK2j311r99o81N17O69M50J75P50r52j147J229J024J409J077
$$ 2467 4066 4064 4072 4094 2783 1784 1103 1620 2289 2739 2914 3664 2712 1565 2794 3818 5227 6304
811938F304n88j350j05P27P9k89k488j658j085M46O18m46J907J844j35j726k87
$$ 6304 5716 4366 4261 4988 5067 4778 2290 632 -453 -7 611 165 2072 3916 3781 2055 1768
812975A768j61n06q90o93L13j035k32J952M90l08Q78J144J104K283O46Mn19M9
$$ 1768 1607 1101 211 -482 -169 -1204 -1436 516 1006 698 1576 2720 3824 6107 6753 6757 6238 6287
814074F287r79o11q01j262J537J804J99k28n24M18K35o43m07n39m65N25j99O3
$$ 6287 5308 4697 3896 2634 4171 5975 6174 5946 5422 5840 6075 5432 5025 4486 4021 4546 4347 4410
815173D410j021j005o25k92k16r33K4L5M87R50O08K81m78l87k08L14j545K46J540
$$ 4410 3389 2384 1759 1467 1251 318 342 377 864 1814 2422 2703 2225 1838 1630 1944 399 645 2185
816333B185P17p29j525K25O84o82l76J125N87k48m33j714P10J184r89j071m90
$$ 2185 2902 2173 648 873 1557 875 499 1624 2211 1963 1530 -184 526 1710 721 -350 -840
817370h40L54N7J27l76O04p16O6N63L02Q78j48r75L00L53O81N61L12j49M40j003
$$ -840 -486 -429 -302 -678 -74 -790 -724 -161 141 1019 871 -104 196 549 1230 1791 2103 1954 2394 1391
818591A391l52L98J133L71q28J421J386j449L07R40q74j202j230o95O15q51k461
$$ 1391 1039 1437 2570 2941 2113 3534 4920 3471 3778 4718 3844 2642 1412 717 1332 481 -1980
819629a980M00K046K505J174m60j079r7k8j183p54p65L83M68k54q68M11M88R42
$$ -1980 -1580 466 2971 4145 3685 2606 2509 2481 1298 544 -221 162 630 376 -492 -81 407 1349
820727A349J740J314o93n05M15K04j121k0P51q40k344k071M54J96J039Q95O39
$$ 1349 3089 4403 3710 3205 3620 3824 2703 2683 3434 2594 250 -1821 -1367 -1171 -132 763 1402
821765A402N65J53M40J170m5j240l64n9j399J06J497n69r59q02k1K19J96m93P22
$$ 1402 1967 2120 2560 3730 3685 2445 2081 2022 623 729 2226 1657 698 -104 -125 94 290 -203 519
822925E19R45r27k99n76m92J547J147m30l80l40n30p14J35k87N24J523M69m57
$$ 519 1464 537 238 -338 -830 717 1864 1434 1054 714 184 -530 -395 -682 -158 1365 1834 1377
824023A377o02O29J174J498qn02o89o08k50M47M8J018L81j77K03p57j309j075
$$ 1377 775 1404 2578 4076 4068 3566 2877 2269 2019 2466 2514 3532 3913 3736 3939 3182 1873 798
825122G98J198J98m23k81J24J429M06j053l25P13k68N99O51j45n79k060l12J75
$$ 798 1996 2194 1771 1490 1614 3043 3449 2396 2071 2784 2516 3115 3766 3621 3042 982 670 845
826221H45q52q52l29J106P91J535K98j399l0Q51lm64o67J683K730O14n81p3j710
$$ 845 -7 -859 -1188 -82 709 2244 2542 1143 1113 1964 1961 1497 830 2513 5243 5857 5276 5203 3493
827381C493m33m40K49O55k84r12j368L7J372k71j741j170K75O17J6J682K280R03
$$ 3493 3060 2620 2869 3524 3240 2328 960 997 2369 2098 357 -813 -538 79 95 1777 4057 4960
828479D960j124l142j155J280J827j273j495j74J034J720J006o15n73J096J33
$$ 4960 3836 694 -461 819 2646 1373 -122 -296 738 2458 3464 2849 2276 3372 3505
829395C505L10j25o12O86J986M87O29k07j530k295k283k79J035J93Q42J185J562
$$ 3505 3815 3690 3078 3764 5750 6237 6866 6659 5129 2834 551 272 1307 1500 2342 3527 5089
830432E089r74j351k09j84j756l58k4R77J040J396J764q10j524j284ok87q79M08
$$ 5089 4115 2764 2555 2371 615 257 233 1210 2250 3646 5410 4600 3076 1792 1786 1499 620 1028
831531A028O57Q01J005n88q97Q81J662K283l66m28J86P04j322k251j15M06k90
$$ 1028 1685 2486 3491 2903 2006 2887 4549 6832 6466 6038 6224 6928 5606 3355 3240 3646 3356
832569C356j450r42Q24r29j016J04N41J88K06J05j20O68M82j98J414O74r17j163
$$ 3356 1906 964 1788 859 -157 -53 488 676 882 987 867 1535 2017 1819 3233 3907 2990 1827
833667A827r93Q76J074q19L95%j389k095k31N35J130K075J137Q57j4j964r97J134
$$ 1827 834 1710 2784 1965 2360 2360 971 -1124 -1355 -820 310 2385 3522 4379 4365 2401 1404 2538
834766B538L81n00j414m06j17J288J503j010l089m3K405ML14J31n32j93J830Q82
$$ 2538 2919 2419 1005 599 482 1770 3273 2263 -826 -869 1536 1540 1854 1985 1453 1260 3090 3972
835865C972j694q95R62J419k19J002j414j243n38r27n53L4O56J66J057P57m34
$$ 3972 2278 1383 2345 3764 3545 4547 3133 1890 1352 425 -128 -94 562 728 1785 2542 2108
836903B108k70L59O37K089K258J62q10j237k148r71K06j052n58l74J035J600n2
$$ 2108 1838 2197 2834 4923 7181 7343 6533 5296 3148 2177 2383 1331 773 399 1434 3034 2982
837940B982k145l055R4J732J938P26o40n07N28J287R81K84k43o94n34K08j388
$$ 2982 837 -2218 -2124 -392 1546 2272 1632 1125 1653 2940 3921 4205 3962 3268 2734 2942 1554
838978A554m13J022P66r2k047q37J778K400j01J44K93l15J636N04O12l33j069
$$ 1554 1141 2163 2929 2837 790 -47 1731 4131 4030 4174 4467 4152 5788 6292 6904 6571 5502
840015E502k912n52N78m8J64N05j311k648O72J560J7K60o94o62J290M57J262J658
$$ 5502 2590 2038 2616 2568 2732 3237 1926 -722 -50 1510 1527 1787 1093 431 1721 2178 3440 5098
841114E098L98k704r56J299P97j42L96l94k036j310o63n61N5k2P65P23J059K1
$$ 5098 5496 2792 1836 3135 3932 3790 4186 3792 1756 446 -217 -778 -723 -745 20 743 1802 1823
842213A823l65N9L47Q13lO4J0L6l56k480j043K252J870l8M8O68o42j404J95L02
$$ 1823 1458 1517 1864 2677 2674 2738 2748 2784 2428 -52 -1095 1157 3027 2989 3037 3705 3063 1659 1854 2156
843434B156L66J080K59n21k017J02J299j232k04k04K54m17j42J764K94p37l34
$$ 2156 2522 3602 3861 3340 1323 1425 2724 1492 1288 1084 1338 921 779 2543 2837 2100 1766
844471A766M52N5j532n61K79M49P45j277q02m08J428Q84j277J13J021l50j032
$$ 1766 2218 2273 741 180 459 908 1653 376 -426 -834 594 1478 201 314 1335 985 -47
845509d7R32K368R03J247N27o54j153J618M57j213j593j309p78j109M66J728N36
$$ -47 885 3253 4156 5403 5930 5276 4123 5741 6198 4985 3392 2083 1305 196 662 2390 2926
846547B926K95J60j156j237q97n81k99n93J066R94k5K68J401j118N95J961J830
$$ 2926 3221 3381 2225 988 91 -490 -789 -1382 -316 678 653 921 2322 1204 1799 3760 5590
847584E590p9L13l49m29j401j879j237k163q20K016J416Q81J156N46o89o76P29
$$ 5590 5511 5824 5475 5046 3645 1766 529 -1634 -2454 -438 978 1859 3015 3561 2872 2196 2925
848622B925R28l31n13q23J52l01o71J503R51N01L03j874k912j307j268r25L46
$$ 2925 3853 3522 3009 2186 2338 2037 1366 2869 3820 4321 4624 2750 -162 -1469 -2737 -3662 -3316
849660c316N05J478J107J156J174J434M15j732j859k06R77o84r05L6O88R07P29
$$ -3316 -2811 -1333 -226 930 2104 3538 3953 2221 362 156 1133 449 -456 -420 268 1175 1904
850697A904M91k24J134o83j073R88L94K76j328j86J328J438j144p62J136k16j17
$$ 1904 2395 2171 3305 2622 1549 2537 2931 3207 1879 1693 3021 4459 3315 2553 3689 3473 3356
851735C356q79p02K77J143J588q12q08j260j169L25K59J38J111L30qp74p77m79
$$ 3356 2477 1775 2052 3195 4783 3971 3163 1903 734 1059 1318 1456 2567 2897 2889 2115 1338 859
852834H59J231R84O31r41j668p77k03O77P28N45N21l81p02l10j152p95J460K66
$$ 859 2090 3074 3705 2764 1096 319 116 793 1521 2066 2587 2206 1504 1194 42 -753 707 973
853933I73r00J070Q98J056L83J64o94n69j71M23M91L06N90K57Q21j422k172n17
$$ 973 73 1143 2041 3097 3480 3644 2950 2381 2210 2633 3124 3430 4020 4277 5098 3676 1504 987
855031I87O91L2j433M80K573R40N6O1j137j955M17L32q77o88L7P64L08P18K660
$$ 987 1678 1710 277 757 3330 4270 4326 4387 3250 1295 1712 2044 1167 479 516 1280 1588 2306 4966
856191D966Q36o91N50M14j778j503N27L570J48j286J062R29j020j309n44j332
$$ 4966 5802 5111 5661 6075 4297 2794 3321 6891 7039 5753 6815 7744 6724 5415 4871 3539
857167C539j928j431J802K198L11R25M28q12k03O86j719j985R48n56k753M9J554
$$ 3539 1611 180 1982 4180 4491 5416 5844 5032 4829 5515 3796 1811 2759 2203 -550 -501 1053
858205A053O27k10p73n53l52L82J127R77K86n1P08l8M45r73J21n2M30M11p76q19
$$ 1053 1680 1470 697 144 -208 174 1301 2278 2564 2513 3221 3183 3628 2655 2776 2724 3154 3565 2789 1970
859426A970R27J075m95k95n40J271Q4m92M74L99j532l91J968Q34k005k695j016
$$ 1970 2897 3972 3477 3182 2642 3913 3997 3505 3979 4378 2846 2455 4423 5257 3252 557 -459
860464d59K507K465j53o51k07L98j26j239j512l65K5Q06L55l41j711k673m25K649
$$ -459 2048 4513 4360 3709 3502 3900 3774 2535 1023 658 683 1489 1844 1503 -208 -2881 -3306 -657
861562f57L276K032K09j604q16j81p56J08k70Q43J835J042j063j049p57k121p98
$$ -657 2619 4651 4860 3256 2440 2259 1503 1611 1341 2184 4019 5061 3998 2949 2192 71 -727
862600g27o41r84J416K753J194J383N47l7k405p22O74J454J532n28j337j710p66
$$ -727 -1368 -2352 -936 1817 3011 4394 4941 4904 2499 1777 2451 3905 5437 4909 3572 1862 1096
863638A096K283J258K41M0j814k008J669J105q02j141J063M89O64m90l156m51
$$ 1096 3379 4637 4878 4918 3104 1096 2765 3870 3068 1927 2990 3479 4143 3653 497 46
864614D6P08R0K66r76n35j53M47j319k435j336N09J296Q23N26l25L1J648J445
$$ 46 754 844 1110 134 -401 -554 -107 -1426 -3861 -5197 -4688 -3392 -2569 -2043 -2368 -2337 -689 756
865713G56k91p6L59P75o30q93M60J29O30P40j220O51J987L0k019r05Q43O54J062
$$ 756 465 389 748 1523 893 0 460 589 1219 1959 739 1390 3377 3407 1388 483 1326 1980 3042
866873C042Q17J87m54j887k023r20R1J03N28O88M00p39K12n03j601j871Q66K694
$$ 3042 3859 4046 3592 1705 -318 -1238 -1147 -1044 -516 172 572 -167 45 -458 -2059 -3930 -3064 -370
867971c70K870J099j342J27R47O85K92j554o36r2k75p10p69P69J757J433n10j515
$$ -370 2500 3599 2257 2384 3331 4016 4308 2754 2118 2026 1751 1041 272 1041 2798 4231 3721 2206
869070B206j077j452P13O90N46J359J76o16r76K31J161L03j358j984K57J966L12
$$ 2206 1129 -323 390 1080 1626 2985 3161 2545 1569 1800 2961 3264 1906 -78 179 2145 2457
870108B457j600j930K44R1J373J182O57N26J1Jr9q3J592P41j315m48M88p25j104
$$ 2457 857 -1073 -829 -738 635 1817 2474 3000 3011 3012 2913 2830 4422 5163 3848 3400 3888 3163 2059
871267B059P60J243J63l89j608m30L40m3p1r52j051M58J56o9K17k50R06K380O90
$$ 2059 2819 4062 4225 3836 2228 1798 2138 2095 2024 1072 21 479 635 566 783 533 1439 3819 4509
872427D509k003j543l63j53P81M6M93N36k76q49o81J52J530J121N81m42q47k24
$$ 4509 2506 963 600 447 1228 1274 1767 2303 2027 1178 497 649 2179 3300 3881 3439 2592 2368
873526B368K21N22m83P43K86J3k61J130k94l344j130P68J505k06M83J149P47j4
$$ 2368 2589 3111 2628 3371 3657 3670 3409 4539 4245 901 -229 539 2044 1838 2321 3470 4217 4203
874625D203P2m06n36l81k51K93r07j41n20k235P65J093J089L1J414Q86k217j156
$$ 4203 4275 3869 3333 2952 2701 2994 2087 1946 1426 -809 -44 1049 2138 2169 3583 4469 2252 1096
875723A096J524Q09j68Q99K35m19o43j845j006J146r47p59o43j446l44k28Q86
$$ 1096 2620 3429 3261 4160 4395 3976 3333 1488 482 1628 681 -78 -721 -2167 -2511 -2739 -1853
876761a853J846J080qj85k59j205J14J123O58l26L02K79L12m19M19P97j10N75
$$ -1853 -7 1073 1065 880 621 -584 -470 653 1311 985 1287 1566 1878 1459 1878 2675 2565 3140
877859C140J94n80j60N16N50j606J322M27j12J103L69j224o11o93r07J1o35k642
$$ 3140 3334 2754 2594 3110 3660 2054 3376 3803 3691 4794 5163 3939 3328 2635 1728 1739 1104 -1538
878958a538k85Q08l38m6P78J783M73k19P09K7j015o04J342J049j001p91p4K96
$$ -1538 -1823 -1015 -1353 -1399 -621 1162 1635 1416 2125 2152 1137 533 1875 2924 1923 1132 1058 1354
880057A354o38k163r16N96J535K480J010j585j184p59M64J938J438K54P01Q32
$$ 1354 716 -1447 -2363 -1767 -232 2248 3258 1673 489 -270 194 2132 3570 3824 4525 5357
881034E357J60j676m00j06j196j73Q50K526N28j639k916k233P96J950J830K13
$$ 5357 5517 3841 3441 3335 2139 1966 2816 5342 5870 4231 1315 -918 -122 1828 3658 3871
882010C871k016q71P80J115J319O09j443m79K18j891o63R06q98m83J397L93j013
$$ 3871 1855 984 1764 2879 4198 4807 3364 2885 3103 1212 549 1455 557 74 1471 1864 851
883048H51j47J32J411k49l44K11m57Q19K0l13j36j51r78L79J199N90M00K58K19
$$ 851 704 836 2247 1998 1654 1865 1408 2227 2247 1934 1798 1647 669 1048 2247 2837 3237 3495 3714
884208C714p33q06j209q08J24J317L7k37k05k5K88or32j012M65J213L91p07j082
$$ 3714 2981 2175 966 158 282 1599 1636 1399 1194 1169 1457 1451 519 -493 -28 1185 1576 869 -213
885367b13j225j34J196m7M49J434J450q31r91J603J116l50j47l03k52j271j94
$$ -213 -1438 -1572 -376 -423 26 1460 2910 2079 1088 2691 3807 3457 3310 3007 2755 1484 1290
886405A290l70M7j222q11j01N46M22P96n5j016j17K492O57M9r73Q92o22j393L10
$$ 1290 920 967 -255 -1066 -1167 -621 -199 597 542 -474 -591 1901 2558 2607 1634 2526 1904 511 821
887565H21l56N85K00N89j54m55o82p36Q50K468J102j978j381q69K28J111J605
$$ 821 465 1050 1250 1839 1685 1230 548 -188 662 3130 4232 2254 873 4 232 1343 2948
888602B948N55r4p56m58J239J223M09j652n71J593J125n91l82j761o77J76O23
$$ 2948 3503 3409 2653 2195 3434 4657 5066 3414 2843 4436 5561 4970 4588 2827 2150 2326 2949
889640B949J977K423r53k813n50J168M98R52L93K71k25k000k239m61R24J53P5
$$ 2949 4926 7349 6396 3583 3033 4201 4699 5651 6044 6315 6090 4090 1851 1390 2314 2467 2542
890678B542Q03j2j647j511q87j711p01J159J566J553l63R39P08J031m7m99K80
$$ 2542 3345 3333 1686 175 -712 -2423 -3124 -1965 -399 1154 791 1730 2438 3469 3422 2923 3203
891716C203o20n37M39L47K42L68j418n98M84K13q66R62J098P98J320n46j574j016
$$ 3203 2583 2046 2485 2832 3074 3442 2024 1426 1910 2123 1257 2219 3317 4115 5435 4889 3315 2299
892814B299m77n02l54K45J676J707J00k047j018j21r82o65R03J311o12l16M52
$$ 2299 1822 1320 966 1211 2887 4594 4694 2647 1629 1508 526 -139 764 2075 1463 1147 1599
893852A599J255M00j110m91j082r38j160K14J099O90J908O27q57o3J9q6j343k58
$$ 1599 2854 3254 2144 1653 571 -367 -1527 -1313 -214 476 2384 3011 2154 2091 2110 2024 681 423
894950D23Q68m18K27Q88o03p58r90J23P33j161q11j060M86J886M65j020o70J173
$$ 423 1291 873 1100 1988 1385 627 -363 -240 493 -668 -1479 -2539 -2053 -167 298 -722 -1392 -219
896049b19r0n83M93J809P12J852q5j727j814j092J038J384J669J496J191K72j881
$$ -219 -309 -892 -399 1410 2122 3974 3889 2162 348 -744 294 1678 3347 4843 6034 6306 4425
897087D425k099K81Q98j725j889N84R99K57p78j123o56R66J629l88R6K03m7O23
$$ 4425 2326 2607 3505 1780 -109 475 1474 1731 953 -170 -826 140 1769 1381 1477 1680 1633 2256
898186B256P59k4j34o95k6J150J161k22M82r38j377m49o52j021Q67L98J53Q39
$$ 2256 3015 2991 2857 2162 2136 3286 4447 4225 4707 3769 2392 1943 1291 270 1137 1535 1688 2527
899284B527J807J308N71j010l56j383N72J699j361o03K66p67J9o50p91J154J451
$$ 2527 4334 5642 6213 5203 4847 3464 4036 5735 4374 3771 4037 3270 3289 2639 1848 3002 4453
900322D453K87K30J652N49l17j392r0n63k221m80j025j485n80J474J940N66j221
$$ 4453 4740 4970 6622 7171 6854 5462 5372 4809 2588 2108 1083 -402 -982 492 2432 2998 1777
901360A777o93N30L47o90j25k55m82K279J586J118J229r65k992r28L73j584j520
$$ 1777 1084 1614 1961 1271 1146 891 409 2688 4274 5392 6621 5656 2664 1736 2109 525 -995
902397i95Q51M72N59Q30k52N85K29N78j10p78L88k9m2M98J138L23Q99o77j682
$$ -995 -144 328 887 1717 1465 2050 2279 2857 2747 1969 2357 2328 2286 2784 3922 4245 5144 4467 2785
903557B785k54K23o79j588p83J742J439l91j37P18N72J054J230o13J25l55k177
$$ 2785 2531 2754 2075 487 -296 1446 2885 2494 2357 3075 3647 4701 5931 5318 5443 5088 2911
904595B911k566j183N54J691K040P24j232l48j381r63R99J386Q66K185J641j163
$$ 2911 345 -838 -284 1407 3447 4171 2939 2591 1210 247 1246 2632 3498 5683 7324 6161
905571F161j864o87N56q79l14J395J66j88l57qJ080p6j235l04j8Q62j053j158
$$ 6161 4297 3610 4166 3287 2973 4368 4534 4346 3989 3981 5061 4985 3750 3446 3428 4290 3237 2079
906670B079m53M53O99l82M73N70r36j111J55J085N25J14K00J51O24r31j491J425
$$ 2079 1626 2079 2778 2396 2869 3439 2503 1392 1547 2632 3157 3271 3471 3622 4246 3315 1824 3249
907769C249J887r6o97l49j441k056p57j64J02L80P72J298J228o53r6L18M34J261
$$ 3249 5136 5040 4343 3994 2553 497 -260 -424 -322 58 830 2128 3356 2703 2607 2925 3359 4620
908867D620K016O96k03r0j085k453j243J15k62M87J162M13r1M63j737r65j625
$$ 4620 6636 7332 7129 7039 5954 3501 2258 2373 2111 2598 3760 4173 4082 4545 2808 1843 218
909905B18m13j14P39n08k9J87n71J372J38j790n96K213M09m26N91n15K49m93o34
$$ 218 -195 -309 430 -78 -107 80 -491 881 1019 -771 -1367 846 1255 829 1420 905 1154 661 27
911065B7R28M96l28r28o96R65K021J311J096k9j047m21K55M70N61K80m98j729
$$ 27 955 1451 1123 195 -501 464 2485 3796 4892 4863 3816 3395 3650 4120 4681 4961 4463 2734
912163B734j439q84j197j296j232K283K631K84O84O01O96p8l15o48j126j486p59
$$ 2734 1295 411 -786 -2082 -3314 -1031 1600 1884 2568 3169 3865 3787 3472 2824 1698 212 -547
913201e47J339q16o16P16P67J231j42j65m83J87J55l11L34J792J071j613j597
$$ -547 792 -24 -640 76 843 2074 1932 1767 1284 1471 1626 1315 1649 3441 4512 2899 1302
914239A302k89r07J92J017J246N75K47l29J25L25j400J8P55k38M47p96j096L99
$$ 1302 1013 106 298 1315 2561 3136 3383 3054 3179 3504 2104 2122 2877 2639 3086 2290 1194 1593
915337A593J442o6j341k21j15J827R91m28j477q05N56n89m6J136J955L16K39J876
$$ 1593 3035 2969 1628 1407 1292 3119 4110 3682 2205 1400 1956 1367 1321 2457 4412 4728 4967 6843
916436F843J621j904k740k254n64l37p55q3J371J570J643o38j558m1m69q24L90
$$ 6843 8464 6560 3820 1566 1002 665 -90 -173 1198 2768 4411 3773 2215 2174 1705 881 1271
917474A271Q67L15j3j478j107o77q09l23J539J225O64J642n16k376j250Q29K971
$$ 1271 2138 2453 2440 962 -145 -822 -1631 -1954 -415 810 1474 3116 2600 224 -1026 -197 2774
918512B774J665J10k063j311Q64J505p30J14J105l0J2n63J066o29j764j076K83
$$ 2774 4439 4549 2486 1175 2039 3544 2814 2928 4033 4003 4015 3452 4518 3889 2125 1049 1332
919549A332J824J310r69O9K51j796k549J70J423J352p6k226k311q86K526L121
$$ 1332 3156 4466 3497 3566 3817 2021 -528 -358 1065 2417 2341 115 -2196 -3082 -556 2565
920526B565L3J094N67p09O45P85M61q24r02l40O28N0p51j123q18J54l03M70P3
$$ 2565 2598 3692 4259 3550 4195 4980 5441 4617 3715 3375 4003 4053 3302 2179 1361 1515 1212 1682 1755
921685A755J96O10r97J36L61J560J327K6N26R20q45o64q46l28j01Q20j293k136
$$ 1755 1951 2561 1564 1700 2061 3621 4948 4974 5500 6420 5575 4911 4065 3737 3636 4456 3163 1027
922784A027o20R83l65L53Q10M73k16j52M12k84j090m89R23k65J4Q48r85j014L7
$$ 1027 407 1390 1025 1378 2188 2661 2445 2293 2705 2421 1331 842 1765 1500 1514 2362 1377 363 400
923944D00J79j82m93k06J854Q60mj037j268j491M78J733J600J286R34J231J189
$$ 400 579 397 -96 -302 1552 2412 2408 1371 103 -1388 -910 823 2423 3709 4643 5874 7063
924982G063K7j519j949j639N42J50r89n64q59k39R92J227J90j095j654m57M85
$$ 7063 7090 5571 3622 1983 2525 2675 1686 1122 263 24 1016 2243 2433 1338 -316 -773 -288
926019b88k92p0L93J145K020M86J269J466M66J583J366j520p57j985k955j632
$$ -288 -580 -650 -257 888 2908 3394 4663 6129 6595 8178 9544 8024 7267 5282 2327 695
926996F95J219J859n65l44J068L6j401j464m99m75Q24K43j958j286O17j18K11
$$ 695 1914 3773 3208 2864 3932 3968 2567 1103 604 129 953 1196 -762 -2048 -1431 -1549 -1338
928034a338J181J964N58m90j049M55J909m29K64J97j01n28j058p23J15K61L10
$$ -1338 -157 1807 2365 1875 826 1281 3190 2761 3025 3222 3121 2593 1535 812 927 1188 1498
929071A498L79K57Q70Q35Q02j060r50j780j047J690O12L10j090r67N37l73J025
$$ 1498 1877 2134 3004 3839 4641 3581 2631 851 -196 1494 2106 2416 1326 359 896 523 1548
930109A548J245L55k57P07J139l15r87p64j92r5j73p20r35Po64O0n9r70N09M90
$$ 1548 2793 3148 2891 3598 4737 4422 3435 2671 2479 2384 2211 1491 556 563 -101 -41 -100 -1070 -561 -71
931330g1K87J071n20j639j222r69k18J725K168J265R22j392p55J188
$$ -71 216 1287 767 -872 -2094 -3063 -3281 -1556 612 1877 2799 1407 652 1840
##END=
