##TITLE= Pinacolone C-13
##JCAMP-DX= 5.00 $$From Command Line Converter 1.0
##DATA TYPE= NMR Spectrum
##DATA CLASS=  XYDATA

##ORIGIN= Exported from Command Line Converter 1.0
##OWNER= SVB
##$URL= http://wwwchem.uwimona.edu.jm:1104/software/jcampdx.html
##SPECTROMETER/DATA SYSTEM= NUTS EXPORT
##.OBSERVE FREQUENCY= 75.480980
##.OBSERVE NUCLEUS= ^1H
##INSTRUMENTAL PARAMETERS= 1H
##XUNITS= PPM
##YUNITS= ARBITRARY UNITS
##XFACTOR= 0.0002649675
##YFACTOR= 32.5697510000
##FIRSTX= -17.968720
##FIRSTY= 30061.000000
##LASTX= 246.998700
##NPOINTS= 16384
##MAXY= 32302456.000000
##MINY= -267295.000000
##DELTAX=   0.016173
##XYDATA= (X++(Y..Y))
$$ plain form
-67815 922 -1003 395 361 -2121 -1871 254 943 507 -1299 -873 -540 -9 1462 1862 1008 -35 1902
-66778 1902 2767 1879 1400 425 -1468 -2959 -542 2195 2497 1075 2550 440 -235 1374 -1386 -2669
-65801 -2669 -2657 -1050 -1176 -1675 -1627 -300 -230 -106 837 757 -1849 -3317 -1957 -915 2008 2191 2033 639
-64702 639 19 2049 1674 867 2409 485 46 -2664 -689 -264 16 2251 401 -2198 -2375 -2466 -1453
-63665 -1453 -2897 -2848 -923 1661 3038 4148 3134 1612 1533 638 898 1325 -516 -223 358 -500 1149
-62627 1149 2401 2070 2808 3694 2639 2500 1431 -98 -907 -128 1779 2180 4353 3189 -463 -376 782
-61590 782 2008 2218 2834 2564 4645 4115 1660 1226 1884 1941 1542 645 -11 43 -144 -1988 -272 -243 -2999
-60430 -2999 -3096 -1766 -1822 514 1167 -445 -1222 -3423 -3334 -3103 -3635 -1782 -2945 -2070 835 868 -242 -1172
$$ packed form
-67815I22j925J398l4k482K50K125O89m36j806M26L33N31J471M00q54j043J937
-66778A902Q65q88m79r75j893j491K417K737L02j422J475k110o75J609k760j283
-65801b669J2J607j26m99M8J327P0J24R43q0k606j468J360J042K923J83j58j394
-64702F39o20K030l75q07J542j924m39k710J975M25K80K235j850k599j77r1J013
-63665a453j444M9J925K584J377J110j014j522p9q95K60M27j841K93N81q58J649
-62627A149J252l31P38Q86j055j39j069j529q09P79J907M01K173j164l652Q7J158
-61590G82J226K10O16k70K081n30k455m34O58N7l99q97o56N4j87j844J716K9k756
-60430b999r7J330n6K336O53j612p77k201Q9K31n32J853j163Q75K905L3j110r30
$$ plain form
-59331 -1172 -2579 229 2151 -2058 -3385 -3335 -2209 -2000 -78 -1881 -1913 867 2532 2134 1490 -38
-58354 -38 -2653 -2076 -2691 -3029 -3838 -2455 -1025 37 -1405 -762 -1112 -1946 -14 -1691 -2071 248 -1678
-57317 -1678 -985 -696 -1578 -1262 264 1510 1621 -1020 -2056 -420 -1848 -3117 -3809 -3188 -4329 -3939
-56340 -3939 -2323 37 1093 1185 2812 3845 2538 -2032 -3712 -3425 -2015 -2806 -2686 -209 1478 -11
-55364 -11 -165 -1872 -3327 170 943 -469 -1326 -350 1895 1500 990 -471 -1608 -2510 -3463 -1700 -2862
-54326 -2862 -4235 -3688 -2699 -2618 -733 -763 -2489 -290 1189 985 707 629 -182 2148 -95 -1098 -1218
-53288 -1218 -2837 -2739 -1716 -1130 -2821 -2802 -2634 -2718 -649 -1637 -2319 -1783 148 967 -1804 -2907 -2393 -3680
-52189 -3680 -3637 -711 1599 1110 644 -310 -697 613 1963 3251 1383 3043 1546 1034 1504 2965
$$ packed form
-59331a172j407K808J922m209j327N0J126K09J922j803l2K780J665l98o44j528
-58354c8k615N77o15l38q09J383J430J062j442O43l50q34J932j677l80K319j926
-57317a678O93K89q82L16J526J246J11k641j036J636j428j269o92O21j141L90
-56340c939J616K360J056R2J627J033j307m570j680K87J410p91J20K477J687j489
-55364a1j54j707j455L497P73j412q57R76K245l95n10j461j137r02r53J763j162
-54326b862j373N47R89Q1J885l0j726K199J479k04k78p8q11K330k243j003j20
-53288a218j619R8J023N86j691J9J68q4K069r88o82N36J931Q19k771j103N14j287
-52189c680M3K926K310m89m66r54l87J310J350J288j868J660j497n12M70J461
$$ plain form
-51213 2965 810 -997 870 1117 2693 4863 4196 616 235 757 1334 1193 686 2727 2035 1787 -778
-50175 -778 -3582 -1728 992 78 -759 -652 3020 2276 -1317 -1910 -1759 1825 -286 -2381 -5201 -4004
-49199 -4004 -530 -755 -1616 -2501 -137 2079 3685 3557 2273 314 -1286 -2942 -2437 -132 -891 40
-48222 40 -531 -2030 -228 -2351 -3879 -3399 -2227 25 -19 -1180 -2985 -3412 -3005 -2671 -410 3109 4349
-47184 4349 3895 2362 1313 1319 1826 1986 100 -814 443 -156 -273 -1131 -2256 -3134 -2571 -459 -1275 -4567
-46086 -4567 -3607 -1098 -595 -851 -1576 -1717 49 1461 -171 803 577 -826 -670 1335 3734 3751 2180
-45048 2180 525 -178 1219 1406 -594 702 592 -152 1568 1369 -1674 -5097 -4035 -3525 -2365 -1168
-44071 -1168 -2143 -3698 -1576 1689 263 -1342 -227 2499 2582 791 1089 242 -615 -1393 -979 30
$$ packed form
-51213B965k155j807J867K47J576K170o67l580l81N22N77j41n07K041o92k48k565
-50175g78k804J854K720r14q37J07L672p44l593n93J51L584k111k095k820J197
-49199d004L474k25q61q85K364K216J606j28j284j959j600j656N05K305p59R31
-48222D0n71j499J802k123j528M80J172K252m4j161j805m27M07L34K261L519J240
-47184D349m54j533j049ON07J60j886r14J257n99j17q58j125q78N63K112q16l292
-46086d567R60K509N03k56p25j41J766J412j632R74k26j403J56K005K399J7j571
-45048B180j655p03J397J87k000J296j10p44J720j99l043l423J062N10J160J197
-44071a168r75j555K122L265j426j605J115K726Q3j791K98q47q57p78M14J009
$$ plain form
-43095 30 -1303 -1327 -659 -431 109 -44 735 590 -1625 -3156 -2607 -2355 -1219 -1611 -194 -124 1180 2500
-41996 2500 2173 1912 721 -197 -954 243 1030 -266 576 1735 288 -997 -1339 -436 2438 1375
-41019 1375 1262 804 1531 781 -1096 -1461 -544 -314 -2769 -1540 -2518 -3781 -4415 -1158 -479 -995 -2291
-39982 -2291 -2125 98 -715 -5632 -3211 -1510 -1778 -4026 -3109 919 744 -664 -733 -1419 -3250 -2405 885
-38944 885 725 -1681 -2875 -3434 -4122 -4551 -1567 1892 1570 -897 437 2097 3092 1434 59 1645
-37967 1645 1473 -1195 -1809 -172 3881 3119 747 -1168 -1543 -1389 -286 680 -718 -122 -1815 -1501
-36991 -1501 -181 -1055 -424 1978 500 927 1671 1523 -1325 -3746 -4641 -4697 -1783 -1673 -1351 219 2098
-35953 2098 1218 -108 -1165 -3492 -4413 -4516 -2746 -622 1623 1217 260 435 -463 -2124 -1269 383
$$ packed form
-43095C0j333k4O68K28N40j53P79j45k215j531N49K52J136l92J417P0J304J320
-41996B500l27k61j191r18p57J197P87j296Q42J159j447j285l42R03K874j063
-41019A375j13m58P27p50j877l65R17K30k455J229r78j263o34L257O79n16j296
-39982b291J66K223q13m917K421J701k68k248R17M028j75j408o9o86j831Q45L290
-38944H85j60k406j194n59o88m29K984L459l22k467J334J660R95j658j375J586
-37967A645j72k668o14J637M053p62k372j915l75J54J103R66j398N96j693L14
-36991a501J320q74O31K402j478M27P44j48k848k421q95n6K914J10L22J570J879
-35953B098q80j326j057k327r21j03J770K124K245m06r57J75q98j661Q55J652
$$ plain form
-34976 383 1684 1477 -968 -483 -755 -1966 -475 -122 162 -354 883 145 775 -475 -1479 -21 -1773
-33939 -1773 -1890 -910 -1720 -2111 -717 -530 -959 -4117 -2669 -2482 -1609 -157 -289 -790 -1665 -1204 1012
-32901 1012 30 -2365 -4399 -390 1458 -1775 -3810 -1708 781 -512 -1932 -2283 -2792 -1871 -2107 -2569
-31924 -2569 -1735 -1322 745 1353 -1048 -3584 -2870 -1138 -2371 -2278 -2871 -1909 -1734 -2271 -1883 1799 -558
-30887 -558 -924 -1593 -2195 -2082 -1165 -1000 152 1917 -180 -3218 -2036 -148 -928 -1680 -3683 -4892 -4364
-29849 -4364 -4398 -2912 -3692 -3807 -1383 -1998 -1656 204 1764 906 677 697 -896 -911 1393 2146 -335 -1770
-28751 -1770 -3690 -3102 -4023 -2433 -2789 -2808 -1719 -1616 -1583 -2129 -2406 -2157 -2901 -2776 -1789 -1954 758 1192
-27652 1192 1894 909 1940 2907 3712 -134 -810 -3788 -3144 -706 668 -193 933 2453 3277 2917 3201
$$ packed form
-34976C83J301k07k445M85k72j211J491L53K84n16J237p38O30j250j004J458j752
-33939a773j17R80q10l91J394J87m29l158J448J87Q73J452j32n01q75M61K216
-32901A012r82k395k034M009J848l233k035K102K489j293j420l51n09R21k36m62
-31924b569Q34M13K067O08k401k536P14J732j233R3n93R62J75n37L88L682k357
-30887e58l66o69o02J13R17J65J152J765k097l038J182J888p80p52k003j209N28
-29849d364l4J486p80j15K424o15L42J860J560q58k29K0j593j5K304P53k481j435
-28751a770j920N88r21J590l56j9J089J03L3n46k77K49p44J25R87j65K712M34
-27652A192P02r85J031R67Q05l846o76k978O44K438J374q61J126J520Q24l60K84
$$ plain form
-26614 3201 1331 -665 -3617 -4647 -503 733 41 -1593 -1263 1189 559 -702 -3864 -3000 -1206
-25698 -1206 -90 -1280 -2753 -1399 -546 323 2497 2496 1925 -1852 -178 -354 -3971 -4088 -1816 -1387 429
-24661 429 3099 1666 -247 152 735 -587 686 587 -1265 -2405 -3048 -4216 -3051 -1797 -340 346
-23684 346 815 2810 1008 -2228 -2544 -2426 -826 -30 715 466 1588 1779 2003 1285 -391 -780 -2278
-22647 -2278 -4089 -2155 -280 -230 -1877 -966 -639 622 524 -2403 -3767 -2779 -812 904 -517 -999
-21670 -999 -4326 -5110 -2042 1293 1553 794 -1164 -660 931 156 -362 163 456 705 1331 440 -762
-20632 -762 659 238 -107 494 992 38 354 2736 2126 1913 682 -1693 -2386 64 2757 2707 1252
-19595 1252 -685 675 1660 1586 144 396 -2518 -4149 -4005 -1684 -887 26 1083 2890 4291 2928
$$ packed form
-26614C201j870j996k952j030M144J236o92j634L30K452o30j261l162Q64J794
-25698a206J116j190j473J354Q53Q69K174jn71l777J674j76l617j17K272M29J816
-24661D29K670j433j913L99N83j322J273r9j852j140o43j168J165J254J457O86
-23684C46M69J995j802l236l16J18J600P96P45k49J122J91K24p18j676l89j498
-22647b278j811J934J875N0j647R11L27J261r8k927j364R88J967J716j421m82
-21670i99l327p84L068L335K60p59j958N04J591p75n18N25K93K49O26q91j202
-20632g62J421m21l45O01M98r54L16K382o10k13j231k375o93K450K693n0j455
-19595A252j937J360R85p4j442K52k914j631J44K321P97R13J057J807J401j363
$$ plain form
-18618 2928 1434 1128 -1682 727 -35 -1329 -1184 -1323 -1950 -178 60 -392 -1019 2147 3547 1802
-17642 1802 -249 -1602 -4604 -4988 -3261 -747 -494 -848 -3588 -3191 -3239 -682 -759 -1084 -2904 -3362 -2616
-16604 -2616 -558 1204 638 1708 2749 3125 2642 642 -1465 -1749 -1182 -304 775 253 3512 4390
-15627 4390 2159 85 298 818 -374 -1286 -1511 -861 799 815 1050 -1025 -2610 111 2319 715
-14650 715 -839 -437 -1137 -1947 2072 1003 -2424 -5037 -3316 -284 206 -647 -914 58 619 1806 302
-13613 302 -1981 119 1238 1406 926 318 -583 -2668 -1455 -386 -201 -660 47 -161 -3114 -3380 -598
-12575 -598 -1669 -2953 -2539 -1369 -1145 -1129 -24 669 888 1232 1991 1108 -170 -1263 -3167 -4110 -3947
-11538 -3947 -3544 -3136 -2459 -1757 -3812 -3985 -1632 -633 425 2739 1691 -1352 -2027 -1059 -3246 -3171 -2245
$$ packed form
-18618B928j494l06k810K409p62j294J45j39o27J772K38m52o27L166J400j745
-17642A802k051j353l002l84J727K514K53l54k740L97m8K557p7l25j820m58P46
-16604b616K058J762n66J070J041L76m83k000k107k84N67Q78J079n22L259Q78
-15627D390k231k074K13N20j192r12k25O50J660J6K35k075j585K721K208j604
-14650G15j554M02p00q10M019j069l427k613J721L032M90q53k67R72N61J187j504
-13613C02k283K100J119J68m80o08r01k085J213J069J85m59P07k08k953k66K782
-12575e98j071j284M14J170K24J6J105O93K19L44P59q83j278j093j904r43J63
-11538c947M03M08O77P02k055j73K353R99J058K314j048l043o75R68k187P5R26
$$ plain form
-10500 -2245 -1961 -1614 -1519 -2043 -877 250 280 -798 -3650 -3270 -1050 -2733 -2779 -1830 -3200 -2783 -2120 -2464
-9401 -2464 -1369 -1975 -1799 -404 148 -114 -1036 -542 -345 -948 -331 468 1824 564 -874 -1787 -2521
-8364 -2521 -1137 -495 254 -1130 -1252 -890 -1287 -613 -987 -1850 -3004 -3797 -779 2261 974 534 3099
-7326 3099 3490 1987 722 156 -1516 -2045 -1751 -1686 579 2058 1813 3809 1520 -116 -1230 -1072
-6349 -1072 -1224 74 -1022 -592 953 -205 354 910 -416 -1206 -183 -745 -212 819 2088 4298
-5373 4298 3697 1668 1387 1496 -1468 -2379 -1651 232 -2109 -2813 1172 3473 3975 3028 3051 1744 1255
-4335 1255 148 118 -537 -1694 -1707 -1150 -2491 -2190 -1316 -651 -1683 -3906 -4286 -3257 -1645 -1065 -1630
-3297 -1630 -1291 574 -570 -1474 -1946 -3399 -3379 -2527 -1212 -1603 -1812 1147 -6 1656 3179 1946
$$ packed form
-10500b245K84L47R5n24J166J127L0j078k852L80K220j683m6R49j370M17O63l44
-9401b464J095o06J76J395N52k62r22M94J97o03O17P99J356j260j438r13p34
-8364b521J384O42P49j384j22L62l97O74l74q63j154p93L018L040j287m40K565
-7326C099L91j503j265n66j672n29K94O5K265J479k45J996k289j636j114J58
-6349a072j52J298j096M30J545j158N59N56j326p90J023n62N33J031J269K210
-5373D298o01k029k81J09k964r11P28J883k341p04L985K301N02r47K3j307m89
-4335A255j107l0o55j157j3N57j341L01Q74O65j032k223l80J029J612N80n65
-3297a630L39J865j144r04m72j453K0Q52J315l91k09K959j153J662J523j233
$$ plain form
-2321 1946 -1350 -1896 -2276 -1158 1303 3145 3735 1362 63 -1044 -1227 1776 31 -2536 -5105
-1405 -5105 -3529 -742 -14 842 -621 -509 -2178 -2518 -1199 -1616 -1714 220 705 -93 -967 -1207 -1763
-368 -1763 738 1792 2300 -146 1063 2875 1948 2691 3269 2108 1678 1523 1368 -306 -3205 -4373
609 -4373 -2030 -1950 -1605 182 -740 -2465 -3155 -3389 -889 34 2129 2198 -9 -828 -715 2217 2117
1647 2117 1771 2396 2215 150 1354 4864 7176 7358 2788 171 -690 -751 -1885 -495 -1133 -327 303
2684 303 99 -1661 -953 1131 1112 -440 -449 -1632 -600 412 -561 524 1606 2143 783 613 -2326
3722 -2326 -3024 -1255 -1076 -1547 -1537 -501 -413 -2772 -2728 -346 691 1381 2194 1058 1079 1068 -374 -588
4821 -588 -175 551 1217 1059 2068 531 668 1548 2461 4425 4169 3256 692 2093 3090 608 872
$$ packed form
-2321A946l296n46l80J118K461J842N90k373j299j107j83L003j745k567k569
-1405e105J576K787P28Q56j463J12j669l40J319m17r8J934M85p98q74k40n56
-368a763K501J054N08k446J209J812r27P43N78j161m30j55j55j674k899j168
609d373K343Q0L45J787r22j725o90k34K500R23K095O9k207q19J13K932j00
1647B117l46O25j81k065J204L510K312J82m570k617q61o1j134J390o38Q06O30
2684C03k04j760P08K084j9j552rj183J032J012r73J085J082N37j360j70k939
3722b326o98J769J79m71J0J036Q8k359M4K382J037O90Q13j136K1j1j442k14
4821e88M13P26O66j58J009j537J37Q80R13J964k56r13k564J401R97k482K64
$$ plain form
5859 872 1234 1293 455 824 2768 1729 3199 4496 455 -1292 -3979 -1836 -657 795 1062 886
6835 886 -705 -1206 -1117 -118 411 -3680 -3756 -2981 652 82 -650 295 -617 413 730 -367 -1892 -879
7934 -879 -453 126 774 -1367 -1779 -1206 26 -1418 -1328 -3704 -5376 -3509 -3910 -2909 -2648 -925 -1864
8971 -1864 -2086 -3430 -1845 -626 -40 -604 1304 382 1035 1059 228 -2967 -2383 -539 -527 -1038 1696
10009 1696 3509 2101 689 1378 32 -2505 -3384 -219 2197 1393 1408 1893 2964 3418 4300 3472 1231
11047 1231 -651 -1549 -3400 -2692 778 2046 1763 24 -3328 -5278 -6051 -6789 -4593 -1526 1507 2757
12024 2757 3770 2527 2139 1014 82 -169 -375 -405 796 1277 3198 3079 1655 696 891 1296 -2147
13061 -2147 -2132 -470 -118 -225 -14 -1473 -1539 895 394 -1367 -2068 -876 -335 -1287 240 -193 -1239
$$ packed form
5859H72L62N9q38L69J944j039J470J297m041j747k687K143J179J452K67j76
6835H86j591n01Q9R99N29m091p6P75L633n70p32R45r12J030L17j097j525J013
7934h79M26N79O48k141m12N73J232j444R0k376j672J867m01J001K61J723r39
8971a864k22j344J585J219N86n64J908r22O53K4q31l195N84J844J2n11K734
10009A696J813j408j412O89j346k537q79L165K416q04J5M85J071M54Q82q28k241
11047A231j882q98j851P08L470J268k83j739l352j950p73p38K196L067L033J250
12024B757J013j243l88j125r32k51k06l0J201M81J921j19j424r59J95M05l443
13061b147J5J662L52j07K11j459o6K434n01j761p01J192N41r52J527m33j046
$$ plain form
14099 -1239 -664 1216 2882 791 45 -591 362 1665 2552 2109 1184 2214 3035 627 1890 4347
15075 4347 3599 2713 1598 1516 3777 3758 2009 1955 3852 2672 -22 -1581 -1873 -2491 -2357 -1235 -18
16113 -18 1381 2880 3349 2208 1646 386 968 1509 -285 -368 -1572 -1684 -970 1277 3056 2791 2305
17151 2305 845 -839 -933 -1654 -543 -794 -1103 -598 -1676 -768 -1511 997 744 -306 92 -1009 -710
18188 -710 297 308 -1068 -2351 -938 212 1140 1254 -978 -2367 35 3849 2336 -2592 -3112 -1253
19165 -1253 -825 1116 1081 1448 807 145 -54 -1123 -1387 -1174 -2303 -1870 -366 1817 1020 355 -2085
20202 -2085 -2030 -3239 -3297 -4322 -2443 -2072 -2257 -842 -1292 -1667 -839 -1648 -3462 -189 1114 3137 4618
21240 4618 3107 702 -1645 -1482 931 2766 737 -381 -2036 686 2466 4466 3637 1939 -775
$$ packed form
14099a239N75J880J666k091p46o36R53J303Q87m43r25J030Q21k408J263K457
15075D347p48q86j115q2K261j9j749n4J897j180k694j559k92o18J34J122J217
16113a8J399J499M69j141n62j260N82N41j794q3j204j12P14K247J779k65m86
17151B305j460j684r4p21J111k51l09N05j078R08p43K508k53j050L98j101K99
18188g10J007J1j376j283J413J150R28J14k232j389K402L814j513m928n20J859
19165a253M28J941l5L67o41o62j99j069k64K13j129M33J504K183p97o65k440
20202b085N5j209n8j025J879L71j85J415m50l75Q28q09j814L273J303K023J481
21240D618j511k405k347J63K413J835k029j118j655K722J780K000q29j698k714
$$ plain form
22156 -775 -2011 -961 -674 -659 -978 -1148 -2351 -909 -337 940 2154 1869 1655 2761 -166 -818 -1281
23194 -1281 -1716 -4829 -4528 -2635 513 2054 -1144 -503 857 92 -1786 -1515 855 1060 -360 1013
24170 1013 42 -1153 -1186 -817 395 -597 -1542 -85 867 1027 2380 3585 4794 2357 1664 2008 2827
25208 2827 2743 1757 151 -1841 -180 1011 309 -1659 577 4 -2855 -1812 -1565 573 2636 3763
26184 3763 4227 1807 -572 -311 1215 1911 -2063 -2425 632 -459 -1662 -946 1307 261 -1210 -2476
27161 -2476 -3555 -2320 -1925 -2151 -3732 -3087 -1490 -1025 271 -528 -2310 -3133 -3818 -853 267 490
28138 490 151 -2005 -2936 -4048 -3630 -3672 -794 7 1826 817 -521 -1810 -1864 -839 210 -616 -2222
29175 -2222 -2815 -2993 -2719 -2209 -128 2076 1592 1476 1454 1516 3 -1078 -866 -1856 -4260 -5488 -1420
$$ packed form
22156g75j236J050K87J5l19j70j203J442N72J277J214k85k14J106k927o52m63
23194a281m35l113L01J893L148J541l198O41J360p65j878K71K370K05j420J373
24170A013r71j195l3L69J212r92r45J457R52J60J353J205J209k437o93L44Q19
25208B827q4r86j606j992J661J191p02j968K236n73k859J043K47K138K063J127
26184C763M64k420k379K61J526O96l974l62L057j091j203P16K253j046j471j266
27161b476j079J235L95k26j581O45J597M65J296p99j782q23o85K965J120K23
28138D90l39k156r31j112M18m2K878Q01J819j009j338j289n4J025J049q26j606
29175b222n93j78K74N10K081K204m84j16k2O2j513j081K12r90k404j228M068
$$ plain form
30213 -1420 111 -1029 -1210 -843 276 1346 957 855 -554 1154 -1017 -400 270 -1366 -4189 -2220
31189 -2220 -699 498 2383 -31 -1843 -1442 671 -764 -2136 -4149 -4535 -3070 -2625 -1547 -5373
32105 -5373 -5784 -4120 -2891 -2969 -1670 -849 -38 1494 641 -572 -2300 -3063 -2202 -1888 -1110 -972 -796
33143 -796 359 738 -1496 -2369 -2241 -3559 -3057 763 371 603 -1036 -3714 -5320 -3791 -3235 -3833 -5502
34181 -5502 -6942 -3116 -740 1791 5246 4084 2075 1835 1195 3185 2073 1103 1518 104 -994
35096 -994 -2622 -3500 -3461 -4145 -4258 -520 697 -1899 -3222 -3489 -2209 218 -890 522 894 177 -473
36134 -473 273 209 -1096 -1436 627 2547 1743 -390 -320 -1358 -2305 -1946 211 -773 566 -1112 -1301
37171 -1301 -798 257 575 4538 4045 1978 1870 2277 2406 2748 2319 1910 3032 -1228 -3576 -3668 -3224
$$ packed form
30213a420J531j140j81L67J119J070l89j02j409J708k171O17O70j636k823J969
31189b220J521J197J885k414j812M01K113j435j372k013l86J465M45J078l826
32105e373m11J664J229p8J299Q21Q11J532q53j213j728p63Q61L14P78J38J76
33143g96J155L79k234q73J28j318N02L820l92K32j639k678j606J529N56n98j669
34181e502j440L826K376K531L455j162k009k40o40J990j112r70M15j414j098
35096i94j628q78L9o84j13L738J217k596j323k67J280K427j108J412L72p17o50
36134d73P46o4j305l40K063J920q04k133P0j038r47L59K157r84J339j678j89
37171a301N03J055L18L963m93k067j08M07J29L42m29m09J122m260k348r2M44
$$ plain form
38209 -3224 -2307 -1718 -1452 -2396 -2017 -2138 -2886 -3577 -3371 -2714 -1491 -870 -965 -1422 1270 -276 706 2112
39308 2112 1752 718 -921 -429 -1883 -476 208 -1353 -2234 -2324 -835 149 764 -276 -5118 -5897 -2584
40345 -2584 -691 -1063 55 206 1825 39 243 -729 -998 -699 866 2070 406 -1451 -1130 -1836
41322 -1836 -1781 -460 -555 -1126 -1637 -607 -2312 -3682 -3606 -2570 -1023 235 462 -1877 -4030 -4586 -3585
42360 -3585 -1697 -2510 -1438 -838 -1752 -2022 -3325 -4562 -5620 -4856 -880 235 -1586 1324 2339 1638
43337 1638 1900 1773 546 -1553 -408 -800 329 488 -173 -448 -1243 -2672 255 1904 1432 1368 2965
44374 2965 2032 -751 -151 -123 -345 -363 -471 -1009 453 520 -1222 -1058 -493 -1100 -10 -745 -553 -961 -1240
45534 -1240 -650 -1261 -1539 -2480 -38 -1977 -2034 807 349 -1099 -1095 -774 -1445 -2349 786 1848 -125 -790
$$ packed form
38209c224R17N89K66r44L79j21p48o91K06O57J223O21r5m57K692j546R82J406
39308B112l60j034j639M92j454J407O84j561q81r0J489R84O15j040m842p79L313
40345b584J893l72J118J51J619j786K04r72k69K99J565J204j664j857L21p06
41322a836N5J321r5n71n11J030j705j370P6J036J547J258K27k339k153n56J001
42360c585J888q13J072O00r14k70j303j237j058P64L976J115j821K910J015p01
43337A638K62j27j227k099J145l92J129J59o61k75p95j429K927J649m72o4J597
44374B965r33k783O00K8k22j8j08n38J462O7j742J64N65o07J090p35J92m08k79
45534a240N90o11k78r41K442j939n7K841m58j448ML21o71r04L135J062j973o65
$$ plain form
46632 -790 -1240 596 1076 -738 -1016 -989 -960 -4140 -2764 -777 1416 1146 -3654 -3072 466 694 -145
47670 -145 186 2410 2503 1660 1924 1094 800 1132 1713 352 1377 3777 3637 6052 5703 4267 742
48708 742 -764 626 272 -829 2347 3147 4729 5636 5748 4076 1465 1928 195 -1638 -1061 195
49684 195 562 -1553 -53 -153 -1297 -30 -1438 -2745 -1789 -1641 -546 -58 797 -156 1754 3677
50661 3677 2195 389 465 -1503 -2316 -1029 947 962 -965 -748 -850 -2515 -1763 -1289 782 -688 -1237
51699 -1237 -1103 465 2932 1848 -691 2793 2053 -63 -754 -40 1623 2074 1532 1018 1754 2630 693
52736 693 -560 71 1128 1923 590 -662 -1381 -1589 102 1104 332 -192 -726 1989 405 566 2738
53774 2738 1547 3692 -334 -192 2945 3867 456 -1922 -2726 -4870 -5150 -3091 -3559 -605 2565 3382
$$ packed form
46632g90m50J836M80j814k78K7K9l180J376J987K193k70m800N82L538K28q39
47670a45L31K224R3q43K64q30k94L32N81j361J025K400j40K415l49j436l525
48708G42j506J390l54j101L176Q00J582R07J12j672k611M63j733j833N77J256
49684A95L67k115J500j00j144J267j408j307R56J48J095M88Q55r53J910J923
50661C677j482j806P6j968q13J287J976J5j927K17j02j665P52M74K071j470n49
51699a237J34J568K467j084k539L484p40k116o91P14J663M51n42n14P36Q76j937
52736F93j253O31J057P95j333j252p19k08J691J002p72n24n34K715j584J61K172
53774B738j191K145m026J42L137R22l411k378q04k144k80K059m68K954L170Q17
$$ plain form
54750 3382 1560 -2662 -1258 -751 -577 -808 90 221 -607 -1820 -3343 -3858 -2632 -3433 -1786 -1522 -724
55788 -724 -2813 -3693 -2035 -866 1052 -1682 -4424 -5940 -7262 -5294 -4017 -2933 -688 1096 -416
56704 -416 -2081 -607 -83 -2052 -237 -382 859 -2638 -2015 1096 432 -582 -936 -144 842 1913
57680 1913 1843 -1287 -1003 330 -1104 -2196 1081 2714 433 -755 -627 -685 -576 -1279 328 231 -969
58718 -969 -2418 939 2680 1495 -52 2959 2087 1072 2219 668 221 -781 -2598 -2328 851
59634 851 -368 -3440 -1683 -864 -1897 -1064 -1297 -1005 493 1939 505 1192 -114 -1004 -3255 -2707
60610 -2707 -3348 -4169 -3119 -3429 -2947 -1759 369 197 910 -1667 -1321 -725 -733 1254 1164 103 -835 314
61709 314 1893 2277 1266 -816 -1349 575 854 -664 -541 -137 -974 -1585 109 -536 -553 631 761
$$ packed form
54750C382j822m222J404N07J74k31Q98J31q28j213j523n15J226q01J647K64P98
55788g24k089q80J658J169J918k734k742j516j322J968J277J084K245J784j512
56704d16j665J474N24j969J815j45J241l497O23L111o64j014l54P92R86J071
57680A913p0l130K84J333j434j092L277J633k281j188J28n8J09p03J607r7j200
58718i69j449L357J741j185j547L011q72j015J147j551m47j002j817K70L179
59634H51j219l072J757Q19j033Q33k33K92J498J446j434O87j306q90k251N48
60610b707o41q21J050l10M82J188K128j72P13k577L46N96qJ987r0j061r38J149
61709C14J579L84j011k082n33J924K79j518J23M04q37o11J694o45j7J184J30
$$ plain form
62747 761 672 -1140 912 -1206 -2347 -2995 -2730 -2058 -921 -1573 -1804 -1454 -2308 -1066 -915 -590 -1302 350
63845 350 1566 2506 2592 1946 1320 1686 918 234 38 679 534 -286 -1873 -2764 -2087 -1700 -2078 -1702 182
65005 182 853 3176 3254 2798 267 745 1037 2326 3633 4112 3538 1825 1820 -903 -219 -814 -2421 -726
66104 -726 654 -342 101 2129 2588 1759 -1228 -3336 -4153 -1599 -696 -1486 -1102 -111 1100 1289 1371 1262
67203 1262 220 1548 1318 -1804 -2946 -1705 -1266 1488 -342 212 776 128 929 79 1307 1181
68179 1181 218 2016 2078 1658 2178 3231 3088 2382 797 -2124 -1601 -106 -583 254 2094 1620 132
69217 132 747 -944 403 -826 633 2580 1703 -311 -1737 -1647 -324 1269 725 -2691 -1524 -355
70193 -355 -1991 -2225 -1872 1655 3206 406 -3227 -2251 -3076 -1853 -1220 -557 -1208 -380 1281 -1839 -1304
$$ packed form
62747G61q9j812K052k118j141o48K65O72J137o52k31L50q54J242J51L25p12J652
63845C50J216R40Q6o46o26L66p68o84j96O41j45q20j587q91O77L87l78L76J884
65005A82O71K323P8m56k531M78K92J289J307M79n74j713nk723O84n95j607J695
66104g26J380r96M43K028M59q29k987k108q17K554R03p90L84R91J211J89Q2j09
67203A262j042J328k30l122j142J241M39K754j830N54N64o48Q01q50J228j26
68179A181r63J798O2m20N20J053j43p06j585k921N23J495m77Q37J840m74j488
69217A32O15j691J347j229J459J947q77k014j426R0J323J593n44l416J167J169
70193c55j636k34L53L527J551k800l633R76q25J223O33O63o51Q28J661l120N35
$$ plain form
71231 -1304 -1669 -22 -1831 -2081 -1629 270 -382 -155 1161 2125 2174 2136 37 633 -226 666 220 -491
72330 -491 -2802 -4016 -1370 1162 1163 1000 10 -720 787 310 983 389 -963 -1482 -2432 -271 -1056 738
73429 738 4502 2777 -1110 -2062 841 1628 -378 -2465 1489 -1384 -3444 -1210 1400 3029 3213
74344 3213 2907 1114 -431 -1174 -1877 -1392 -2060 -2038 -854 -41 357 343 -932 -1317 -1577 1067 828 -161
75443 -161 -2459 -2724 -342 1576 2235 1356 239 828 -93 -1133 1169 -941 202 1670 -868 357
76419 357 279 -2466 -3008 -1832 -652 1021 1165 334 -73 -828 -3567 -4307 -4585 -2188 -1937 226 3867
77457 3867 2939 462 -2114 -3309 -1805 -1132 530 65 -2267 -684 -919 -3259 -1859 -1479 152 2616
78434 2616 398 1003 1251 1207 -392 -2253 -4867 -4887 -5527 -3636 -2586 -4204 -2724 -16 319 -536 -1515
$$ packed form
71231a304l65J647j809k50M52J899o52K27J316R64M9l8k099N96q59Q92m46p11
72330d91k311j214K646K532Jj63r90p30J507m77O73n94j352n19r50K161p85J794
73429G38L764j725l887r52K903P87k006k087L954k873k060K234K610J629J84
74344C213l06j793j545p43p03M85o68K2J184Q13L98j4j275l85k60K644k39r89
75443a61k298k65K382J918O59q79j117N89r21j040K302k110J143J468k538J225
76419C57p8k745n42J176J180J673J44q31m07p55k739p40k78K397K51K163L641
77457C867r28k477k576j195J504O73J662m65k332J583k35k340J400L80J631K464
78434B616k218O05K48m4j599j861k614k0o40J891J050j618J480K708L35q55r79
$$ plain form
79471 -1515 -2988 -2037 -1340 660 -555 -1367 -83 426 2211 -658 -1287 -2123 -839 2765 4357 3798
80448 3798 2052 619 -1258 -849 -3344 -2555 -1660 386 -419 -1042 -1190 -864 -2390 -1275 417 -1382
81425 -1382 -1983 -630 1080 1146 3208 4173 3660 1075 1202 2571 4041 1013 607 1030 3308 3792 3592
82462 3592 1453 -891 -1534 -878 -1533 -582 -1455 664 847 2119 2620 -560 -77 42 2182 -130 -2303
83500 -2303 -1741 -804 -2972 -2899 266 2251 -1179 -3205 -3023 -628 1478 -11 -437 -1698 226 1872
84477 1872 86 -1211 -1678 658 4259 9498 11734 5133 147 -3696 -2203 -720 -901 -980 -558 -1390
85453 -1390 -2468 -764 -98 -76 -935 -600 -1055 326 -512 -1600 -1228 -459 -960 -682 392 5 -812 -150
86552 -150 1554 845 -490 1833 1207 -356 -3036 -3008 -2194 -3459 -3189 -1484 -428 -679 -330 1109 1995
$$ packed form
79471a515j473R51O97K000j215q12J284N09J785k869o29q36J284L604J592n59
80448C798j746j433j877M09k495P89Q95K046q05o23j48L26j526J115J692j799
81425a382o01J353J710O6K062R65n13k585J27J369J470l028m06M23K278M84k00
82462C592k139k344o43O56o55R51q73K119J83J272N01l180M83J19K140k312k173
83500b303N62R37k168P3L165J985l430k026J82K395K106j489m26j261J924J646
84477A872j786j297m67K336L601N239K236o601m986l843J493J483j81p9M22q32
85453a390j078J704O66K2q59L35m55J381q38j088L72P69n01K78J074l87q17O62
86552a50J704p09j335K323o26j563k680K8Q14j265K70J705J056k51L49J439Q86
$$ plain form
87590 1995 1533 1800 -823 -2662 -756 -1774 -3442 -3688 -1961 -1220 -106 -410 -169 -2126 -3097 -910
88566 -910 251 -1178 -914 2629 2301 479 823 2129 683 -330 -1859 -1953 -2494 -2786 -3030 -918 1615
89604 1615 1746 1123 -190 325 -337 -1606 34 -517 -2409 -2916 -380 -189 880 2732 3566 3024 1341
90641 1341 2442 4885 5025 4014 1036 -106 -1720 -1651 -2867 -3758 -1445 321 136 1243 2667 1504
91618 1504 1223 2774 -85 -1052 285 1630 2922 1860 1102 52 -2129 -2596 -1216 402 -1418
92534 -1418 -2045 821 3442 6423 10318 19343 45798 114506 98977 62586 43022 27753 21893
93327 21893 18238 15320 14428 10263 9052 7403 6198 5163 5176 4150 2985 5145 2383 -1099 997
94243 997 3537 3912 3801 1204 540 1480 385 -1362 1147 1277 -941 -1219 205 2135 2257 169
$$ packed form
87590A995m62K67k623j839J906j018j668k46J727P41J114l04K41j957r71K187
88566i10J161j429K64L543l28j822L44J306j446j013j529r4n41k92k44K112K533
89604A615J31o23j313N15o62j269J640n51j892n07K536J91J069J852Q34n42j683
90641A341J101K443J40j011k978j142j614O9j216q91K313J766j85J107J424j163
91618A504k81J551k859r67J337J345J292j062p58j050k181m67J380J618j820
92534a418o27K866K621K981L895R025K6455O8708j5529l6391j9564j5269n860
93327B1893l655k918q92m165j211j649j205j035J3j026j165K160k762l482K096
94243I97K540L75j11k597o64R40j095j747K509J30k218k78J424J930J22k088
$$ plain form
95219 169 262 578 2112 1672 1777 3515 5151 407 -1682 -2828 -3058 -1543 -340 -2172 -1351 -272
96196 -272 -222 -1033 -1681 -1465 1190 -724 -524 -1284 -1407 -2600 -3458 -1758 -2703 -863 -1101 -1041 -1124 -81
97295 -81 1745 1717 624 -370 -657 -571 2361 2890 5663 3062 2579 4345 3414 1947 1653 -700 -1493 377
98393 377 1485 5426 5211 2145 2258 2271 2861 3278 3783 8067 15056 23830 38730 71712 146913 388498
99370 388498 991793 756352 441769 285595 195809 151663 127124 107299 86616 64646
99980 64646 47055 31690 24082 22017 20760 17482 14451 11604 10160 9387 6066 6303 7725 10375
100835 10375 9750 8853 7287 7326 7474 6845 4955 3320 3592 1345 447 -352 -1668 686 2512 3683
101811 3683 4036 2987 4009 5845 4781 3679 2981 3177 5133 5198 4773 3678 2881 1443 1828 3026
$$ packed form
95219A69R3L16J534m40J05J738J636m744k089j146k30J515J203j832Q21J079
96196b72N0q11o48K16K655j914K00p60j23j193q58J700r45J840k38O0q3J043
97295h1J826k8j093r94k87Q6K932N29K773k601m83J766r31j467k94k353p93J870
98393C77J108L941k15l066J13J3N90M17N05M284O989Q774J4900L2982P5201K41585
99370C88498O03295k35441l14583j56174q9786m4146k4539j9825k0683k1970
99980F4646j7591j5365p608k065j257l278l031k847j444p73l321K37J422K650
100835A0375o25q97j566L9J48o29j890j635K72k247q98p99j316K354J826J171
101811C683L53j049J022J836j064j102o98J96J956O5m25j095p97j438L85J198
$$ plain form
102788 3026 2984 -1034 594 2035 1583 37 -213 2712 5085 2010 2406 46 1549 3387 2191 968
103765 968 432 187 -166 1531 803 1146 1806 2834 -847 133 999 184 -1704 -1668 -1004 -1170 -2668 -1588
104864 -1588 1101 30 1118 3986 3114 533 -660 703 14 121 -795 481 406 -106 -896 -448 -430
105901 -430 -974 169 -591 1052 4591 3871 2070 -513 -2894 -1925 2334 1805 2835 4917 3382 1552
106878 1552 2749 1289 2103 2867 1170 -272 942 827 -671 -7 107 -757 141 -127 914 -108
107854 -108 -2457 -3261 -1167 469 182 -190 -1033 26 546 355 3192 3211 1832 2616 1603 725 -563
108892 -563 1844 3941 2094 1433 276 709 969 776 -1248 -900 -504 715 2489 2409 1423 353 350 -881
109991 -881 1803 1738 -237 367 2923 2249 1097 1803 -3 -717 -341 -510 1420 2844 3733 2065 818
$$ packed form
102788C026m2m018J628J441m52j546k50K925K373l075L96k360J503J838j196j223
103765I68n36k45l53J697p28L43O60J028l681R80Q66q15j888L6O64j66j498J080
104864a588K689j071J088K868q72k581j193J363o89J07r16J276p5n12p90M48J8
105901d30n44J143p60J643L539p20j801k583k381R69M259n29J030K082j535j830
106878A552J197j460Q14P64j697j442J214j15j498O64J14q64Q98k68J041j022
107854a08k349q04K094J636k87l72q43J059N20j91K837J9j379P84j013q78j288
108892e63K407K097j847o61j157M33K60j93k024L48L96J219J774q0r86j070lj231
109991h81K684o5j975O04K556o74j152P06j806p14L76j69J930J424Q89j668j247
$$ plain form
111028 818 661 2259 4225 5713 3361 3016 5048 2156 1173 1782 1291 106 368 -638 -364 -1028 561
112066 561 25 -362 1198 4587 3740 1492 459 334 -700 -1678 -2529 -3394 -878 3003 2211 840 -968
113104 -968 1565 601 3371 4090 4371 3979 2763 3022 2610 -950 742 1372 151 711 1427 2153 1755
114141 1755 3701 2210 3578 1940 1660 2188 665 -497 -629 426 813 -1520 -2843 -1327 -2470
115057 -2470 -1212 490 1676 2831 1038 -1426 974 3755 2887 3278 1816 376 57 -2008 -3759
115973 -3759 -3622 -1381 -2983 -2726 -1367 472 1003 766 652 48 -199 1636 4020 5633 4389 -536
116949 -536 -415 1511 1142 -2186 -2936 -941 -3154 -764 -298 -2096 -1630 -2701 -574 -178 752 4254
117926 4254 3745 3699 653 565 -246 -1493 -675 -2847 -2591 -1267 -585 586 1379 1871 1786 928 1307 2097
$$ packed form
111028H18j57J598J966J488k352l45K032k892r83O09m91j185K62j006K74o64J589
112066E61n36l87J560L389q47k248j033j25j034r78q51q65K516L881p92j371j808
113104i68K533r64K770P19K81l92j216K59m12l560J692O30j221N60P16P26l98
114141A755J946j491J368j638k80N28j523j162j32J055L87k333j323J516j143
115057b470J258J702J186J155j793k464K400K781q68L91j462j440l19k065j751
115973c759J37K241j602K57J359J839N31k37j14o04k47J835K384J613j244m925
116949e36J21J926l69l328p50J995k213K390M66j798M66j071K127L96R30L502
117926D254n09m6l046q8q11j247Q18k172K56J324O82J171P93M92q5q58L79P90
$$ plain form
119024 2097 1832 -1902 -3006 -3699 -2287 -2036 -714 -1744 381 988 984 1016 -808 -1473 -2475 -758 252
120062 252 2308 3824 2921 2263 -288 -730 1893 1994 -23 906 431 353 -119 -1285 -2361 -1242 3429
121100 3429 2934 1347 -1900 -1829 -2302 -3144 -562 -2480 -3192 390 1120 688 207 553 1177 987 551 866
122199 866 -3001 -1255 574 617 599 562 -704 -1335 -693 -3136 -5425 -2824 -690 -468 907 -349 -1469
123236 -1469 -1447 -590 345 2861 2996 2097 2996 435 -287 392 -900 -2289 -2968 486 -334 -1079 1100
124274 1100 381 -685 -1788 -3529 -3155 -1629 -1989 161 217 530 -83 -561 -940 -1615 -634 1553 3163
125312 3163 1511 514 -617 -886 -2127 -2930 -2019 -2060 -2038 -17 -46 -256 384 2889 3019 2447 622 36
126410 36 1899 2594 1602 2457 2429 -686 -54 1963 3105 1329 -1471 -336 1750 2903 2984 3921 3766
$$ packed form
119024B097k65l734j104o93J412K51J322j030K125O07mL2j824o65j002J717J010
120062B52K056J516r03o58k551m42K623J01k017R29m75p8m72j166j076J119M671
121100C429m95j587l247P1m73q42K582j918p12L582P30m32m81L46O24j90m36L15
122199H66l867J746J829M3j8l7j266o31O42k443k289K601K134K22J375j256j120
123236a469K2Q57R35K516J35q99Q99k561p22O79j292j389o79L454q20p45K179
124274A100p19j066j103j741L74J526l60K150N6L13o13m78l79o75R81K187J610
125312C163j652r97j131k69j241q03R11m1K2K021k9k10O40K505J30n72j825n86
126410C6J863O95r92Q55k8l115O32K017J142j776k800J135K086J153Q1R37j55
$$ plain form
127448 3766 785 -990 918 3037 4108 2702 3210 2454 1330 -494 1310 1177 1072 2515 1625 1002
128424 1002 -208 558 -454 -295 -2005 -1153 64 -948 -1149 -1487 -2670 -929 1018 3247 5336 4707
129401 4707 1009 807 2374 2369 2485 1572 -743 -2993 -3063 -798 -1484 -2859 -3457 -1854 -1110 -1501 -1413 1111
130500 1111 -64 -298 876 -1047 -3283 -1672 -311 936 2148 1708 -923 -1828 2205 511 -2068
131416 -2068 -895 492 136 1229 604 2111 2145 1127 267 2144 712 -1235 -1380 -1857 -1772 471 907
132453 907 73 -169 -2302 -593 828 1767 -289 10 1878 1612 -1211 -4165 -5247 -3833 1 2455
133430 2455 -159 -646 163 -2076 -3000 -1664 -345 1347 -43 2223 2285 1231 694 1015 1047 110 777
134467 777 2433 2242 -339 -1919 -3285 -2544 -3237 -5294 -5355 -2717 637 474 -886 -1373 327 3086
$$ packed form
127448C766k981j775J908K119J071j406N08p56j124j824J804j33j05J443q90o23
128424A002j210P66j012J59j710Q52J217j012k01l38j183J741J947K229K089o29
129401D707l698k02J567nJ16r13k315k250p0K265o86j375n98J603P44l91Q8K524
130500A111j175k34J174j923k236J611J361J247J212m40k631r05M033j694k579
131416b068J173J387l56J093o25J507L4j018q60J877j432j947j45m77Q5K243M36
132453I07q34k42k133J709J421R39k056K99J868k66k823k954j082J414L834K454
133430B455k614m87Q09k239r24J336J319J692j390K266O2j054n37L21L2r37O67
134467G77J656j91k581j580j366P41o93k057o1K638L354j63j360m87J700K759
$$ plain form
135444 3086 4329 5270 4501 2422 1394 -680 -446 1204 1678 739 309 1435 1860 1722 -337 -2510
136421 -2510 491 -159 786 157 -1380 -1896 -2544 -1896 -1434 597 2048 3348 2764 529 -765 -2279
137397 -2279 -2192 -3392 -2743 253 3056 2804 1176 2226 1833 -44 -460 189 906 690 148 -132 -93 283
138496 283 -894 -463 -260 208 -730 -137 2792 3292 1674 -1375 -906 -1401 1999 990 -2448 -2434 413
139533 413 919 1472 1581 4643 3572 1687 589 -248 -858 545 230 -392 931 1802 3112 1877 -370
140571 -370 16 -113 -976 -2094 -2447 -2221 -1490 308 2343 945 -1440 -460 1304 1518 201 -1716 -1626
141609 -1626 -2076 -3297 -2503 290 -146 -511 -1219 -1119 -62 -323 1153 2551 3690 1816 1834 3022 3445
142647 3445 4977 4628 3524 1185 164 1127 301 60 50 494 -815 -848 -2341 -2438 623 1499 1273 1944
$$ packed form
135444C086J243R41p69k079j028k074K34J650M74r39m30J126M25j38k059k173
136421b510L001o50R45o29j537n16o48O48M62K031J451J300n84k235j294j514
137397b279Q7j200O49K996K803k52j628J050l93j877m16O49P17k16n42k80L9L76
138496B83j177M31K03M68r38N93K929N00j618l049M69m95L400j009l438J4K847
139533D13N06N53J09L062j071j885j098q37o10J403l15o22J323Q71J310j235k247
140571c70L86j29q63j118l53K26P31J798K035j398k385R80J764K14j317j917R0
141609a626m50j221P94K793m36l65p08J00J057k61J476J398J139j874J8J188M23
142647C445J532l49j104k339j021R63q26k41j0M44j309l3j493r7L061Q76k26O71
$$ plain form
143745 1944 3176 2814 1063 527 630 -452 -3107 -1645 -1085 1310 1679 1158 -322 -1619 642 791
144722 791 -2709 -1143 247 -1291 -2750 -3286 -4952 -1614 -2281 -909 -653 -819 -92 4918 3431 2361
145698 2361 1313 -393 2371 4263 2913 1710 3045 4168 4154 3136 2844 2716 3563 4065 4806 1723
146675 1723 -1348 627 2402 3788 2801 3286 4002 2732 -869 -1460 -246 -694 -41 915 987 -1059 -180
147713 -180 1588 4136 4025 2116 1367 29 2471 2590 617 -497 -1090 -127 1816 2075 2101 2142 -127
148750 -127 1358 4440 2988 1230 2534 1458 200 -1740 -1287 1299 897 -1140 37 -56 261 1708
149727 1708 -225 -1085 -759 661 1084 -1701 -2501 -1622 1853 4210 2308 2484 -1309 -1037 -612 135 -397
150765 -397 -625 -2135 -576 -1237 -1111 -680 -469 553 1974 1935 1982 2501 514 -387 2105 553 1459 760
$$ packed form
143745A944J232l62j751n36J03j082k655J462N60K395L69n21j480j297K261J49
144722G91l500J566J390j538j459n36j666L338o67J372K56j66P27N010j487j070
145698B361j048j706K764J892j350j203J335J123j4j018k92j28Q47N02P41l083
146675A723l071J975J775J386r87M85P16j270l601n91J214m48O53R56P2k046Q79
147713a80J768K548j11j909p49j338K442J19j973j114n93R63J943K59K6M1k269
148750a27J485L082j452j758J304j076j258j940M53K586m02k037J177r3L17J447
149727A708j933q60L26J420M23k785q00Q79L475K357j902J76l793K72M25P47n32
150765c97k28j510J559o61J26M31K11J022J421l9M7N19j987r01K492j552R06o99
$$ plain form
151863 760 1083 -251 -2281 -2777 -2949 697 -1942 -853 -905 -1299 -829 -1115 402 1789 2772 3228 2480
152901 2480 2423 -526 819 583 1216 65 -544 -2233 -5018 -2536 -1238 -658 -175 -111 -553 244 1270
153939 1270 1085 1158 2098 3206 1112 466 2313 3404 4398 2691 470 311 2465 2172 1146 1141 1321
154976 1321 2523 3443 1303 -1428 -1048 808 533 1581 -420 -1045 -563 -1479 -2849 -1053 -727 -2183
155953 -2183 -1443 405 110 -3013 -1434 -112 -629 -48 -1190 -2886 -2072 -1810 -4573 -2231 -51 1892
156930 1892 2712 2074 -168 -2636 -1750 -2553 -1894 -953 -1374 -3367 -3431 -2074 -1830 -559 743 -717 -2442
157967 -2442 -1856 -2281 -1820 -1076 1512 2673 3692 1014 -279 -940 -2924 -1993 -2412 -573 -184 751 765
159005 765 -352 -2531 -2841 -2279 643 292 122 95 746 613 -232 1230 1035 -514 -982 971 551 -1135
$$ packed form
151863G60L23j334k030m96j72L646k639J089n2l94M70k86J517J387R83M56p48
152901B480n7k949J345k36O33j151o09j689k785K482J298N80M83O4m42P97J026
153939A270j85P3R40J108k094o46J847J091R94j707k221j59K154k93j026nJ80
154976A321J202R20k140k731L80J856k75J048k001o25M82r16j370J796L26j456
155953b183P40J848k95l123J579J322n17N81j142j696Q14K62k763K342K180J943
156930A892Q20o38k242k468Q86q03O59R41m21j993o4J357K44J271J302j460j725
157967b442N86m25M61P44K588J161J019k678j293o61j984R31m19J839L89R35J4
159005G65j117k179l10N62K922l51j70k7O51j33q45J462j95j549m68J953m20j686
$$ plain form
160104 -1135 522 1061 1428 2092 3419 2703 520 336 2580 2120 -1683 -2210 -2541 -2217 -298 1469 -529
161141 -529 -1671 -1934 -595 1950 207 -1045 -1083 0 957 2011 -656 -563 -1106 -2716 -3983 -3485 -3282
162179 -3282 -3070 -2505 328 3961 3244 1433 1445 900 -1426 -1596 1005 1108 -422 1524 1576 1364 1103
163217 1103 -703 -2130 -3576 -527 457 411 964 2738 2481 1239 1211 443 1624 -618 -3409 -3445 -3182
164254 -3182 -3124 -1957 -2195 -3416 -1280 -2830 -595 413 2969 290 -1825 -601 -946 -1054 -1631 -80
165231 -80 1326 463 392 -776 -1735 -1505 -208 -99 334 -1026 -194 192 107 3085 2885 2234 2762 2840 154
166391 154 -130 570 607 408 -179 -1901 511 4935 8562 15459 35125 29891 19242 12275 8076 6627
167367 6627 5067 3004 2557 3377 4622 3443 2343 3416 3811 3386 -277 -1483 919 2044 4759
$$ packed form
160104a135J657N39L67O64J327p16k183j84K244m60l803n27l31L24J919J767j998
161141e29j142k63J339K545j743j252l8J083R57J054k667R3n43j610j267M98K03
162179c282K12N65K833L633p17j811J2n45k326j70K601J03j530J946N2k12k61
163217A103j806j427j446L049R84m6N53J774k57j242k8p68J181k242k791l6K63
164254c182N8J167k38j221K136j550K235J008K556k679k115J224l45j08n77J551
165231h0J406q63p1j168r59K30J297J09M33j360Q32L86q5K978k00o51N28P8k686
166391A54k84P00L7j99n87j722K412M424L627O897J9666n234j0649o967m199j449
167367F627j560k063m47Q20J245j179j100J073L95m25l663j206K402J125K715
$$ plain form
168283 4759 4482 911 -150 2870 1147 806 -1286 -1491 -293 -1627 1732 3001 1225 1260 2835 2145
169260 2145 432 -2294 -6856 -7348 -4703 -2554 -1172 56 -767 466 -267 -2530 -2854 -4367 -2968
170175 -2968 -2210 -1777 135 1051 623 2049 1202 137 253 -702 -558 768 -1795 -3957 -2978 -996 -2067
171213 -2067 -3760 -3157 -2112 -2134 -3138 -1184 219 923 825 -211 -3416 -1468 -1282 460 1116 1753 1232
172250 1232 -263 -1138 -1729 -1989 239 -473 -3075 -3671 -2587 -3508 -4545 -3805 -2182 -2116 554 2232 3362
173288 3362 2635 1160 441 -455 -501 3208 2713 206 -1853 -1644 101 -1269 1316 525 1067 365 -1586
174326 -1586 -516 -772 -3051 -3212 -1948 408 -1217 -1492 177 2175 1338 -1240 -688 -670 -3196 -5718
175303 -5718 -4815 -1527 -1258 487 747 1373 1077 -1725 -2664 -1979 -948 -1133 -1971 -1009 -2211 -862 274
$$ packed form
168283D759k77l571j061L020j723l41k092k05J198j334L359J269j776L5J575o90
169260B145j713k726m562m92K645K149J382J228q23J233p33k263l24j513J399
170175b968P58M33J912R16m28J426q47j065J16r55J44J326k563k162R79J982j071
171213b067j693O03J045k2j004J954J403P04r8j036l205J948J86J742O56O37n21
172250A232j495q75n91k60K228p12k602n96J084r21j037P40J623O6K670J678J130
173288C362p27j475p19q96m6L709m95k507k059K09J745j370K585p91N42p02j951
174326a586J070k56k279j61J264K356j625k75J669J998q37k578N52J8k526k522
175303e718R03L288K69J745K60O26k96k802r39O85J031j85q38R62j202J349J136
$$ plain form
176340 274 -1309 -1135 -2376 -4817 -3872 -2921 121 1255 143 -317 633 3677 4761 4820 5244 1589 499
177378 499 -529 775 1907 473 -270 1655 1402 4844 5495 2064 1834 1266 1425 953 -1226 -1426 -1666
178415 -1666 -670 -1204 -60 895 49 -941 746 513 -403 72 -2433 -2567 27 1733 2378 -1480 -2859
179453 -2859 -1631 -221 -835 -1607 566 -1678 -1381 -681 -3200 -4067 -1853 -2369 -946 -452 -1206 -3916
180430 -3916 -2385 -1228 -1724 -1441 535 2021 1644 1324 -419 334 894 -795 -1421 -1732 -3042 -1538
181406 -1538 284 -720 -3149 -2778 195 1573 1698 -528 -1742 1115 3284 4463 5472 5368 3452
182322 3452 2844 1987 977 1578 1659 801 527 1701 3342 2432 780 -3077 -3703 -2364 -1487 1494 1251
183359 1251 1428 -240 -467 2614 1308 3 186 2275 3111 2224 2738 4435 3129 2144 2108 2382 -1445
$$ packed form
176340B74j583J74j241k441R45R51L042J134j112m60R50L044J084N9M24l655j090
177378D99j028J304J132j434p43J925k53L442O51l431k30n68J59m72k179k00k40
178415a666R96n34J144R55q46r90J687k33r16M75k505j34K594J706O45l858j379
179453b859J228J410o14p72K173k244K97P00k519q67K214n16J423M94p54k710
180430c916J531J157m96K83J976J486l77l20j743P53N60j689o26l11j310J504
181406a538J822j004k429L71K973J378J25k226j214K857K169J179J009j04j916
182322C452o08q57j010O01Q1q58k74J174J641r10j652l857o26J339Q77K981k43
183359A251J77j668k27L081j306j305J83K089Q36q87N14J697j306r85l6K74l827
$$ plain form
184397 -1445 -1793 -1847 -1901 -3059 -4024 -3390 -2982 -1950 -839 -2040 315 349 3548 4631 2148 -115 -571
185435 -571 1958 1383 539 -569 -4653 -2767 -723 -2294 -401 611 1837 618 411 119 785 2122
186411 2122 3935 3233 -1754 -3065 -2411 -4633 -3376 -4696 -3051 -1450 -1165 -2793 -2828 -1821 120 -3085
187388 -3085 -1673 -764 -387 463 -563 -512 1690 1084 1087 1926 2763 900 -1122 -2453 -1824 -2759 -5326 -4275
188487 -4275 -1417 1064 2091 1982 -864 -2746 -4821 -2807 185 1663 501 -718 -1670 -2790 -3985
189402 -3985 -2372 1732 1047 -1376 -1160 -3007 -3466 -3090 -1342 226 -331 -596 1945 3844 2916 1627
190379 1627 326 -1441 -306 -292 414 -84 431 -1858 -2542 -1336 -3854 -525 -571 -984 200 261 1067
191417 1067 150 1173 648 -271 960 1870 2577 1535 -170 -1773 -1427 -1028 1115 1552 1658 184 -337
$$ packed form
184397a445l48n4n4j158r65O34M08J032J111j201K355L4L199J083k483k263m56
185435e71K529n75q44j108m084J886K044j571J893J012J226j219k07k92O66J337
186411B122J813p02m987j311O54k222J257j320J645J601K85j628l5J007J941l205
187388c085J412R09L77Q50j026N1K202o06LQ39Q37j863k022j331O29r35k567J051
188487d275K858K481J027j09k846j882k075K014K992J478j162j219r52j120j195
189402c985J613M104o85k423K16j847m59L76J748J568n57k65K541J899r28j289
190379A627j301j767J135J4P06m98N15k289o84J206k518L329m6m13J184O1Q06
191417A067r17J023n25r19J231R10P07j042j705j603L46L99K143M37J06j474n21
$$ plain form
192454 -337 2611 -30 222 1551 1270 -1254 -1789 -705 1387 3957 4375 3770 3146 918 2120 2648
193431 2648 3251 1568 1179 1941 -68 -1241 -785 -1296 304 -383 2297 4108 439 -1166 2769 1364
194407 1364 -959 -210 950 796 1390 2086 1169 -1013 -3375 -3307 -1448 -1708 -1921 -633 180 -7 1213
195445 1213 3124 2477 1771 1212 2040 3210 1771 -899 -1123 -2282 -662 -360 -3298 -2744 -1865 -260
196422 -260 855 1579 2593 1747 448 -1018 -548 1810 1789 1453 1153 -2076 -3943 -1410 519 1518 2123
197459 2123 -1565 -1510 -1100 258 -671 -973 -3102 -4272 -2491 -3458 -2199 -334 -1754 -1865 -10 -3042
198436 -3042 -2611 798 9 -1747 -1536 -819 -1351 -707 -144 2274 1604 -1581 -2860 -1639 181 1871
199413 1871 3137 1198 -17 -943 242 -1901 -835 1129 2690 2129 3262 2316 2572 2199 67 658
$$ packed form
192454c37K948k641K52J329k81k524n35J084K092K570M18o05o24k228J202N28
193431B648O03j683l89P62k009j173M56n11J600o87K680J811l669j605L935j405
194407A364k323P49J160j54N94O96r17k182k362O8J859k60k13J288Q13j87J220
195445A213J911o47p06n59Q28J170j439k670k24j159J620L02k938N54Q79J605
196422b60J115P24J014q46j299j466M70K358k1l36l00l229j867K533J929R99O05
197459B123l688N5M10J358r29l02k129j170J781r67J259J865j420j11J855l032
198436c042M31L409p89j756K11P17n32O44N63K418o70l185j279J221J820J690
199413A871J266j939j215r26J185k143J066J964J561n61J133r46K56l73k132N91
$$ plain form
200389 658 2545 4637 4899 4026 4509 4935 5492 2757 -1098 -1612 -2482 -3038 -6063 -3119 -653 -496 -358
201427 -358 -953 1644 1142 -2855 -3746 -3037 -1494 761 1069 -1279 -3359 -2035 -1199 -1063 -3104 -766
202404 -766 677 9 -306 -666 1173 1855 -1008 -1263 1259 1203 439 161 -1691 -3265 -2083 -1855 353
203441 353 3317 3162 2309 191 -2207 -1762 -32 1465 1314 60 644 -1575 -4637 -5460 -4313 -87
204418 -87 907 1484 1404 2463 967 164 144 1440 -309 -2638 -3100 -3811 -2296 -1193 -1725 -778 -659 -3679
205517 -3679 -3314 -3964 -4280 -1888 -2193 -2081 326 280 1598 3591 2229 973 249 1216 1521 -1898 -1943
206554 -1943 -1937 -805 -155 -344 -1041 -1426 -442 -1950 -4169 -2701 -1808 -1769 -1632 -1119 816 892 1316 274
207653 274 453 -54 1006 3239 599 2509 2614 2455 1813 390 347 1063 1443 -2077 -1539 575 1114
$$ packed form
200389F58J887K092K62q73M83M26N57k735l855n14q70n56l025K944K466J57J38
201427c58n95K597n02l997q91P09J543K255L08k348k080J324Q36J36k041K338
202404g66J443o68l15l60J839O82k863k55K522n6p64k78j852j574J182K28K208
203441C53K964j55q53k118k398M45J730J497j51j254N84k219l062q23J147M226
204418h7R94N77q0J059j496q03k0J296j749k329m62p11J515J103n32R47J19l020
205517c679L65o50l16K392l05J12K407m6J318J993j362j256p24R67L05l419m5
206554a943OJ132O50j89o97l85R84j508k219J468Q93L9J37N13J935P6M24j042
207653B74J79n07J060K233k640J910J05j59o42j423m3P16L80l520N38K114N39
$$ plain form
208691 1114 1600 995 461 250 907 86 618 1389 163 -488 -1149 616 168 101 -381 -1389 -261 305
209789 305 -691 -1402 -920 -478 555 641 -666 -739 -2547 133 1926 180 -1320 -1418 -855 2131 61
210827 61 -54 -733 663 2766 1675 1136 -451 -1840 -2536 -860 -2433 -169 1157 1188 948 -2710 -1092
211864 -1092 1165 1597 -921 -1016 -433 -1781 13 1624 2087 1945 -125 -242 -980 -1157 -1582 -2221 -3998
212902 -3998 -2380 -2977 -4583 -4757 -4547 -4374 -3483 -2135 -898 -1874 -3185 -1088 -889 663 929 2655
213879 2655 1980 2371 2501 1186 -2211 -242 1265 -571 -2819 -2575 -1955 -612 -2426 -2371 -1077 1262
214856 1262 2432 916 1198 -3029 -1065 394 -529 -1223 -981 -338 -1430 -1160 1710 1545 1198 1453 -1031
215893 -1031 -2721 -1219 -830 -52 3252 3222 1253 -606 -383 -896 -370 2137 1823 1983 1686 -1051 -3454
$$ packed form
208691A114M86o05n34k11O57q21N32P71j226o51o61J765m48o7m82j008J128N66
209789C05r96p11M82M42J033Q6j307p3j808K680J793j746j500r8N63K986k070
210827F1j15o79J396K103j091n39j587j389o96J676j573K264J326L1k40l658J618
211864a092K257M32k518r5N83j348J794J611M63j42k070j17p38j77m25o39j777
212902c998J618n97j606j74K10J73Q91J348J237r76j311K097J99J552K66J726
213879B655o75L91J30j315l397J969J507j836k248K44O20J343j814N5J294K339
214856A262J170j516K82m227J964J459r23o94K42O43j092K70K870j65l47K55k484
215893a031j690J502L89P78L304l0j969j859K23n13N26K507l14J60k97k737k403
$$ plain form
216931 -3454 -4802 -2277 525 3379 3725 4895 5931 902 -1483 444 783 766 -1725 -2928 -2237 -2977
217908 -2977 -2929 -1319 413 -159 1866 -577 -1795 -2401 -2097 -372 508 -1301 -397 -1120 -542 1378 166
218945 166 -2261 206 2465 1774 -1967 -2049 1694 1323 1201 3484 4384 2227 634 -22 642 1134 1850
219983 1850 -17 1143 276 -1702 -2478 9 1894 1712 -532 -1516 -1906 107 1842 192 -1443 281
220959 281 2046 3006 1397 539 1228 1813 1084 680 708 -744 -2281 -2909 -1893 -320 -1203 -2113 -1709 -954
222058 -954 101 425 -2122 -2988 -169 -508 -1179 -2759 -731 -890 -224 345 -192 -763 -2295 -2454 -2967
223096 -2967 -3247 -817 -207 -999 -990 -873 -1324 -1536 -1409 -2954 -1530 1075 3377 2161 1229 -1053 -2916
224134 -2916 -3737 -2802 -1957 289 747 -1293 -1412 805 4356 3793 -502 -1098 -78 389 3167 1595
$$ packed form
216931c454j348K525K802K854L46J170J036n029k385J927L39j7k491j203O91p40
217908b977M8J610J732n72K025k443j218o06L04J725Q80j809R04p23N78J920j212
218945A66k427K467K259o91l741q2L743l71j22K283R00k157j593o56O64M92P16
219983A850j867J160q67j978p76K487J885j82k244r84l90K013J735j650j635J724
220959B81J765R60j609q58O89N85p29m04K8j452j537o28J016J573q83r10M04P55
222058i54J055L24k547q66K819l39o71j580K028j59O66N69n37n71j532j59n13
223096b967k80K430O10p92RJ17m51k12J27j545J424K605K302j216r32k282j863
224134b916q21R35Q45K246M58k040j19K217L551n63m295n96J020M67K778j572
$$ plain form
225110 1595 2406 512 -966 -473 -941 -828 -141 249 -2130 -1218 -1223 -77 1021 -701 -2609 -2116 -1163
226148 -1163 2109 1857 881 -270 -3020 -1479 -1775 -1152 -2845 -1318 -2984 -3604 -4181 -1807 -1459 -1058
227124 -1058 774 1115 1190 1230 732 1677 2681 2985 821 16 -659 -2155 -2637 -1310 -2799 -1802 -827 -351
228223 -351 499 -683 -1722 -2055 -940 549 655 -574 -801 364 928 -2899 -6997 -6720 -5556 -2694
229200 -2694 145 2244 2415 3384 2147 656 2366 2814 2146 1237 1949 3462 3326 845 596 1094 1964
230237 1964 2538 1935 1719 -1956 -1101 -316 510 873 703 1322 439 972 818 373 819 1554 2957 2444
231336 2444 -1201 -1712 -863 1994 3323 3293 172 -3158 -5656 -5873 -3196 -2161 -3391 -1780 -2902 -6567
232313 -6567 -6511 -2695 -2332 -1790 454 -519 -762 -2532 -1638 1308 1052 1051 720 -511 114 -95 -486 368
$$ packed form
225110A595Q11j894j478M93m68J13O87L90k379R12nJ146J098j722j908M93R53
226148a163L272k52r76j151k750J541k96O23j693J527j666o20n77K374L48M01
227124a058J832L41P5M0m98R45J004L04k164q05o75j496m82J327j489R97R75M76
228223c51Q50j182j039l33J115J489J06j229k27J165N64l827m098K77J164K862
229200b694K839K099J71R69j237j491J710M48o68r09P12J513j36k481k49M98Q70
230237A964N74o03k16l675Q55P85Q26L63j70O19q83N33j54m45M46P35J403n13
231336B444l645n11Q49K857J329l0l121l330k498k17K677J035j230J611j122l665
232313f567N6L816L63N42K244r73k43j770Q94K946k56jl31j231O25k09l91Q54
$$ plain form
233412 368 -227 -1977 -2617 -3435 -3330 -2683 -1558 278 4296 6585 4340 1725 1601 931 155 -526 967
234449 967 2309 2059 3219 2689 301 437 420 1792 1755 2090 2759 2012 -1881 -3528 -2240 -411 -1444
235487 -1444 -1927 -1833 -56 795 -2230 -1316 -587 -862 477 -2155 -3368 -2719 510 -1683 -2441 -657 -618
236524 -618 -802 -2198 -4006 -5725 -2563 801 1587 3418 3240 3637 1236 -780 -1133 923 497 -1002
237501 -1002 -2 -328 27 -1480 -2678 -1725 -940 -799 -982 11 1364 1776 3507 2949 1597 1724 1602
238539 1602 243 2213 3508 2895 975 2157 4279 2038 -28 1133 1641 1859 2526 2469 1737 137
239515 137 -687 1255 1714 -960 -1025 275 -888 696 2215 15 -2596 -1248 1883 2201 -76 -1414
240492 -1414 -2088 -4582 -2368 -732 -1696 -1251 -1356 -919 -3997 -3435 -2439 -1460 1048 1837 1265 958 2504
$$ packed form
233412C68n95j750o40q18J05O47J125J836M018K289k245k615j24o70p76o81J493
234449I67J342k50J160n30k388J36j7J372l7L35O69p47l893j647J288J829j033
235487a444m83R4J777Q51l025R14P29k75J339k632j213O49L229k193p58J784L9
236524f18j84j396j808j719L162L364P86J831j78L97k401k016l53K056m26j499
237501a002J000l26L55j507j198R53P85J41j83R93J353M12J731n58j352J27j22
238539A602j359J970J295o13j920J182K122k241k066J161N08K18O67n7p32j600
239515A37q24J942M59k674o5J300j163J584J519k200k611J348L131L18k277j338
240492a414o74k494K214J636r64M45j05M37l078N62R96R79K508P89n72l07J546
$$ plain form
241530 2504 1643 492 -887 -1853 -3193 -3671 -2659 -1876 -1342 -1113 -210 -1759 -2892 -2129 117 2129
242506 2129 3315 3568 2922 3587 1548 910 925 227 1728 1782 794 -770 -2176 -1091 -185 1122 1895
243544 1895 3114 1970 2859 3657 2061 -79 66 54 -1752 -1407 -3614 -3549 -2724 -1012 71 2142 1361
244581 1361 86 1981 1313 -942 402 1809 4193 4200 2716 894 -2901 -2588 -2961 -1241 2464 882
245558 882 -2232 -1566 1270 2468 4976 3703 196 -432 74 585 -1689 -2666 -2844 -2521 -2698 -1207 -1166
246596 -1166 -2067 -2445 -4074 -981 -751 -1623 -2167 374 174 -453 552 749 133 -268 -876 -1829 -1533 385
247694 385 1645 1583 153 1221 995 492 1360 1878 381 -2012 -2406 -813 1625 1679 -1522 -144 438
248732 438 -1194 571 2465 4281 5863 4524 1607 -281 -1190 -2299 -2738 -1987 -3358 -2716 -3263 -4151
$$ packed form
241530B504q61j151j379r66j340m78J012P83N34K29R03j549j133P63K246K012
242506B129J186K53o46O65k039o38J5o98J501N4r88j564j406J085R06J307P73
243544A895J219j144Q89P98j596k140J45j2j806L45k207O5Q25J712J083K071p81
244581A361j275J895o68k255J344J407K384Pj484j822l795L13l73J720L705j582
245558H82l114O66K836J198K508j273l507o28N06N11k274r77j78L23j77J491M1
246596a166r01l78j629L093K30q72n44K541k00o27J005J97o16m01o08r53K96J918
247694C85J260o2j430J068k26n03Q68N18j497k393l94J593K438N4l201J378N82
248732D38j632J765J894J816J582j339k917j888r09j109m39P51j371O42n47q88
$$ plain form
249709 -4151 -3419 -2479 -2325 -1779 159 2661 1278 458 969 -1483 -750 1100 1738 2507 3600 2240 2488
250747 2488 2537 3737 5277 -135 -2040 -1421 172 -483 -1388 -1977 -2241 -416 -87 -495 710 -615 -2025
251784 -2025 -2932 -4035 -2113 -2356 -1215 -158 301 -1478 -2299 -1035 -1786 195 2407 5216 5730 1552
252761 1552 349 1880 829 128 338 450 -1373 -2247 -2214 -1440 -1600 473 1012 -897 -1234 -2898 -864
253798 -864 1940 1712 1787 973 -339 1767 1602 1081 821 961 3237 2157 2860 5280 5164 2332 -521
254836 -521 -444 181 1291 -146 210 -1084 -925 -701 180 1011 516 -590 -1241 2254 5168 4154 3140
255874 3140 3586 3118 30 -1169 -837 -1614 -204 -1883 -1449 -793 392 1554 637 -991 -2773 211
256850 211 975 -837 -1756 -1847 -3691 -3811 -2402 -2084 -1035 -1194 -1033 763 563 159 -2013 -1955 -1435 -1878
$$ packed form
249709d151P32R40J54N46J938K502j383q20N11k452P33J850O38P69J093j360K48
250747B488M9J200J540n412j905O19J593o55r05n89k64J825L29m08J205j325j410
251784b025r07j103J922k43J141J057M59j779q21J264p51J981K212K809N14m178
252761A552j203J531j051p01K10J12j823q74L3P74j60K073N39j909l37j664K034
253798h64K804k28P5q14j312K106j65n21k60J40K276j080P03K420j16k832k853
254836e21P7O25J110j437L56j294J59K24Q81Q31m95j106o51L495K914j014j014
255874C140M46m68l088j199L32p77J410j679M34O56J185J162r17j628j782K984
256850B11P64j812r19r1j844j20J409L18J049j59J61J796k00m04k172N8N20m43
$$ plain form
257949 -1878 184 576 18 -224 253 -24 -384 -1374 -2553 -1162 -1931 -632 2175 2689 1184 -222 -2638
258987 -2638 -4782 -4528 -2910 -4049 -5843 -3791 -1771 -48 -250 -1506 -95 -658 504 -1719 396
259902 396 1575 2508 1716 2633 4374 5405 4493 125 -2861 -3315 -301 2350 1374 317 2309 3190
260879 3190 1761 1507 -676 -2481 -2824 616 1028 740 2801 938 1928 2092 3891 3350 1194 548
261856 548 68 -656 964 791 -208 -2124 -2164 -2003 -2070 -2705 -3974 -5765 -7043 -6730 -8207 -6934 -4736
262893 -4736 -3906 -2425 -995 -1997 -2546 474 1852 427 -217 1087 643 -868 1589 948 -507 -607
263870 -607 1212 334 -1486 -2369 -2169 -1932 1396 1096 -913 420 1670 2245 473 -1285 816 1209
264846 1209 880 -1990 -923 249 2477 2590 706 2472 1666 -371 -95 -1192 -1297 -1009 -646 196
$$ packed form
257949a878K062L92n58k42M77k77l60r90j179J391p69J299K807N14j505j406k416
258987b638k144K54J618j139j794K052K020J723k02j256J411n63J162k223K115
259902C96J179R33p92R17J741J031r12m368k986m54L014K651r76j057J992Q81
260879C190j429k54k183j805l43L440M12k88K061j863R90J64J799n41k156o46
261856E48m80p24J620j73r99j916m0J61o7o35j269j791j278L13j477J273K198
262893d736Q30J481J430j002n49L020J378j425o44J304m44j511K457o41j455j00
263870f07J819q78j820q83K00K37L328l00k009J333J250N75j772j758K101L93
264846A209l29k870J067J172K228J13j884J766q06k037K76j097j05K88L63Q42
$$ plain form
265823 196 -1895 -3147 -1936 1723 3278 2377 1809 3025 2256 -292 -2685 831 240 -1067 -775 301
266800 301 1592 689 -1202 -2055 -2060 -2215 -839 -76 -2059 -849 -1676 -1382 -608 2064 -446 -1618 -1372
267837 -1372 -2133 -3532 -3724 -1853 -3242 -4082 -1264 -834 198 1527 2022 1233 2716 2840 1644 908
268814 908 2671 1757 4180 2511 -1635 -858 46 -881 -2520 -1957 -771 -952 -2078 -2177 -1896 -501 -11
269851 -11 -1755 -1364 -2802 -5893 -7089 -5266 -3949 -1377 -388 -770 -83 2345 2873 -1478 -2830 -1441
270828 -1441 -604 1293 -815 -2275 -1467 -275 721 -1001 -1654 -841 -1044 -1622 447 1142 1522 1468 -731
271866 -731 -2726 -1978 42 2594 2881 4808 4490 2656 1632 2331 2726 3370 4058 3655 2429 1527 2649
272904 2649 1651 93 2597 2288 3601 3144 286 1005 727 2390 2097 19 -224 -1374 -1834 -1186 -240
$$ packed form
265823A96k091j252J211L659J555r01n68J216p69k548k393L516n91j307K92J076
266800C01J291r03j891q53nj55J376P63j983J210q27K94P74K672k510j172K46
267837a372p61j399j92J871j389q40K818M30J032J329M95p89J483J24j196p36
268814I08J763r14K423j669m146P77R04r27j639N63J186j81j126r9K81J395M90
269851a1j744L91j438l091j196J823J317K572R89l82O87K428N28m351j352J389
270828a441Q37J897k108j460Q08J192R96j722o53Q13k03n78K069O95L80n4k199
271866g31j995P48K020K552K87J927l18j834j024O99L95O44O88m03j226r02J122
272904B649r98j558K504l09J313m57k858P19k78J663k93k078k43j150m60O48R46
$$ plain form
273941 -240 2625 1803 -766 -1114 1569 1470 1231 -1916 -1551 617 1728 731 1619 1978 912 713 1064
274979 1064 1594 2416 4986 4907 4092 3161 2254 85 -2010 -2323 -863 -1251 360 -329 -1203 -1106 756 1731
276077 1731 1243 1354 1369 367 -359 433 1250 1312 1514 762 509 -824 2102 299 -458 -11 -466 818
277176 818 4150 4858 3799 3223 2917 2659 2923 2585 1014 997 3513 3330 1407 992 -1849 -2860 -1581
278214 -1581 -1669 -763 756 -1757 -3266 -3406 -2300 -3453 -2921 -1168 -727 -756 -482 662 388 -1323 1218
279252 1218 954 603 731 393 -1798 -1535 352 187 580 1852 1058 2173 -587 -2140 -1307 -471 -1081
280289 -1081 -2629 -2362 -1429 1487 1629 637 1014 3159 4217 225 -3159 -3339 -1145 -748 -198 -2228
281266 -2228 -2011 -1607 -193 1145 1358 809 1865 2371 1922 552 1141 441 1536 463 2324 1678 855
$$ packed form
273941b40K865q22k569l48K683r9k39l147L65K168J111r97Q88L59j066j99L51
274979A064N30Q22K570p9q15r31r07k169k095l13J460l88J611o89q74R7J862R75
276077A731m88J11J5j002p26P92Q17O2K02p52k53j333K926j803p57M47m55J284
277176H18L332P08j059n76l06k58K64l38j571j7K516j83j923m15k841j011J279
278214a581q8R06J519k513j509j40J106j153N32J753M41k9K74J144k74j711K541
279252A218k64l51J28l38k191K63J887j65L93J272p94J115k760j553Q33Q36o10
280289a081j548K67R33K916J42r92L77K145J058l992l384j80K194L97N50k030
281266b228K17M04J414J338K13n49J056N06m49j370N89p00J095j073J861o46q23
$$ plain form
282303 855 3775 6919 5639 4862 3873 2802 2187 -563 -837 2116 4691 2873 683 2342 1602 486
283280 486 510 389 2756 1636 -769 -257 3801 5198 4339 3684 3668 -497 -1002 1542 1439 125 -405
284318 -405 746 798 659 694 120 -427 -2234 -1907 1165 1380 -810 -276 1041 950 188 1129 2645 3630
285416 3630 4034 3050 1783 2099 2433 4092 3412 2236 2891 1229 -2249 375 3340 4807 6004 5492
286393 5492 5593 1387 299 2826 1974 3152 5868 3518 1979 -2002 -1810 1263 900 2140 4601
287309 4601 5968 5147 4797 3210 3461 3846 1385 1605 2794 2915 4432 4794 7248 6516 4153 3598 3890
288346 3890 4065 6340 4845 4260 5772 6134 5295 5988 9163 14161 25705 47938 89411 102371 80336
289262 80336 59307 44391 33805 31280 29767 25520 22266 17578 13536 11838 12009 12209 10404 7699
$$ packed form
282303H55K920L144j280p77r89j071o15k750k74K953K575j818k190J659p40j116
283280D86K4j21K367j120k405N12M058J397q59o55j6m165n05K544j03j314n30
284318d05J151N2j39L5n74n47j807L27L072K15k190N34J317r1p62R41J516R85
285416C630M04r84j267L16L34J659o80j176O55j662l478K624K965J467J197n12
286393E492J01m206j088K527q52J178K716k350j539l981J92L073l63J240K461
287309D601J367q21l50j587K51L85k461K20J189J21J517L62K454p32k363n55K92
288346C890J75K275j495n85J512L62q39O93L175M998J1544K2233M1473J2960k2035
289262H0336k1029j4916j0586k525j513m247l254m688m042j698J71K00j805k705
$$ plain form
290116 7699 3875 5192 6223 7286 8373 11256 17127 27655 44897 82049 104813 82678 62167
290910 62167 45744 35982 33661 29479 26884 23789 19215 15362 12107 12055 9676 5103 4757 5821 4914
291825 4914 6177 6495 8042 10527 13167 22594 37288 68685 99317 85811 63401 46841 37212
292619 37212 33646 30978 31110 26717 21940 16611 10841 7947 2884 798 1815 1126 1685 3397 1596
293534 1596 -777 -1055 1648 1458 355 -1773 -246 496 -758 774 1336 2783 1831 1536 2685 2962
294511 2962 4658 5842 1589 456 3433 3037 1413 -1025 -580 1881 2739 2358 1585 2964 2067 2187
295488 2187 2761 2658 -263 -1876 -1164 285 865 -1335 -1718 -550 978 678 -2509 135 2172 -672
296465 -672 -1694 359 2778 825 -249 1067 -158 -1165 -3129 -1813 -1070 -1162 -1889 -933 -1773 -2176
$$ packed form
290116G699l824J317J031J063J087K883N871J0528J7242L7152K2764k2135k0511
290910F2167j6423r762k321m182k595l095m574l853l255n2k379m573l46J064r07
291825D914J263L18J547K485K640R427J4694L1397L0632j3506k2410j6560r629
292619C7212l566k668J32m393m777n329n770k894n063k086J017o89N59J712j801
293534A596k373k78K703j90j103k128J527P42j254J532N62J447r52k95J149K77
294511B962J696J184m253j133K977l96j624k438M45K461Q58l81p73J379q97J20
295488B187N74j03k921j613P12J449N80k200l83J168J528l00l187K644K037k844
296465f72j022K053K419j953j074J316j225j007j964J316P43r2p27R56q40m03
$$ plain form
297441 -2176 -3031 -808 1505 -395 -1614 -1916 69 2177 2196 1104 190 -1261 -3412 -3155 -2289 -347
298418 -347 662 -237 -614 -1875 -1565 -362 211 -554 -558 -853 -1844 -2515 -2571 -687 -768 -3185 -2852 -1500 -1162
299578 -1162 441 -736 -1006 -1727 -3092 -1762 -891 -685 -2291 -741 276 -1538 79 -82 -343 -2271
300554 -2271 -5272 -2998 -1077 -1465 -2649 -2556 -2448 -1985 -3068 -3863 -4329 -3608 -4389 -2756 482 4047 3410
301592 3410 2510 1642 -1720 -1094 -816 -874 1474 859 -8 -1448 -528 412 1095 2017 201 -951 -579 1376
302690 1376 90 -1333 1355 894 1226 -1152 -4271 -3978 -3115 -2205 -1865 -3208 -464 -209 2434 3690
303667 3690 3415 1737 2113 2639 1348 2702 2195 -725 -144 -291 -1296 213 1265 992 1639 1117 2083
304705 2083 1381 1536 2558 3003 1286 665 1531 2994 2441 488 -688 812 -734 1239 780 3333
$$ packed form
297441b176q55K223K313j900j219l02J985K108J9j092r14j451k151K57Q66J942
298418c47J009q99l77j261L10J203N73p65mk95r91o71n6J884q1k417L33J352L38
299578a162J603j177k70p21j365J330Q71K06j606J550J017j814J617j61k61j928
300554b271l001K274J921l88j184R3J08M63j083p95m66P21p81J633L238L565o37
301592C410r00q68l362O26K78n8K348o15q67j440R20R40O83R22j816j152L72J955
302690A376j286j423K688m61L32k378l119K93Q63R10L40j343K744K55K643J256
303667C690k75j678L76N26j291J354n07k920N81j47j005J509J052k73O47n22R66
304705B083p02J55J022M45j717o21Q66J463n53j953j176J500j546J973m59K553
$$ plain form
305682 3333 5612 3957 3492 2346 1571 2993 1398 -200 -618 1310 -956 -1290 -1744 -1132 -2908 -2003
306658 -2003 153 469 -44 1050 1880 880 96 246 2098 2951 1819 -82 -593 508 1148 2037 964
307696 964 -118 704 1096 10 -781 -1035 -2346 878 4040 2127 -1062 -1970 -301 805 2261 1166
308672 1166 1325 1368 1805 3601 2636 168 -2497 -1406 1274 1330 1067 415 -1444 -637 -100 -395 -683 -2345
309771 -2345 -1948 -195 -299 -1596 -1316 627 926 -2657 -3734 -2604 -1064 932 110 475 -480 -1572
310748 -1572 -733 -959 95 2328 3888 5510 4657 2686 378 561 2281 1189 1128 207 -983 -669
311724 -669 2114 1458 1325 999 1297 66 483 629 -197 1052 1191 1980 2058 1464 2431 982 1305 2637
312823 2637 2323 1597 -242 412 1692 1159 1053 791 -6 138 2550 2153 1251 -1163 -1403 78 1069
$$ packed form
305682C333K279j655m65j146p75J422j595j598m18J928k266l34m54O12j776R05
306658b003K156L16n13J094Q30j000p84J50J852Q53j132j901n11J101O40Q89j073
307696I64j082Q22L92j086p91k54j311L224L162j913l189r08J669J106J456j095
308672A166J59M3M37J796r65k468k665J091K680N6k63o52j859Q07N37k95k88j662
309771b345L97J753j04j297K80J943K99l583j077J130J540J996q22L65r55j092
310748a572Q39k26J054K233J560J622q53j971k308J83J720j092o1r21j190L14
311724f69K783o56j33l26K98j231M17J46q26J249J39P89P8n94R67j449L23J332
312823B637l14p26j839O54J280n33j06k62p97J44K412l97r02k414k40J481R91
$$ plain form
313860 1069 1269 -440 -2694 -3029 -2858 -1128 -816 -651 2991 3241 1705 1412 4117 1478 -1742 -2151
314837 -2151 -1440 89 -64 753 697 -199 -3398 -1863 160 -932 -3997 -4784 -1938 363 2110 2441
315814 2441 -109 -1267 -1308 -2540 -1109 -1453 371 3868 4681 1915 366 2186 1238 -871 -2446 -4368
316790 -4368 -5567 -3855 -2129 -2729 -3287 -4954 -6892 -4285 -62 267 -260 -185 -1990 -2696 -2297 -2459 -2767
317828 -2767 -2964 -2116 -368 -1569 -3527 -3925 1707 3617 2630 1738 -398 -116 1676 285 522 2170
318805 2170 2760 2861 3719 2814 1466 -320 616 261 1777 -99 389 1224 1616 927 775 -428 310
319842 310 -547 393 -704 -2039 -1044 -387 861 223 461 561 406 -1324 -988 -200 794 344 2615 4046
320941 4046 4635 3907 3341 3440 3052 -408 -937 -1020 -1041 -1014 -444 -724 -743 -1000 -1376 -2323 -2918 -2002 -1008 566
$$ packed form
313860A069K00j709k254l35J71J730L12J65L642K50j536k93K705k639l220m09
314837b151P11J529j53Q17n6q96l199J535K023j092l065p87K846K301J747L31
315814B441k550j158m1j232J431l44J824L497Q13k766j549J820r48k109j575j922
316790d368j199J712J726o00n58j667j938K607M223L29n27P5j805p06L99j62l08
317828b767j97Q48J748j201j958l98N632J910r87q92k136K82J792j391K37J648
318805B170N90J01Q58r05j348j786R36l55J516j876M88Q35L92o89j52j203P38
319842C10q57R40j097j335R95O57J248o38K38J00j55j730L36P88R94m50K271J431
320941D046N89p28n66R9l88l460n29q3k1K7N70k80j9k57l76r47n95R16R94J574
$$ plain form
322162 566 2634 1278 1147 3655 2997 768 1164 2111 2109 -1129 -2377 -963 -1097 221 -1897 545 1709
323200 1709 1426 -267 -636 -1263 -1494 -1169 -622 -1913 -4057 -2549 16 512 -1010 -2297 -2339 -602 642
324237 642 1041 328 -483 -1620 -1931 -3206 -3336 -2905 -2922 -1468 171 -527 -2005 -1437 -1352 -978 -160 -161 -1599
325397 -1599 1581 3455 2633 385 727 755 -127 1240 1070 -304 -1215 -800 114 1290 1783 2787 1058
326435 1058 3015 2495 -728 -2796 -4312 -4704 -2204 -1203 -464 -625 -2190 616 4629 4043 1464 -511
327411 -511 -521 -1834 -2147 -1819 -2121 -1991 387 1191 785 1161 398 -477 745 2046 1384 2550 4791 482
328510 482 -1743 -4899 -4673 -4328 -2529 -1287 -926 -2668 -2239 280 269 594 1340 967 4393 2256 720
329547 720 -354 -1249 -1024 -71 -1562 -569 994 3270 3569 1861 2090 2624 2769 3361 707 1410 2453
$$ packed form
322162E66K068j356j31K508o58k229L96R47kl238j248J414j34J318k118K442J164
323200A709k83j693l69o27k31L25N47j291k144J508K565M96j522j287m2J737J244
324237F42L99p13q11j137l11j275j30M31j7J454J639o98j478N68Q5L74Q18jj438
325397a599L180J874q22k248L42K8q82J367j70j374r11M15R14J176M93J004j729
326435A058J957n20l223k068j516l92K500J001P39j61j565K806M013n86k579j975
327411e11j0j313l13L28l02J30K378Q04m06L76p63q75J222J301o62J166K241m309
328510D82k225l156K26L45J799J242L61j742M29K519j1L25P46l73L426k137j536
329547G20j074q95K25R53j491R93J563K276K99j708K29N34J45N92k654P03J043
$$ plain form
330585 2453 -614 -895 -1360 -2490 -3523 -2477 -1066 -1601 514 1264 293 415 -161 -2174 -3213 -1088
331562 -1088 132 908 -585 -2473 -3409 -1963 627 1525 1985 2130 2072 -1159 -2480 -1803 -351 -539 -1785
332600 -1785 -799 -267 359 1470 530 -3592 -3248 -3320 -1876 -2208 -1700 -1983 -3325 -1060 1248 2655 2415
333637 2415 612 -28 2766 3922 3645 2796 1308 1781 1678 1882 2272 972 -3148 -1252 -1777 -1440 429
334675 429 1566 5334 4144 1846 1925 3190 2395 -51 1396 1971 4404 4116 3681 4843 3416 4092
335651 4092 4404 2925 559 3 837 939 2024 3603 1603 -572 1020 2318 1512 -408 -1104 289
336628 289 152 -2330 -1176 -1244 -2040 194 816 -412 -2129 -799 -3049 -3806 -2731 -2289 -437 -9 -2260
337666 -2260 -573 888 2503 3634 2914 1709 -15 -2545 658 3867 3557 2169 912 285 -659
$$ packed form
330585B453l067k81m65j130j033J046J411n35K115P50r71J22n76k013j039K125
331562a088J220P76j493j888r36J446K590Q98M60J45n8l231j321O77J452j88j246
332600a785R86N32O26J111r40m122L44p2J444l32N08k83j342K265K308J407k40
333637B415j803o40K794J156k77q49j488M73j03K04L90j300m120J896n25L37J869
334675D29J137L768j190k298P9J265p95k446J447N75K433k88m35J162j427O76
335651D092L12j479k366n56Q34J02J085J579k000k175J592J298q06j920o96J393
336628B89j37k482J154o8p96K234O22j228j717J330k250p57J075M42J852M28k251
337666b260J687J461J615J131p20j205j724k530L203L209l10j388j257o27r44
$$ plain form
338581 -659 1010 1411 -240 286 1397 775 131 -1461 -3722 143 1478 3213 3668 2880 473 -1577
339558 -1577 -3688 -3903 -2124 -147 -392 -440 1140 1168 730 272 -1747 -3167 -2937 -2352 99 947 938 -580
340656 -580 246 1871 -2 -1205 1250 1940 2793 817 486 1952 2396 3445 1981 2774 3454 1606
341633 1606 445 -1131 -2118 -1184 -466 -3355 -3542 952 1577 571 120 -1210 -1008 -3044 -2938 -1953 -1028
342671 -1028 -563 -927 -2323 -2794 -2158 -3798 -770 2030 900 -160 976 1851 287 2119 2750 2889
343648 2889 1699 389 -840 -1193 2600 2471 2365 1857 915 354 -93 -560 416 1939 882 381 -1488
344685 -1488 20 2754 899 -1023 -1114 189 102 820 -283 -1067 516 -890 985 875 -250 97
345662 97 -1223 -990 -1988 -2386 -1444 -2091 -186 491 899 678 -743 -1542 34 400 -543 -2092 -1841 -1266
$$ packed form
338581f59J669M01j651N26J111o22o44j592k261L865J335J735M55p88k407k050
339558a577k111k15J779J977k45m8J580K8m38m58k019j420K30N85K451Q48rj518
340656e80Q26J625j873j203K455O90Q53j976l31J466M44J049j464P93O80j848
341633A606j161j576r87R34P18k889j87M494O25j006m51j330K02k036J06R85R25
342671a028M65l64j396m71O36j640L028K800j130j060J136Q75j564J832O31J39
343648B889j190j310j229l53L793j29j06n08r42n61m47m67R76J523j057n01j869
344685a488J508K734j855j922r1J303q7P18j103p84J583j406J875j10j125L47
345662I7j320K33r98l98R42o47J905O77M08k21j421p99J576L66r43j549K51N75
$$ plain form
346760 -1266 7 231 10 411 527 718 856 1064 2415 1109 4168 6483 4823 2133 -554 1499
347737 1499 3457 3796 3548 -201 -1759 -2960 -4642 -2450 680 662 -1132 62 -658 -851 -112 768
348714 768 1017 1028 1856 -392 -1797 -1725 2678 1066 -1018 -2950 356 1123 -416 469 1772 874 629
349751 629 909 401 -797 -3174 46 1058 1261 1223 1272 2618 3861 4836 3521 3093 2138 413 673
350789 673 -454 -1754 -290 937 487 1131 1660 2670 2917 353 -620 -1040 -1650 -447 -881 -521 -184
351827 -184 1817 -826 -1293 -1788 -2141 -1687 -523 1708 2045 2123 877 48 1190 842 -330 -2299 -1171
352864 -1171 -1498 -1670 261 2487 5218 3976 1550 409 -773 -269 -1952 -2082 870 1634 725 515
353841 515 1987 3522 2832 1881 1081 2414 3074 3873 -55 -804 1200 -220 2321 3124 2527 2044 3349
$$ packed form
346760a266J273K24k21M01J16J91J38K08J351j306L059K315j660k690k687K053
347737A499J958L39k48l749j558j201j682K192L130j8j794J194p20j93P39Q80
348714G68K49J1Q28k248j405P2M403j612k084j932L306P67j539Q85J303q98k45
349751F29K80n08j198k377L220J012K03l8M9J346J243R75j315m28r55j725K60
350789F73j127j300J464J227m50O44N29J010K47k564r73m20o10J203m34L60L37
351827a84K001k643m67m95l53M54J164K231L37P8j246q29J142l48j172j969J128
352864a171l27j72J931K226K731j242k426j141j182N04j683j30K952P64r09k10
353841E15J472J535o90r51q00J333O60P99l928p49K004j420K541Q03n97m83J305
$$ plain form
354879 3349 2953 2575 1014 -613 1051 -211 -739 476 1739 3056 2962 -257 -2390 -1935 -173 -2150
355855 -2150 -1649 -1216 -568 1456 -242 -201 1520 -1393 -1786 -1451 -991 -2646 -3381 -3090 -2408 -1370 282
356893 282 781 1310 205 1268 1279 486 -883 1377 1735 -505 -1299 -1933 -2833 -2803 -193 662 -1986 -1150
357992 -1150 -3094 -2262 -2038 -2378 -2834 -1707 -339 2425 1298 -1059 -1281 -2301 -1650 -522 -885 -1096
358968 -1096 -1759 -1858 -40 -2326 -4000 -1889 82 580 2084 3080 1908 703 -1530 -3990 -4687 -5464
359945 -5464 -3709 -3644 -890 -209 -1103 -2521 -1026 -820 -1427 -1617 -3197 -4283 -7452 -5786 -3786 -2135
360922 -2135 -869 1245 1432 917 -74 -461 2374 4014 5938 4384 1148 950 1264 317 434 -1726
361898 -1726 -2067 250 1050 2081 778 1202 2079 757 -514 -126 -888 -1362 -201 2340 4316 3598
$$ packed form
354879C349l96l78j561j627J664j262n28J215J263J317r4l219k133M55J762j977
355855b150N01M33O48K024j698M1J721k913l93L35M60j655p35K91O82J038J652
356893B82M99N29j105J063J1p93j369K260L58k240p94o34r00L0K610Q55k648Q36
357992a150j944Q32K24l40m56J127J368K764j127k357k22j020O51J128l63k11
358968a096o63r9J818k286j674K111J971M98J504R96j172j205k233k460o97p77
359945e464J755O5K754O81q94j418J495K06o07j90j580j086l169J666K000J651
360922b135J266K114J87n15r91l87K835J640J924j554l236j98L14r47J17k160
361898a726l41K317Q00J031j303M24Q77j322j271L88p62m74J161K541J976p18
$$ plain form
362875 3598 2278 2843 3613 2103 501 -533 12 -1217 -103 730 3064 2392 28 -332 -1674 -3604
363851 -3604 -663 3019 1284 1014 1521 1890 2962 2901 2087 -211 671 2648 79 942 1778 1268 3230
364889 3230 3341 2603 1469 1372 3576 1740 940 -697 -972 2025 3132 1690 2069 3033 800 -1764
365866 -1764 -100 1713 137 -2188 -183 -278 -2543 -501 3816 4204 2224 634 711 1165 2446 3374
366842 3374 1747 68 1606 2157 933 -3006 -1677 -1795 -4932 -4306 -2460 -255 -1934 -2458 -325
367758 -325 -2397 -2576 -4120 -2722 -2681 -2889 -1193 -937 -913 227 117 696 1906 1244 1398 1236 1320 469
368857 469 120 -1679 -3620 -3251 -1917 373 2544 2439 685 -18 1059 3059 3691 3670 9 -43 -1213
369894 -1213 -1635 -527 488 604 -1065 -2139 1932 381 -1774 -2349 -969 1039 1735 2150 -60 182
$$ packed form
362875C598j320N65P70j510j602j034N45j229J114Q33K334o72k364l60j342j930
363851c604K941L682j735k70N07L69J072o1q14k298Q82J977k569Q63Q36n10J962
364889C230J11p38j134r7K204j836q00j637k75K997J107j442L79R64k233k564
365866a764J664J813j576k325K005r5k265K042M317L88j980j590P7M54J281R28
366842C374j627j679J538N51j224l939J329j18l137O26J846K205j679n24K133
367758c25k072j79j544J398M1k08J696K56K4J140j10N79J210o62J54j62Q4q51
368857D69l49j799j941L69J334K290K171j05j754p03J077K000O32k1l661n2j170
369894a213m22J108J015J16j669j074M071j551k155n75J380K008O96M15k210K42
$$ plain form
370871 182 -2757 -2899 -2374 -684 1528 2425 976 -1208 1089 1711 -616 -1153 -207 -991 -3290 -2906 -1317
371909 -1317 -213 297 285 791 2697 287 1502 132 -2162 -641 1296 1547 1528 872 -652 -653 -1246
372946 -1246 -2336 -2243 967 1026 908 2438 2086 -203 -628 145 1637 2468 2762 1725 2830 1074 835
373984 835 -524 -1478 559 -171 -1321 -1082 -210 1150 305 208 1495 984 1216 98 -2516 -1411 130
375022 130 1856 859 -184 -1315 -1418 -816 1331 962 -1173 -4061 -4482 -4579 -3220 -2149 18 2030
375998 2030 45 -383 1522 2586 1660 805 668 -1320 -2988 -4402 -4446 -3527 -1112 1196 100 492
376975 492 -707 -1429 1073 -50 268 -1670 -2482 -1023 -423 -975 -1547 -2371 -2084 -328 303 -679 -4324
378012 -4324 -3646 -2955 -2674 408 1100 -587 -434 -2249 -775 -748 -1797 -1818 -2430 -2628 -3625 -3385 -2457 -3033
$$ packed form
370871A82k939j42N25J690K212Q97j449k184K297O22k327n37R46p84k299L84J589
371909a317J104N10j2N06J906k410J215j370k294J521J937K51j9o56j524jn93
372946a246j090R3L210N9j18J530l52k289m25P73J492Q31K94j037J105j756k39
373984H35j359r54K037p30j150K39Q72J360q45r7J287n11K32j118k614J105J541
375022A30J726r97j043j131j03O02K147l69k135k888m21r7J359J071K167K012
375998B030j985m28J905J064r26q55j37j988j668j414m4R19K415K308j096L92
376975D92j199p22K502j123L18j938q12J459O00n52n72q24K87J756O31r82l645
378012d324O78O91K81L082O92j687J53j815J474K7j049k1o12j98r97K40R28n76
$$ plain form
379111 -3033 -2709 -4683 -5888 -6426 -6569 -4811 -2278 -2250 -1346 -659 2050 905 -456 -2412 -1609 -1161 -539
380149 -539 1893 558 59 -1363 -3754 -3000 310 -843 -1056 -3214 -3172 -987 1368 659 1376 2244 -150
381187 -150 -1343 -3123 -481 -1785 -3220 -1566 62 1090 896 1966 485 -2646 -3128 -1814 -1942
382102 -1942 -1612 -1983 -1058 -2798 -3332 -1734 1922 229 2048 2592 3689 2792 1478 2770 1380 -2314
383079 -2314 -2574 -3751 -4681 -3912 -1903 841 2235 3073 341 -249 -1323 -623 1503 2253 1927 3943
384055 3943 3410 2836 3299 23 -1213 -1782 -2411 -137 -368 125 942 -451 -758 1173 1717 2209 563
385093 563 -1009 -730 575 1634 308 -617 -1906 525 2808 2379 323 3306 4461 3174 1298
386009 1298 2471 809 1080 1876 1232 1437 2259 1730 39 3004 1611 -1714 -1374 479 425 690 1715
$$ packed form
379111c033L24j974j205n38j43J758K533K8R04O87K709j145j361j956Q03M48O22
380149e39K432j335m99j422k391P54L310j153k13k158M2K185K355p09P17Q68k394
381187a50j193j780K642j304j435J654J628J028j94J070j481l131m82J314j28
382102a942L30l71R25j740n34J598L656j693J819N44J097q97j314J292j390l694
383079b314k60j177r30P69K009K744J394Q38k732n90j074P00K126P50l26K016
384055C943n33n74M63l276j236n69o29K274k31M93Q17j393l07J931N44M92j646
385093E63j572K79J305J059j326r25j289K431K283m29k056K983J155j287j876
386009A298J173j662K71P96o44K05Q22n29j691K965j393l325L40J853n4K65J025
$$ plain form
387046 1715 647 447 -210 -328 -539 -1762 -24 1929 555 -2075 390 115 1238 856 -253 1660
388023 1660 4128 2240 -180 396 -1867 -388 554 2254 1749 4248 3854 3881 4627 4068 1147 -1166
388999 -1166 -1648 -836 -606 375 1036 1533 -468 605 -395 301 2068 2067 1898 1485 2494 -485 -1216 387
390098 387 -1144 155 1737 2138 2329 2240 -550 672 979 64 696 723 1138 610 406 -2460 -1830 -1095
391197 -1095 52 133 3037 4068 3366 3853 1933 2629 3200 826 1224 107 781 1470 1277 722 1186
392235 1186 2784 2275 1961 925 2461 3084 2694 2520 5111 3979 1378 -2903 -837 944 1803 3213
393211 3213 728 -1470 -1822 -2342 -2070 -1558 -545 1567 3112 3151 -2 -1787 -358 1139 579 1512
394188 1512 -916 -250 1877 1273 721 519 151 -1719 -4349 -3426 -4689 -3969 -1730 1587 3170 5498
$$ packed form
387046A715j068k00o57j18k11j223J738J953j374k630K465k75J123l82j109J913
388023A660K468j888k420N76k263J479R42J700n05K499l94K7P46n59k921k313
388999a166m82Q12K30R81O61M97k001J073j000O96J767jj69m13J009k979p31J603
390098C87j531J299J582M01J91q9k790J222L07r15O32K7M15n28k04k866O30P35
391197a095J147Q1K904J031p02M87j920O96N71k374L98j117O74O89j93n55M64
392235A186J598n09l14j036J536O23l90j74K591j132k601m281K066J781Q59J410
393211C213k485k198l52n20K72N12J013K112J545L9l153j785J429J497n60R33
394188A512k428O66K127o04n52k02l68j870k630R23j263P20K239L317J583K328
$$ plain form
395164 5498 4855 3131 2295 370 -459 -1501 -1009 -1196 -838 252 253 -2516 -2807 -2815 -2443 -1658 -1550 81
396263 81 -446 8 -798 -1817 -1246 1933 3081 2370 294 769 2450 92 -2574 -680 -625 1398 2247
397301 2247 1746 197 92 -914 -35 -1854 -2207 -1620 -2193 -3191 -2489 -512 -1952 -5255 -5100 -3224 -898
398338 -898 1213 -601 -2361 -2449 -1877 -413 -204 1179 3525 2235 2286 1745 -273 211 247 1258 1516
399376 1516 1540 -554 -1437 -616 722 -1439 -976 766 2126 2903 1098 -716 -968 657 2389 1752
400352 1752 1449 -378 -102 1562 807 1219 2111 1254 -1263 -3293 -2432 -515 1675 3772 2928 2478 2255
401390 2255 1861 1114 -2096 -5202 -3115 -1559 -469 -589 -702 136 -639 142 31 -726 1714 1606 -1116
402428 -1116 -2020 -828 -2311 -540 -16 57 2021 -959 -1042 -477 1180 837 135 625 1122 -422 -541
$$ packed form
395164E498o43j724q36j925q29j042M92j87L58J090Jk769k91qL72P85J08J631
396263H1n27M54q06j019N71L179J148p11k076M75J681k358k666J894N5K023Q49
397301B247n01j549j05j006Q79j819l53N87n73r98P02J977j440l303J55J876K326
398338h98K111j814j760q8N72J464K09J383K346j290N1n41k018M84L6J011K58
399376A516K4k094q83Q21J338k161M63J742J360P77j805j814k52J625J732o37
400352A752l03j827K76J664p55M12Q92q57k517k030Q61J917K190K097q44m50k23
401390B255l94p47l210l106K087J556J090j20j13Q38p75P81j11p57K440j08k722
402428a116r04J192j483J771N24P3J964k980q3N65J657l43p02M90M97j544j19
$$ plain form
403466 -541 -1013 -156 195 2678 1276 -123 507 1484 2650 1621 1378 166 -721 -1069 -1297 -969 -560
404503 -560 -641 -897 788 1122 1247 255 603 1209 -181 -1668 -2689 -2816 -2206 -1743 -1306 -180 -3163 -2329
405602 -2329 -2809 -2806 -998 63 829 -663 -129 445 1188 1596 882 2218 1561 1573 2085 2116 -62 -1827
406701 -1827 -266 400 278 465 171 -1556 -72 282 -621 -904 -617 -1503 -1294 -3252 -2423 -3166 -2701 -2594
407799 -2594 -895 3765 3077 1961 3536 2331 1513 3145 812 -1265 -4493 -4283 -4572 -4414 -4808 -4050
408776 -4050 -2313 -369 335 1170 632 -428 -1128 855 -132 305 3683 4977 4706 385 557 195 -980
409814 -980 764 1821 -740 -1319 -325 852 -59 -1377 -1596 -963 -69 1287 -1395 855 2083 1754
410790 1754 1346 -2141 -3335 438 2121 531 -1329 919 2756 2070 4063 1624 -276 -2003 -3271
$$ packed form
403466e41m72Q57L51K483j402j399O30R77J166j029k43j212q87l48k28L28M09
404503e60q1k56J685L34J25r92L48O06j390j487j021j27O10M63M37J126k983Q34
405602b329m80LJ808J061P66j492N34N74P43M08p14J336o57J2N12L1k178j765
406701a827J561O66j22J87k94j727J484L54r03k83K87q86K09j958Q29p43M65J07
407799b594J699M660o88j116J575j205q18J632k333k077l228K10k89J58l94P58
408776d050J737J944P04Q35n38j060p00J983r87M37L378J294k71m321J72l62j175
409814i80J744J057k561n79R94J177r11j318k19O33Q94J356k682K250J228l29
410790A754m08l487j194L773J683j590j860K248J837o86J993k439j900j727j268
$$ plain form
411706 -3271 -1792 -1992 -2196 128 -427 -234 1759 3624 2681 2240 510 1356 542 -178 229 -2027 -1224
412744 -1224 1595 2717 2124 3140 3636 1301 -1119 -1212 -982 -1139 -2069 -786 1729 2005 650 1278 194
413781 194 406 -293 -65 -694 28 -1341 -73 -1590 1082 3299 2705 902 3384 3512 6378 8552
414758 8552 7504 5084 2546 2840 2717 2769 3860 4572 1091 530 917 2218 3269 3487 3446 -549 582
415795 582 2432 -1003 -529 188 -617 390 504 1935 1653 358 -2628 -2568 -568 -1100 1592 3250 3821
416833 3821 3606 2457 841 372 2618 2436 2467 2861 -1210 -2043 -1917 142 389 502 1855 3053 3370
417871 3370 4149 5297 4034 1160 481 570 -1636 910 966 3342 5080 2233 713 -191 630 485 1022
418909 1022 449 1672 265 1261 -951 -2067 -2768 -2648 -358 2349 2782 1917 -105 -1222 -2843 -2541
$$ packed form
411706c271J479k00k04K324n55J93J993J865r43m41j730Q46q14p20M07k256Q03
412744a224K819J122n93J016M96k335k420r3K30j57r30J283K515K76j355O28j084
413781A94K12o99K28o29P22j369J268j517K672K217n94j803K482J28K866K174
414758H552j048k420k538K94j23N2J091P12l481n61L87J301J051K18m1l995J131
415795E82J850l435M74P17q05J007J14J431k82j295k986O0K000n32K692J658N71
416833C821k15j149j616m69K246j82L1L94m071q33J26K059K47J13J353J198L17
417871C370P79J148j263k874o79Q9k206K546N6K376J738k847j520r04Q21j45N37
418909A022n73J223j407R96k212j116p01J20K290K707M33q65k022j117j621L02
$$ plain form
419885 -2541 -635 -1244 -591 -790 -55 1427 1276 2730 1929 1404 3851 2512 755 -15 -2336 -271
420862 -271 1165 1973 1617 222 1097 707 1551 1970 2660 1884 140 473 132 395 807 1312 -313 -3090
421960 -3090 -743 1531 1496 -588 543 -1520 -1682 631 -128 -1927 -3104 -2049 -2201 -2157 -2150 -1685 -1343
422998 -1343 -1258 -497 1940 43 -3193 -3355 -4238 -2806 -499 -472 -1695 -2986 -3468 -1801 -2304 -621 1405
424036 1405 -285 1646 2184 2348 2533 3493 933 594 143 -2529 -2987 -1995 -108 1047 -902 1280
425013 1280 1535 325 977 9 908 1697 2223 1492 614 3763 4368 2107 908 -1172 787 -908 -2080
426050 -2080 -2445 -554 185 5 -688 -576 -1838 -3462 -4090 -1479 -3129 -3156 1100 4165 6269 5093
427027 5093 1639 678 1442 -746 -2390 -1297 -1089 -1484 -206 2270 2252 638 1969 443 836 687
$$ packed form
419885b541J906o09O53j99P35J482j51J454q01n25K447j339j757p70k321K065
420862b71J436Q08l56j395Q75l90Q44M19O90p76j744L33l41K63M12N05j625k777
421960c090K347K274l5k084J131k063j62K313p59j799j177J055j52M4PM65L42
422998a343Q5P61K437j897l236j62q83J432K307K7j223j291m82J667n03J683K026
424036A405j690J931N38J64J85R60k560l39m51k672m58R92J887J155j949K182
425013A280K55j210O52r68Q99P89N26p31q78L149O05k261j199k080J959j695j172
426050b080l65J891P39j80o93J12j262j624o28K611j650k7M256L065K104j176
427027E093l454r61P64k188j644J093K08l95J278K476j8j614J331j526L93j49
$$ plain form
428003 687 520 -2931 -2698 -2729 -1325 -2112 -3894 -1807 -1050 -403 234 117 1311 1801 2270 1368 939 406
429102 406 478 1400 2105 2946 1318 2405 3224 974 1034 1158 1818 -319 -152 802 1889 799 860 280
430201 280 -1014 -2519 -2187 -160 -901 -438 673 -854 -3173 -2154 -905 -697 -1144 -609 -1055 1699
431177 1699 2582 2611 2251 2531 1614 2984 3460 5437 4352 1814 -1217 -1115 -4306 -7427 -6418 -2122
432154 -2122 2478 1271 483 974 751 608 -1665 -1676 79 -256 656 -1085 -855 1305 1545 1105 888
433191 888 672 -998 -1100 658 2624 2653 2230 69 -1382 -1303 -600 115 -948 -1690 -897 1118 -84
434229 -84 298 495 1000 1793 2465 3590 4213 4267 1727 835 529 1551 -263 1088 1936 1297 1639 3293
435328 3293 3327 2332 2247 1335 2274 1129 -4261 -3784 -2015 -3161 -2080 -1632 873 484 -2142 -3630 -1953
$$ packed form
428003F87j67l451K33l1J404p87j782K087P57O47O37j17J194M90M69r02m29n33
429102D06P2R22P05Q41j628J087Q19k250O0J24O60k137J67R54J087j090O1n80
430201B80j294j505L32K027p41M63J111j527k319J019J249K08m47N35m46K754
431177A699Q83K9l60K80r17J370M76J977j085k538l031J02l191l121J009M296
432154b122M600j207p88M91k23j43k273j1J755l35R12j741K30K160K40m40k17
433191H88k16j670j02J758J966K9m23k161j451P9P03P15j063p42P93K015j202
434229h4L82J97N05P93O72J125O23N4k540q92l06J022j814J351Q48o39L42J654
435328C293L4r95q5r12R39j145n390M77J769j146J081M48K505l89k626j488J677
$$ plain form
436366 -1953 1174 2077 2364 135 -940 -2035 -1509 -2811 -3457 -2225 -441 -2578 -1501 -669 582 1951
437342 1951 -8 -877 -5260 -5419 -5222 -2240 205 -754 -2841 -526 -140 -454 1635 3154 2192 824
438319 824 1630 4173 1778 -689 211 -239 1183 -671 -1166 -3821 -2677 -1646 -3008 -3797 -736 -20
439295 -20 -478 207 1307 2515 40 -1571 -2140 -1468 -987 -2074 -3165 -4050 -903 814 124 -3002 -879
440333 -879 -1925 -4229 -3760 -4036 -4137 -4674 -3651 -914 3327 4667 2659 919 2179 3107 2644 1017
441310 1017 -181 1472 518 -1448 -2213 -870 917 508 1755 2858 1608 -38 1680 -946 -2820
442225 -2820 -606 -523 -2075 -1889 -1568 -1662 -932 -2069 -3221 -3046 -4188 -1242 2557 -236 160 -1548 -2370
443263 -2370 -1086 947 1341 1095 757 89 824 922 2390 879 120 1277 2174 2000 2538 1590 3157
$$ packed form
436366a953L127R03K87k229j075j095N26j302o46J232J784k137J077Q32J251J369
437342A951j959q69m383j59J97K982K445r59k087K315L86l14K089J519r62j368
438319H24Q06K543k395k467R00m50J422j854m95k655J144J031j362p89L061P16
439295b0m58O85J100J208k475j611n69O72M81j087j091q85L147J717o90l126K123
440333h79j046k304M69k76j01n37J023K737M241J340k008j740J260R28m63j627
441310A017j198J653r54j966p65J343J787m09J247J103j250j646J718k626j874
442225b820K214Q3j552J86L21r4P30j137j152J75j142K946L799k793L96j708q22
443263b370J284K033L94k46l38o68P35R8J468j511p59J157Q97j74N38r48J567
$$ plain form
444301 3157 2555 1763 260 -371 420 -935 -2054 -19 2199 2909 1098 2167 3070 3916 1497 -591
445277 -591 -1013 -848 752 2621 1560 -610 -428 1692 1044 1255 918 434 80 -1276 -1761 -380 1271
446315 1271 2890 1294 891 2349 4116 3153 3060 2042 163 614 2285 1124 822 849 1139 1527 477
447353 477 88 2178 1401 189 -19 -15 -2835 -3915 -2714 -3215 -1307 -571 851 587 965 -967 -2281
448390 -2281 -2457 -3954 -1864 -1619 998 1674 2958 2863 1739 2928 5083 4359 4882 6342 6356 3551 387
449428 387 -22 -1454 -1668 -1031 -229 -204 -1522 -1188 -362 -464 -59 754 723 -1181 -2174 -62 2810 1948
450527 1948 1921 273 -423 -1387 -2251 1496 757 -178 -63 609 428 -780 -1417 975 2167 -275 -1492
451564 -1492 -2773 -3320 -1909 -1129 -1250 -1675 -3342 -459 143 -763 -2080 -1234 -223 -342 -69 1152 2444
$$ packed form
444301C157o02p92j503o31P91j355j119K035K218P10j811J069R03Q46k419k088
445277e91m22J65J600J869j061k170J82K120o48K11l37m84l54j356m85J381J651
446315A271J619j596m03J458J767r63r3j018j879M51J671j161l02K7K90L88j050
447353D77l89K090p77j212k08Mk820j080J201n01J908P36J422k64L78j932j314
448390b281j76j497K090K45K617O76J284r5j124J189K155p24N23J460J4k805l164
449428C87m09j432k14O37Q02K5j318L34Q26j02M05Q13l1j904r93K112K872q62
450527A948k7j648o96r64q64L747p39r35J15O72j81j208o37K392J192k442j217
451564a492j281n47J411P80j21m25j667K883O02r06j317Q46J011j19K73J221J292
$$ plain form
452602 2444 850 2606 3569 1724 661 2773 -105 -1215 928 -79 1257 214 -654 3086 3727
453517 3727 4758 4124 3576 20 -1457 -1905 -1524 145 2340 649 -438 -748 -998 -2316 118 1546
454494 1546 -58 688 -2017 -423 -634 -2412 -4204 -1595 844 3283 466 -2216 -895 -1038 1355
455410 1355 2450 460 -2480 -439 1043 105 -948 1378 1943 1791 -892 -1148 -417 -334 -2089 -2016 -1057
456447 -1057 -113 1210 -368 2206 2848 182 -2861 -1877 -2040 -2182 -668 1342 33 -213 -778 46
457424 46 3416 2612 745 -1217 -2025 356 1191 2074 2082 4546 1878 -25 -101 -1803 -722 275 -1591
458462 -1591 -449 190 890 821 173 -411 -2223 -1199 347 -1674 -3620 -1708 -137 -934 -1932 563
459438 563 3069 2186 1832 -872 -804 1115 2197 -359 -1414 -1815 -1569 -265 707 -1866 -2720 -2913 -1821
$$ packed form
452602B444j594J756R63j845j063K112k878j110K143j007J336j043q68L740O41
453517C727J031o34n48l556j477m48L81J669K195j691j087l10k50j318K434J428
454494A546j604P46k705J594k11j778j792K609K439K439k817k682J321j43K393
455410A355J095j990k940K041J482r38j053K326N65j52k683k56P31Q3j755P3R59
456447a057R44J323j578K574O42k666l043R84j63j42J514K010j309k46n65Q24
457424D6L370q04j867j962q08K381Q35Q83QK464k668j903p6j702J081R97j866
458462a591J142O39P00o9o48n84j812J024J546k021j946J912J571p97r98K495
459438E63K506q83l54k704O8J919J082k556j055m01K46J304R72k573q54j93J092
$$ plain form
460476 -1821 -3650 -5877 -2077 217 1985 4629 3278 1414 1221 -427 -646 -776 -2476 -3912 -2463
461391 -2463 -1498 -1501 -1724 753 3453 2090 -409 -194 409 -1838 -1949 -1088 -2117 -1311 1016 -816 -560
462429 -560 -819 -324 2891 1061 -225 -613 102 -1673 -408 163 1898 2232 2712 397 -153 -84 -1103
463467 -1103 3883 4123 730 360 142 236 -39 1797 364 -1462 349 1419 -1555 -2716 -219 -600
464443 -600 67 -481 -1456 -827 905 2731 3154 3584 3944 5244 5029 964 528 404 1572 2164 3631
465481 3631 4438 3289 1383 1617 257 -85 -440 195 525 -646 -398 -813 977 4745 3754 3435 1666
466519 1666 1535 2099 -2127 -1224 65 756 3125 672 -1493 -561 -909 -392 1223 1201 1312 2739 918
467556 918 790 -29 -1300 -1570 -1826 482 1467 2296 -240 -1206 -2256 -3263 -4723 -3851 -3808 -4337 -3330
$$ packed form
460476a821j829k227L800K294J768K644j351j864j93j648k19j30j700j436J449
461391b463R65lk23K477K700j363k499K15O03k247j11Q61j029Q06K327j832K56
462429e60k59M95L215j830j286l88P15j775J265N71J735L34M80k315n50O9j019
463467a103M986K40l393l70k18R4k75J836j433j826J811J070k974j161K497l81
464443f00O67n48r75O29J732J826M23M30L60J300k15m065m36j24J168N92J467
465481C631Q07j149j906K34j360l42l55O35L30j171K48m15J790L768r91l19j769
466519A666j31N64m226R03J289O91K369k453k165R32l48N17J615k2J11J427j821
467556I18j28q19j271k70k56K308R85Q29k536r66j050j007j460Q72M3n29J007
$$ plain form
468594 -3330 -1762 941 1793 -277 -2591 -3058 -1826 -1892 -631 477 1732 1733 943 2362 819 1491 -226
469632 -226 -2113 -2974 -513 1416 1994 2825 5150 4548 2470 -663 -475 -438 -3497 -5159 -146 -518 -3953
470669 -3953 -5314 -3857 -3774 -1826 -1438 699 1327 -137 -232 1657 585 -1123 -1562 -3739 -2118 -1181
471646 -1181 -973 -3148 -2191 -1182 -987 -774 2021 2079 952 242 1589 1211 -249 12 473 1464 813
472684 813 -445 -343 -2342 -3191 90 -481 -3053 -1662 -2183 -2067 -2277 -417 -217 -383 -943 399 -1580
473721 -1580 -3416 -6636 -6176 -6011 -4613 -2754 1541 2129 1055 146 -1657 -3379 -2285 1738 2417 685
474698 685 100 -1143 -2902 -3695 -2835 -1425 -3540 -2454 963 -475 554 1492 -232 -2536 -1622 1244
475675 1244 -674 -1376 -1774 -1033 -322 -172 1413 709 4386 4770 4213 1734 1666 1682 -27 -461 -146 -591
$$ packed form
468594c330J568K703Q52k070k314m67J232o6J261J108J255Jp90J419j543O72j717
469632b26j887q61K461J929N78Q31K325o02k078l133J88L7l059j662N013l72l435
470669c953j361J457Q3J948L88K137O28j464r5J889j072j708m39k177J621R37
471646a181K08k175R57J009J95K13K795N8j127p10J347l78j460K61M61R91o51
472684H13j258J02j999q49L281n71k572J391n21J16k10J860K00j66n60J342j979
473721a580j836l220M60J65J398J859M295N88j074r09j803j722J094M023O79j732
474698F85n85j243j759p93Q60J410k115J086L417j438J029R38j724k304R14K866
475675A244j918p02l98P41P11J50J585p04L677L84n57k479o8J6j709m34L15m45
$$ plain form
476773 -591 -1038 -1217 -2544 -2864 -2727 -2572 -855 378 1282 -1573 -2365 -1406 -1903 -708 -478 -1808 -654
477811 -654 835 29 -1981 -482 1622 3003 3843 2951 2907 -750 -346 604 -140 -1196 1025 637 -1417
478849 -1417 -1542 -2241 -1600 694 1744 746 -120 -2941 -1900 -3118 -1804 -2208 -1043 -1847 -3999 -2311
479825 -2311 -3995 -2944 -1717 627 1321 1311 1507 1272 -694 -356 921 188 -2321 -3168 -4811 -2127
480802 -2127 -1533 -660 2046 4310 1772 628 1237 1510 1412 960 -1032 -2702 -2663 -4025 -4355 -3642 -2516
481839 -2516 -870 -1683 -2711 -2711 -3278 -2866 -2084 -2224 -134 -334 -2576 -3125 -1934 -524 36 -442 -530 -1454
482938 -1454 -3937 -5514 -3552 -2170 -885 -2141 -2855 -2484 -965 744 -305 -1089 -1042 145 430 403
483915 403 2905 1528 909 -141 1781 2886 5922 3852 1552 2037 1837 1797 -133 180 4906 3211
$$ packed form
476773e91m47j79j327l20J37J55J717J233R04k855p92R59m97J195K30j330J154
477811f54J489q06k010J499K104J381Q40q92m4l657M04R50p44j056K221l88k054
478849a417j25o99O41K294J050r98q66k821J041j218J314m04J165q04k152J688
479825b311j684J051J227K344O94j0J96k35j966L38J277p33k509q47j643K684
480802b127N94Q73K706K264k538j144O09K73r8m52j992j670L9j362l30P13J126
481839b516J646q13j028%n67M12P82j40K090k00k242n49J191J410N60m78q8r24
482938a454k483j577J962J382J285j256p14L71J519J709j049p84M7J187K85k7
483915D03K502j377o19j050J922J105L036k070k300M85k00m0j930L13M726j695
$$ plain form
484892 3211 1568 -1555 -2697 1033 1961 801 2463 3340 2405 215 2307 1001 -1456 -516 -340 -1988
485868 -1988 -2538 -2463 -1812 59 1082 249 1267 951 -45 158 280 -627 -3583 -4141 -2172 -558 -1032
486906 -1032 102 2325 2024 2719 -640 -2344 -1160 -955 -1763 -4173 -5066 -3058 -6 44 -2260 -3053
487882 -3053 112 1868 1435 658 -587 741 2486 4596 3451 901 -1284 -2935 -3057 -2780 -1855 -164
488859 -164 -234 194 -2605 -2837 -1057 -426 1399 709 2017 3629 -27 -2569 -1586 -2275 -1198 -1513 246
489897 246 3101 2011 342 1376 3217 2099 -1128 -1815 781 -419 466 1018 563 194 129 34 1726
490934 1726 2652 5425 3202 -285 -328 -3 1764 4570 3530 2065 1110 2741 1846 -499 -912 36
491911 36 789 2930 2365 1886 1502 736 1693 47 325 1675 -348 -1457 -211 -1039 1526 2210 1201
$$ packed form
484892C211j643l123j142L730R28j160J662Q77r35k190K092j306k457R40J76j648
485868a988n50P5O51J871J023q33J018l16r96K03J22r07k956n58J969J614m74
486906a032J134K223l01O95l359j704J184K05q08k410q93K008L052N0k304p93
487882c053L165J756m33p77j245J328J745K110j145k550k185j651j22K77R25J691
488859a64p0M28k799k32J780O31J825o90J308J612l656k542R83o89J077l15J759
489897B46K855j090j669J034J841j118l227o87K596j200Q85N52m55l69o5r5J692
490934A726R26K773k223l487m3L25J767K806j040j465r55J631q95k345m13R48
491911C6P53K141n65m79l84p66R57j646K78J350k023j109J246q28K565O84j009
$$ plain form
492948 1201 1725 1873 2666 4006 2023 432 -2200 -2155 -694 -1664 -2816 -1326 -1825 -578 -987 -696 506
493986 506 -2466 -3132 -2769 -3740 -2447 890 1219 1041 114 275 2809 2351 -481 -3614 -4024 -3732 -2668
495024 -2668 -330 1946 640 -1801 -2724 -2779 186 -266 -121 2146 986 1993 1904 -862 -3549 -279
496000 -279 -1449 -233 151 -491 -109 337 508 -2733 -2354 -2311 -3444 -2946 -2210 -3215 -3037 -1111 175
497038 175 -731 -1843 -2078 -53 -773 -2325 -1644 450 3041 3246 2865 2877 3198 558 -81 1950 2452
498076 2452 3394 3774 4179 2495 -137 -694 -116 1467 772 -867 708 -2478 -411 200 1480 1684
499052 1684 3290 3845 5195 3817 27 1029 1285 1685 1995 -1166 -4425 -3548 -1881 -2493 -2088 687
500029 687 3164 866 -700 890 670 -80 -478 -458 1727 4839 4956 2778 54 -142 -750 -850 2723
$$ packed form
492948A201N24J48P93J340j983j591k632M5J461r70j152J490m99J247m09K91J202
493986E06k972o66L63r71J293L337L29j78r27J61K534m58k832l133m10K92J064
495024b668K338K276j306k441r23n5K965m52J45K267j160J007q9k766k687L270
496000b79j170J216L84o42L82M46J71l241L79M3j133M98P36j005J78J926J286
497038A75r06j112k35K025p20j552O81K094K591K05l81J2L21k640o39K031N02
498076B452R42L80M05j684k632n57N78J583o95j639J575l186K067O11J280K04
499052A684J606N55J350j378l790J002K56M00L10l161l259Q77J667o12M05K775
500029F87K477k298j566J590k20p50l98K0K185L112J17k178k724j96o08j00L573
$$ plain form
501067 2723 4814 3913 2902 2205 1404 528 1631 3717 1153 897 3450 1522 -1039 -1150 -2944 -674
502043 -674 311 1569 1337 1566 1628 1671 -2079 -4314 -1058 1781 2375 1559 2260 673 68 -18 1028 396
503142 396 377 3172 62 -3108 -3695 -1979 -372 66 -1182 -1304 -2149 287 1791 -827 -1131 105
504119 105 981 -61 666 949 2948 1139 855 2963 1248 -524 8 1544 1547 675 1618 261 -835
505156 -835 -777 -1546 744 1087 955 -771 -2494 -1680 -943 -343 78 2248 991 -1414 149 1628 1815
506194 1815 108 -2863 -1505 -107 1957 3966 4468 480 -1737 -1112 890 3244 3938 3375 2741 4638
507171 4638 4782 4583 2307 248 345 -290 -328 -439 -1197 101 1537 2734 4266 652 -3707 -3735 -694
508208 -694 -1545 -736 1166 1971 1145 1763 3016 888 611 2319 2300 2002 1292 1241 1546 1380 699 1597 1841
$$ packed form
501067B723K091r01j011o97q01q76J103K086k564k56K553j928k561j11j794K270
502043f74R85J258k32K29O2M3l750k235L256K839N94q16P01j587o05q6J046o32
503142C96j9K795l110l170n87J716J607M38j248j22q45K436J504k618l04J236
504119A05Q76j042P27K83J999j809k84K108j715j772N32J536Lq72R43j357j096
505156h35N8p69K290L43j32j726j723Q14P37O00M21K170j257k405J563J479J87
506194A815j707k971J358J398K064K009N02l988k217O25K002K354O94n63o34J897
507171D638J44j99k276k059R7o35l8j11p58J298J436J197J532l614m359k8L041
508208f94q51Q09J902Q05q26O18J253k128k77J708j9k98p10n1L05j66o81Q98K44
$$ plain form
509368 1841 254 -1548 -194 -2673 -2429 -2083 -1068 42 -631 -198 954 900 1144 103 2315 1515
510345 1515 844 1348 2502 375 1029 2104 1710 1980 -522 -1509 627 4535 4542 3096 1806 1954 2146
511382 2146 236 -834 3244 5181 6062 4877 3646 1227 916 -150 -649 257 1353 2189 4893 4098
512359 4098 -336 -564 -2267 -2727 -4336 -4223 -3491 254 271 -301 -898 378 2650 2642 2652 2531 1894 2003
513458 2003 -1082 267 -276 -117 -1664 -997 655 2297 154 -1934 -750 376 1756 1267 -1636
514373 -1636 -2735 -1644 -2590 -1591 -743 496 -474 -684 2399 1873 -415 -713 -2215 -2645 -2897 -3048 -337
515411 -337 189 -784 -893 346 2185 394 627 -363 -195 -1049 -1464 -3319 -3225 -871 982 2227 541
516449 541 -2571 -1804 -602 -121 -789 -1312 1269 -441 -2446 -1566 -1471 -174 -1995 -3549 -2739 -2335 -2870
$$ packed form
509368A841j587j802J354k479K44L46J015J110o73M33J152n4K44j041K212q00
510345A515o71N04J154k127O54J075l94K70k502r87K136L908Pj446j290J48J92
511382B146j910j070M078J937Q81j185j231k419l11j066m99R06J096Q36K704p95
512359D098m434k28j703m60j609J13P32L745J7n72n97J276K272qJ0j21o37J09
513458B003l085J349n43J59j547O67J652J642k143k088J184J126J380m89k903
514373a636j099J091r46R99Q48J239r70k10L083n26k288k98j502m30k52j51K711
515411c37N26r73j09J239J839j791K33r90J68q54m15j855R4K354J853J245j686
516449E41l112P67J202M81o68n23K581j710k005Q80R5J297j821j554Q10M04n35
$$ plain form
517486 -2870 -574 -2842 -1136 -764 172 -631 -1422 -1373 -2739 -3899 -5613 -3913 -3224 -225 488 539 -100
518524 -100 -2537 -1328 -2524 -1793 -768 -709 -680 279 -464 -1449 -3254 -3365 -4128 -4402 -2273 -1670 -1972 -1418
519623 -1418 -1298 -258 1788 965 -1247 487 1324 879 2436 1053 309 -1494 -3466 -3346 -1903 35
520599 35 -1490 -400 2140 3800 2404 -262 609 2803 2727 1052 1132 2710 3648 2788 -267 -636 526
521637 526 1350 -423 -1974 -326 1281 1643 2432 2030 2709 3044 3189 2842 1928 1231 110 -697 2948
522675 2948 3246 1774 1135 3080 1041 -1291 -2160 -2529 -1979 -1361 666 93 -2046 -3363 -3444 -276 115
523712 115 3732 2669 -507 -1088 173 1546 1862 2571 1753 -2365 -3867 -3882 -608 -115 355 -737 -577
524750 -577 -2045 -3345 -1815 1199 1859 4039 1271 1140 2108 501 -524 742 2227 2076 2031 3324
$$ packed form
517486b870K296k268J706L72R36q03p91M9j366j160j714J700O89K999P13N1o39
518524a00k437J209j196P31J025N9K9R59p43r85j805j11p63k74K129O03l02N54
519623a418J20J040K046q23k212J734Q37m45J557j383p44j803j972J20J443J938
520599C5j525J090K540J660j396k666Q71K194p6j675Q0J578R38q60l055l69J162
521637E26Q24j773j551J648J607L62P89m02O79L35J45l47r14o97j121q07L645
522675B948K98j472o39J945k039k332q69l69N50O18K027n73k139j317q1L168L91
523712A15L617j063l176n81J261J373L16P09q18m118j502j5L274M93M70j092J60
524750e77j468j300J530L014O60K180k768j31R68j607j025J266J485j51m5J293
$$ plain form
525726 3324 1380 1157 2017 1360 1496 606 3368 3121 711 51 831 849 2929 2563 1519 796 -1248
526764 -1248 -708 1695 938 259 591 -2090 -4787 -3890 -3841 -899 -1016 -654 695 725 -1285 -2451 -3275
527802 -3275 -2666 -2939 -1517 -1785 -2929 -4104 -1610 1477 1702 364 -1939 -3041 -4100 -4363 -1975 -1742
528778 -1742 -439 -1010 -3917 -2189 732 -78 -1112 -944 -1550 -3402 -2344 -1159 102 -1576 -620 2275
529755 2275 2782 2273 544 1410 2644 -231 -1034 -1488 -994 2714 696 -2746 -2320 -1705 -2128 -1094 -2326
530793 -2326 -2165 -794 -790 -393 -1362 -846 1741 2856 4 -4428 -3005 122 326 2258 1492 645 -267
531830 -267 64 -1491 -830 -1848 -1244 -1797 -1907 -936 -1337 -331 1024 5258 6499 4418 4365 5479 6494
532868 6494 2941 2876 2147 -433 -1470 -1702 -567 -794 -328 -690 628 -1706 -4680 -4495 -2980 -4396
$$ packed form
525726C324j944k23Q60o57J36q90K762k47k410o60P80J8K080l66j044p23k044
526764a248N40K403p57o79L32k681k697Q97M9K942j17L62J349L0k010j166q24
527802c275O09k73J422k68j144j175K494L087K25j338k303j102j059k63K388K33
528778a742J303n71k907J728K921q10j034J68o06j852J058J185J261j678R56K895
529755B275N07n09j729Q66J234k875q03m54M94L708k018l442M26O15m23J034j232
530793b326J61J371ML97r69N16K587J115k852m432J423L127K04J932p66q47r12
531830b67L31j555O61j018O04n53j10R71m01J006J355M234J241k081n3J114J015
532868F494l553o5p29k580j037k32J135k27M66l62J318k334k974J85J515j416
$$ plain form
533845 -4396 -753 2107 103 -794 -1344 -806 -586 -2153 -802 -283 888 1863 3728 2788 724 -310
534821 -310 1952 1829 2923 1979 1917 499 90 530 118 3024 2472 3225 2483 926 -1506 -1313 -526 122
535920 122 100 346 -1515 713 733 -958 912 2713 3444 3196 4240 4961 3671 3415 3541 3288 1934
536958 1934 -545 -884 -947 2112 2534 1892 1919 2681 2798 2908 2413 1868 2565 2439 1940 1329 2138 1257 936
538117 936 1479 -62 -3238 -3028 -1050 563 1066 1228 -1635 -3073 -1104 1927 -193 -1101 -441 467
539094 467 387 -2044 543 885 1060 3167 2016 -3956 -4270 -4272 -939 -313 -1110 -1305 -210 292 -1257 -1715
540193 -1715 -1201 -61 -1507 -2646 -3343 -1444 -900 -983 -1041 -1736 -2842 -1484 230 -329 -2405 -3711 -4371
541230 -4371 -4275 -2720 -1974 -1413 -2215 -1914 -4402 -3983 -3334 -2695 -4117 -2706 63 2400 2436 2136 4989
$$ packed form
533845d396L643K860k004q97n50N38K20j567J351N19J171R75J865r40k064j034
534821c10K262j23J094r44o2j418m09M40m12K906n52P53p42j557k432J93P87O48
535920A22k2K46j861K228K0j691J870J801P31k48J044P21j290k56J26k53j354
536958A934k479l39o3L059M22o42K7P62J17J10m95n45O97j26m99o11Q09q81l21
538117I36N43j541l176K10J978J613N03J62k863j438J969L031k120r08O60R08
539094D67q0k431K587L42J75K107j151n972l14kL333O26p97j95J095N02j549m58
540193a715N14J140j446j139o97J899N44q3n8o95j106J358J714n59k076j306o60
541230d371R6J555P46N61q02L01k488M19O49O39j422J411K769K337L6l00K853
$$ plain form
542268 4989 5640 3526 1542 -102 -1102 568 1865 2983 1985 191 1748 2232 1295 498 1376 1754
543245 1754 2537 2053 1817 2006 1802 986 776 652 1159 -345 710 2752 2934 577 827 796 1114 813
544343 813 316 136 -609 872 45 504 2713 3667 1352 -692 -1588 1523 3810 3724 2170 2182 -278
545381 -278 -475 -6 1823 27 -977 -2233 -3233 -2668 -3526 -1780 -499 3809 4951 2850 357 -414
546358 -414 324 948 2988 2506 2046 440 -1292 -3106 -1280 476 688 3367 2138 376 1343 866
547334 866 1757 1702 668 260 1044 582 2002 2201 2096 875 2229 2272 2710 -3 -3832 -1737 -854 -1102
548433 -1102 -185 774 458 -908 -1096 -1054 -1117 -2213 -1932 -990 -385 -1091 -484 -2735 -835 -98 127 55 7
549593 7 -176 -1777 -603 378 942 1277 500 2015 3265 2094 -1858 -1619 -728 -1535 646 1014 111 -551
$$ packed form
542268D989O51k114j984j644j000J670J297J118r98j794J557M84r37p97Q78L78
543245A754P83m84k36J89k04q16k10j24N07j504J055K042J82k357K50l1L18l01
544343H13m97j80p45J481q27M59K209R54k315k044q96L111K287q6j554J2k460
545381b78j97M69J829j796j004j256j000N65q58J746J281M308J142k101k493p71
546358d14P38O24K040m82m60j606j732j814J826J756K12K679j229j762R67m77
547334H66Q91n5j034m08P84m62J420J99j05j221J354M3M38k713l829K095Q83k48
548433a102R17R59l16j366j88M2o3j096K81R42O05p06O07k251J900P37K25p2m8
549593Gj83j601J174R81N64L35p77J515J250j171l952K39Q91q07K181L68r03o62
$$ plain form
550691 -551 347 76 -98 -453 -1088 1257 1616 718 2029 2732 3699 -47 -1464 -405 1259 1506 2014
551729 2014 1831 -2127 -1748 -988 48 -524 -1471 -1117 -842 -164 145 189 195 -911 -502 3040 4350 2054
552828 2054 511 1174 1316 3312 4157 94 -2982 -3780 -2932 -1470 -79 1184 488 570 1308 -148 -858
553866 -858 -2146 -2218 -521 -474 1167 2098 2719 3090 782 -720 -818 1853 1507 838 1049 102 2493 2690
554964 2690 802 -2256 -3037 -1265 -358 -1641 -607 -1019 -1364 -498 -483 -2030 1268 1988 -868 -687 1797
556002 1797 2536 2012 -960 -1269 -1042 -917 454 804 708 2457 2592 -245 -1335 -293 -2022 -1301 2537
557039 2537 1654 1845 33 -3002 -2513 -861 -2187 -2370 239 35 -2297 -2345 -3699 -2854 -1553 123
558016 123 1453 3663 2358 641 -68 -1357 -1665 -1164 -347 -1404 115 534 901 1709 1391 -857 -125
$$ packed form
550691e51Q98k71j74l55o35K345L59q98J311P03R67l746j417J059J664K47N08
551729B014j83l958L79P60J036n72r47L54K75O78L09M4Oj106M09L542J310k296
552828B054j543O63J42J996Q45m063l076p98Q48J462J391J263o96Q2P38j456p10
553866h58j288p2J697M7J641R31O21L71k308j502r8K671l46o69K11r47K391J97
554964B690j888l058p81J772R07j283J034m12l45Q66J5j547L298P20k856J81K484
556002A797P39n24k972l09K27J25J371L50r6J749J35k837j090J042j729P21L838
557039B537q83J91j812l035M89J652j326j83K609k04k332m8j354Q45J301J676
558016A23J330K210j305j717p09j289l08N01Q17j057J519M19L67Q08l18k248P32
$$ plain form
559054 -125 -611 332 -556 -2208 -3188 -4233 -5543 -4152 -1613 -3323 -2940 -1234 -607 640 447 -183 -559
560091 -559 -1757 -4621 -4098 -3183 -4897 -5754 -1767 -1125 -2315 -2137 -2637 -4749 -3973 -1606 798 979 1107
561129 1107 1523 -252 384 1523 1421 1349 1945 946 878 425 -25 437 1618 147 -2350 -1532 -1683 -1279
562228 -1279 1938 5252 5695 5823 3849 248 -879 -2081 -2778 208 1015 -134 -130 670 1601 2662 2115
563265 2115 113 1633 950 1939 2612 731 844 1344 729 298 -583 -1675 -467 196 -654 -1076 265
564303 265 35 -2753 -3439 -4824 -4245 -4434 -5278 -5683 -4215 -3096 -3232 -1345 -223 -740 -2445 -785 689
565341 689 -1845 -2698 -1050 -864 -1529 -663 -1608 -2033 -926 -928 -192 3270 2164 1981 739 -493 -64 151
566439 151 349 -756 -332 -2137 -915 -1101 -720 -1033 -623 2612 3621 5608 3204 1137 -238 -2317
$$ packed form
559054a25m86R43q88j652r80j045j310J391K539j710L83J706O27J247j93o30l76
560091e59j198k864N23R15j714q57L987O42j190J78n00k112P76K367K404J81J28
561129A107M16j775O36J139j02p2N96r99o8m53m50M62J181j471k497Q18j51M04
562228a279L217L314M43J28j974l601j127j202o97K986Q07j149MQ00R31J061n47
563265B115k002J520o83R89O73j881J13N00o15m31q81j092J208O63q50m22J341
564303B65k30k788o86j385N79j89q44m05J468J119j36J887J122n17j705J660J474
565341F89k534q53J648J86o65Q66r45m25J107kP36L462j106j83j242j232M29K15
566439A51J98j105M24j805J222j86L81l13M10L235J009J987k404k067j375k079
$$ plain form
567416 -2317 1416 1096 1226 -1171 -184 238 -1830 -829 1615 1178 573 417 2018 1463 178 -2159
568392 -2159 -1304 -1030 1687 -328 -2417 -1240 558 -445 -1077 -3449 -2151 -1006 -988 -624 1283 2696
569369 2696 238 626 -2 -437 801 1140 1823 -604 -603 2125 1131 89 -1073 -365 2131 2806 3185
570407 3185 3255 1703 1133 1891 475 1901 1238 -277 -1776 -80 1546 1718 -661 -1116 -2054 -955
571384 -955 -2616 -2456 -816 -1752 -2277 -1502 -1282 -1808 -80 -1093 -2738 -2816 1449 4633 3935 1156 1366
572421 1366 4049 3036 274 -773 77 -243 -449 -384 717 -268 413 1407 -381 -1331 -1426 -2517 -3112
573459 -3112 -1056 -1152 489 639 1129 -2532 -331 -14 -1733 -721 -998 -551 -484 -1876 -1883 291 -205 -2776
574557 -2776 -2427 -1734 -2758 -2073 -2047 619 2676 1325 -1207 -1703 322 903 218 444 416 383 -390 -998
$$ packed form
567416b317L733l20J30k397R87M22k068J001K444m37o05j56J601n55j285k337
568392b159Q55K74K717k015k089J177J798j003o32k372J298J145J8L64J907J413
569369B696k458L88o28m35J238L39O83k427JK728r94j042j162P08K496O75L79
570407C185P0j552n70P58j416J426o63j515j499J696J626J72k379m55r38J099
571384i55j661J60J640r36n25P75K20n26J728j013j645p8M265L184o98k779K10
572421A366K683j013k762j047Q50l20k06O5J101r85O81R94j788r50r5j091n95
573459c112K056r6J641J50M90l661K201L17j719J012k77M47O7j392pK174m96k571
574557b776L49O93j024O85K6K666K057j351k532m96K025N81o85K26k8l3p73o08
$$ plain form
575656 -998 791 252 -382 -2275 -3784 -5004 -3615 -3046 -4974 -4989 -3644 -3066 -2082 -643 1063 -406
576633 -406 -2442 -1799 -1314 546 -159 -1430 -1729 -52 1443 -1032 -1167 -1606 924 182 -665 1218 2056
577670 2056 -128 2103 3124 4234 3932 500 -1856 -1555 753 214 1674 1137 -584 -1848 -3245
578586 -3245 -164 906 -1766 -2609 -1806 36 3296 4841 4198 1640 194 1400 648 -2180 -1055
579502 -1055 737 -1841 -3837 -1329 -1192 -1557 897 3121 4684 3654 888 514 -819 -68 -185 411
580478 411 882 2177 2689 1609 913 -351 -948 -3240 -3004 -361 -393 1611 1914 1423 1980 829 -220
581516 -220 -71 261 3325 3237 2563 3432 957 1596 2398 2722 -837 -1608 28 2507 1585 -261 -924 -543
582615 -543 -2136 -818 1216 -583 -2944 -3076 -3313 -3707 -2316 -2740 -2291 -861 -2818 -2023 -69 -69 -1979
$$ packed form
575656i98J789n39o34j893j509j220J389N69j928j5J345N78R84J439J706j469
576633d06k036O43M85J860p05j271k99J677J495k475j35m39K530p42q47J883Q38
577670B056k184K231J021J110l02l432k356L01K308n39J460n37j721j264j397
578586c245L081J070k672q43Q03J842L260J545o43k558j446J206p52k828J125
579502a055J792k578j996K508J37l65K454K224J563j030k766l74j333P51j17N96
580478D11M71J295N12j080o96j264n97k292K36K643l2K004L03m91N57j151j049
581516b20J49L32L064q8o74Q69k475O39Q02L24l559p71J636K479r22j846o63L81
582615e43j593J318K034j799k361j32k37l94J391m24M49J430j957P95J954%j910
$$ plain form
583652 -1979 -2442 -2912 -3990 -2496 -356 865 1814 275 420 1502 -578 -1931 -1173 1319 838 -1561
584629 -1561 -2638 -4712 -3943 -2372 398 3697 3711 899 404 286 1310 446 580 -702 -774 -864 580
585667 580 681 -1334 436 2305 1041 1204 1424 123 -1031 -716 -1548 543 1060 1055 392 3489 4782
586704 4782 3786 4362 3314 1354 1862 2062 -1794 -2676 -1071 -275 967 -515 527 1165 -260 -419
587681 -419 218 2547 602 -1852 -1322 642 183 203 387 1113 354 513 553 115 260 1050 2313 2785
588780 2785 2409 2035 306 405 267 712 373 -3391 -4587 -2796 -2969 -1723 -100 224 -632 -1996 -1469
589817 -1469 -1306 203 540 -1275 -567 -1488 -2606 -1438 -2247 -2287 -3239 -1447 1281 542 926 1761 2892
590855 2892 2303 1785 631 969 2219 3870 1610 -383 -3507 -3514 -3955 -1892 718 -175 -351 -473 -1560
$$ packed form
583652a979m63m70j078J494K140J221R49j539J45J082k080j353P58K492m81k399
584629a561j077k074P69J571K770L299J4k812m95j18J024q64J34j282p2r0J444
585667E80J01k015J770J869j264J63K20j301j154L15q32K091N17no63L097J293
586704D782r96N76j048j960N08K00l856q82J605P96J242j482J042O38j425j59
587681d19O37K329j945k454N30J964m59K0J84P26p59J59M0m38J45P90J263M72
588780B785l76l74j729R9j38M45l39l764j196J791j73J246J623L24q56j364N27
589817a469J63J509L37j815P08r21j118J168q09m0r52J792K728p39L84Q35J131
590855B892n89n18j154L38J250J651k260j993l124pm41K063K610q93j76j22j087
$$ plain form
591893 -1560 -780 1772 955 -432 -193 -2722 -2790 -951 603 519 -738 -159 1880 1722 -99 1758 1036
592930 1036 2356 324 -1656 -3083 -3623 -5057 -3864 -3202 -2515 -2308 -3220 -2934 -679 158 -571 -716 -426
593968 -426 373 -1094 -2178 -1316 1211 2650 503 -95 -1691 -671 -278 -297 -1921 -1175 -1888 -2205 -3331
595006 -3331 -4106 -4227 -1182 734 -21 401 2277 2560 -658 -3766 -4231 -5973 -4799 -958 563 -173
595982 -173 -2270 -4461 -4174 -1254 1568 2129 2947 493 -125 67 1345 3966 2861 713 -439 -1117
596959 -1117 1366 3124 -299 -1756 -2701 -891 2295 2896 424 -1916 -368 137 -543 -194 -1367 -691
597935 -691 -1171 -1648 -2056 -738 -1266 -682 791 206 -1332 -1202 1319 595 1463 1854 671 750 1293 2472
599034 2472 2184 4274 5196 3139 166 246 804 1010 1117 169 546 1386 -109 -408 1230 305 -761
$$ packed form
591893a560P80K552q17j387K39k529o8J839J554q4j257N79K039j58j821J857p22
592930A036J320k032j980j427n40j434J193O62O87K07r12K86K255Q37p29j45K90
593968d26P99j467j084Q62K527J439k147n98j596J020L93j9j624P46p13l17j126
595006c331p75j21L045J916p55M22J876K83l218l108m65j742J174L841J521p36
595982a73k097k191K87K920K822N61Q18k454o18J92J278K621j105k148j152o78
596959a117K483J758l423j457r45J810L186O01k472k340J548N05o80L49j173O76
597935f91m80m77m08J318n28N84J473n85j538J30K521p24Q68L91j183P9N43J179
599034B472k88K090R22k057k973Q0N58K06J07r48L77Q40j495k99J638r25j066
$$ plain form
600072 -761 -2868 -1541 1176 -1196 -1932 571 1449 -1285 -203 1109 1242 -2775 -1427 1201 2879
600987 2879 3458 3828 3883 4351 2632 3397 2844 2278 667 -358 -2879 -2329 895 -19 -1153 1616 2450
602025 2450 1593 -21 42 -1164 -1501 -1382 -2807 -5664 -4671 -1644 1205 -520 -1802 -1037 -945 -1085 955
603063 955 588 3435 3749 2205 2093 1580 1666 568 69 -388 -321 -3473 -1164 199 158 -705 -1969 -2595
604162 -2595 -2388 86 -390 -240 131 1355 1767 -769 120 -1434 -1334 -748 -3823 -4350 -5156 -2586 -1821
605199 -1821 -1333 -185 -374 -40 -74 1035 1723 1776 150 -1327 -1834 787 2381 1718 -783 -2637 -2581
606237 -2581 -2011 -329 209 568 875 -137 2247 2296 3322 1675 654 667 1168 -872 -974 -141 -70 746
607335 746 -837 -3800 -3245 -1222 -1293 -2495 -1803 1865 3201 1196 1311 1993 2261 315 814 1442 -303
$$ packed form
600072g61k107J327K717k372p36K503Q78k734J082J312J33m017J348K628J678
600987B879N79L70N5M68j719P65n53n66j611j025k521N50L224r14j134K769Q34
602025B450q57j614O3j206l37J19j425k857R93L027K849j725j282P65R2j40K040
603063I55l67K847L14j544j12n13Q6j098m99m57O7l152K309J363m1q63j264o26
604162b595K07K474m76J50L71J224M12k536Q89j554J00N86l075n27q06K570P65
605199a821M88J148j89L34l4J109O88N3j626j477n07K621J594o63k501j854N6
606237b581N70J682N38L59L07j012K384M9J026j647j021J3N01k040j02Q33P1Q16
607335G46j583k963N55K023p1j202O92L668J336k005J15O82K68j946M99O28j745
$$ plain form
608373 -303 274 -2288 -1719 -372 1640 -1312 305 2204 2741 1639 -2244 -1556 -1576 -1067 513 -432 -112
609411 -112 380 108 -1172 385 1391 540 1478 1578 1295 2576 3034 276 -4298 -5873 -5382 -4122 -3817
610448 -3817 -2921 -935 -1021 -2737 -2178 -1073 -2048 -3384 -3125 -1225 -1130 -1219 -372 160 718 -239 276 927
611547 927 -1022 -1634 112 590 -1179 -225 -870 -1735 -1792 -1363 305 463 -11 -1930 430 1636 776
612585 776 537 -299 -368 187 -553 1919 5165 5661 3730 3155 780 772 364 -714 -614 70 -1166 -1116 -1651
613745 -1651 259 -1883 1003 1916 842 -116 610 2259 2151 -1204 -1692 -2578 -1653 -1773 -1810 -1947 -708
614782 -708 -448 1164 467 -1270 1455 1893 1454 -1188 -3552 -4373 -1235 1092 613 246 775 -392 -1091
615820 -1091 -2155 -3357 -3274 -1561 -470 56 -555 -973 -1225 243 -3373 -4687 -3782 -2674 -175 666
$$ packed form
608373c03N77k562N69J347K012k952J617J899N37j102l883O88k0N09J580r45L20
609411a12M92k72j280J557J006q51R38J00k83J281M58k758m574j575M91J260L05
610448c817Q96J986q6j716N59J105r75j336K59J900R5q9Q47N32N58r57N15O51
611547I27j949o12J746M78j769R54o45q65n7M29J668J58m74j919K360J206q60
612585G76k39q36o9N55p40K472L246M96j931n75k375qm08j078J00O84j236N0n35
613745a651J910k142K886R13j074r58P26J649j08l355m88q86R25j20l7j37J239
614782g08K60J612o97j737K725M38m39k642k364q21L138K327m79l67N29j167o99
615820a091j064j202Q3J713J091N26o11m18k52J468l616j314R05J108K499Q41
$$ plain form
616796 666 221 653 -178 -2622 -4160 -3823 -1477 390 2617 1856 1184 319 422 1318 334 50 1315
617834 1315 1836 -1084 -1776 -1159 -1748 -423 -392 -1043 -702 -2810 -2666 -56 947 -1545 960 3047 1827
618872 1827 -1880 -2922 -1012 184 -879 -1012 -688 -1903 -1154 706 1877 1764 -130 -1938 -44
619787 -44 30 -405 1357 2146 416 390 -313 1393 1156 288 -735 -588 196 -1126 339 -904 -1338 -597
620886 -597 658 -276 -495 1307 782 -1826 -3179 -3068 -1615 -481 -2550 -4401 -3631 -1643 -1745 -3634
621863 -3634 -5117 -4715 162 1712 553 1709 3193 3102 970 -47 -2693 -2103 -2992 -2229 -993 2046
622839 2046 492 1346 165 93 540 -1527 -1776 -279 2115 480 605 111 651 3383 2473 2821 3974
623877 3974 2812 2200 225 121 648 2796 1892 -683 -2398 -1903 -3790 -4721 -5683 -4167 -3211 -3208 -570
$$ packed form
616796F66m45M32q31k444j538L37K346J867K227p61o72q65J03Q96r84k84J265
617834A315N21k920o92O17n89J325L1o51L41k108J44K610J003k492K505K087j220
618872A827l707j042J910J196j063j33L24j215P49J860J171j13j894j808J894
619787d4P4m35J762P89j730k6p03J706k37q68j023J47P84j322J465j243m34P41
620886e97J255r34k19J802n25k608j353J11J453J134k069j851P70J988j02j889
621863c634j483M02M877J550j159J156J484r1k132j017k646N90q89P63J236L039
622839B046j554Q54j181p2M47k067k49J497K394j635J25m94N40K732r10L48J153
623877C974j162o12j975j04N27K148r04k575j715M95j887r31r62J516R56LK638
$$ plain form
624915 -570 -1683 -2524 -1601 486 231 -364 -1563 -1916 -2724 -1113 1560 1959 733 -241 493 -1465 -3343
625952 -3343 -4000 -2502 -2419 -1300 289 1018 -902 -2949 -1475 83 -290 -876 -90 -47 -653 -1965 -880
626990 -880 -1017 1068 2545 3616 945 57 -163 -254 115 -33 -30 515 -197 -932 -2066 -3187 -3555 -930
628089 -930 -1596 -4497 -1710 -1267 -1496 1991 626 360 -372 1808 324 35 520 127 -814 921 -1451
629126 -1451 -704 -842 -812 -561 -1216 -1500 -1398 90 -1284 -2496 -2629 -2153 -1982 -369 2031 1179 1217 479
630225 479 280 -3081 -2566 -312 81 689 2386 3794 1977 2244 2267 1919 -928 -1801 -2086 -1936 -571
631263 -571 -506 -1085 -1300 -368 259 -127 3799 4241 1302 -586 1241 3183 659 -958 1073 391 -228
632300 -228 1965 1143 474 336 -1598 -1441 -359 -492 -1006 -1060 -3581 -4033 -3007 -1492 -1691 -1636 -796 2628
$$ packed form
624915e70j113q41R23K087k55n95j199l53q08J611K673L99j226r74P34j958j878
625952c343o57J498Q3J119J589P29j920k047J474J558l73n86P86M3o06j312J085
626990h80j37K085J477J071k671q88k20r1L69j48LN45p12p35j134j121l68K625
628089i30o66k901K787M43k29L487j365k66p32K180j484k89M85l93r41J735k372
629126a451P47j38L0K51o55k84J02J488j374j212j33M76J71J613K400q52L8p38
630225D79j99l361N15K254L93O08J697J408j817K67K3l48k847q73k85J50J365
631263e71O5n79k15R32O27l86L926M42k939j888J827J942k524j617K031o82o19
632300b28K193q22o69j38j934J57J082j33n14n4k521m52J026J515j99N5Q40L424
$$ plain form
633399 2628 2270 431 -958 -4066 -3910 -2765 -3178 -4596 -3664 -2873 -1927 -1462 -642 -612 378 705 455 448
634498 448 -541 -1072 -969 1488 188 967 1095 3988 5061 4295 4018 3628 2448 1418 1871 2473 712
635535 712 -221 786 2774 2241 2743 1693 -302 -3289 -3304 -2900 -1304 -1252 -1689 -1746 1240 -1053 -2078
636573 -2078 106 3057 2728 2656 -730 -2971 933 -642 -1353 302 2969 3361 3926 4056 196 -1657
637550 -1657 -1091 -5 1093 4192 6345 4006 3349 1304 166 712 8 -901 2547 1401 -2074 -2489
638526 -2489 -4432 -1207 453 -595 883 -808 569 143 97 2214 776 858 441 1865 3238 3668
639503 3668 2658 2005 -734 999 544 -528 85 855 -374 -917 972 963 1546 1968 984 132 929 1906
640602 1906 1767 910 692 1456 -606 -854 978 3176 324 -1665 -2022 -600 1163 231 429 605 343
$$ packed form
633399B628l58j839j389l108J56J145m13j418R32P91R46M65Q20L0R90L27k50p
634498D48r89n31J03K457j300P79J28K893J073p66k77l90j180j030M53O02j761
635535G12r33J007J988n33N02j050j995k987j5M04J596N2m37n7K986k293j025
636573b078K184K951l29p2l386k241L904j575p11J655K667L92N65J30l860j853
637550a657N66J086J098L099K153k339o57k045j138N46p04r09L448j146l475m15
638526b489j943L225J660j048J478j691J377m26m6K117j438Q2m17J424J373M30
639503C668j010o53k739J733m55j072O13P70j229n43J889rN83M22r84q52P97R77
640602A906j39q57k18P64k062k48J832K198k852j989l57J422J763r32J98J76k62
$$ plain form
641639 343 112 1293 9 -1233 -872 311 279 147 -175 -941 -272 -32 -1600 -3227 -526 980 687
642677 687 327 2165 2311 2122 1723 2027 5120 5676 4060 4994 6013 4780 4189 3089 1845 1405 1444
643715 1444 1205 1043 2048 1746 1856 876 822 3019 1984 422 1025 1992 1227 1432 2141 301 67 -1512
644813 -1512 -385 1249 -1581 -1838 -3148 -3297 -1434 65 -911 -790 -723 -202 406 -2415 -5035 -5932 -4190
645851 -4190 -952 -220 -1393 -933 36 701 -525 -374 -283 -3091 -3521 -1494 -329 -376 -963 34 -104 -2853
646950 -2853 -3829 -3848 -1715 -1568 222 539 -1522 -1401 -1296 -2003 -2293 -3112 -3948 -226 734 -1397 -1616 -934
648048 -934 22 671 5 -415 1894 1848 1369 1617 49 -1928 -4001 -4784 -4734 -3980 -1393 -1941 -2415 -2958
649147 -2958 -3286 -1005 1163 822 -83 1280 2577 4346 1999 -418 -1699 -3763 -3055 111 3519
$$ packed form
641639C43k31J181j284j242L61J183l2j32l22p66O69K40j568j627K701J506k93
642677F87l60J838J46j89l99L04L093N56j616R34J019j233n91j100j244m40L9
643715A444k39j62J005l02J10r80n4K197j035j562O03R67p65K05P09j840k34j579
644813a512J127J634k830k57j310j49J863J499r76J21O7N21O08k821k620q97J742
645851d190L238P32j173M60R69O65j226J51R1k808m30K027J165m7n87R97j38k749
646950b853r76j9K133J47J790L17k061J21J05p07k90q19q36L722R60k131k19O82
648048i34R56O49o66m20K309m6m79K48j568j977k073p83N0P54K587n48m74n43
649147b958l28K281K168l41r05J363J297J769k347k417j281k064P08L166L408
$$ plain form
650062 3519 2590 109 -2669 -1487 -615 1534 1763 1540 2450 -625 -625 -1795 -2173 51 442 -761 1050
651100 1050 4133 3840 445 -2223 -1553 -1370 -175 -201 795 1602 321 574 -188 712 -986 -1267 -508
652138 -508 -338 978 -301 -1493 499 605 1061 1841 1608 630 -1650 -2211 -2515 -2935 -2214 -367 -1517
653176 -1517 -1559 -2124 -2820 -1966 449 2399 863 487 -185 -2129 -1388 64 271 -2043 -3032 663 539
654213 539 -1553 -1423 -144 1002 2701 1830 2153 366 -1765 -2789 -3185 -2933 -2328 -855 -1217 174
655190 174 2607 2881 1853 -1309 -2438 -515 -359 -2659 -1074 999 -132 -181 663 2977 1453 2109
656166 2109 517 -150 -335 663 1562 2158 374 -2171 -478 -234 -438 733 1465 992 2379 571 -18
657204 -18 1288 2024 1540 -249 -658 -2839 -2986 547 1362 799 156 412 30 -752 -460 -1531 -2333 -1859
$$ packed form
650062C519r29k481k778J182Q72K149K29k23R10l075%j170l78K224L91j203J811
651100A050L083k93l395k668O70J83J195k6R96Q07j281K53p62R00j698k81P59
652138e08J70J316j279j192J992J06M56P80k33r78k280n61l04m20P21J847j150
653176a517m2n65o96Q54K415J950j536l76o72j944P41J452K07k314r89L695j24
654213E39k092J30J279J146J699q71L23j787k131j024l96K52O05J473l62J391
655190A74K433K74j028l162j129J923J56k300J585K073j131m9Q44K314j524O56
656166B109j592o67j85R98Q99N96j784k545J693K44k04J171P32m73J387j808n89
657204a8J306P36m84j789m09k181j47L533Q15n63o43K56l82p82K92j071q02M74
$$ plain form
658303 -1859 -643 46 -1176 -877 408 1173 -102 255 1298 952 211 -705 -757 1111 324 1690 3024
659340 3024 4068 1166 -132 1028 -1123 71 2015 1149 -1073 632 -305 2999 2930 1682 1805 -559
660317 -559 -95 796 6 -655 -550 -723 -1058 -1942 -4336 -3810 -3373 -2975 -2408 -564 -370 -1428 -2455 -2705
661416 -2705 -2572 -4626 -5593 -2232 -1835 -1221 1471 -642 -888 2091 2046 -119 388 1970 4756 3102
662392 3102 1284 581 -437 -1162 -1993 -3512 -3522 -3250 -2107 -1970 -2396 -2336 -2482 805 -215 1101 3950
663430 3950 2083 -1563 -1727 -1978 -850 -847 -1546 -2332 -1906 -1559 -1177 -2591 -1535 109 -1666 -4911 -4012
664468 -4012 -2322 -3530 -3234 -3394 -2776 -3247 -4145 -3927 -4671 -2162 -1815 401 1299 -1282 -327 745 -593
665505 -593 -1821 -2458 -3183 -1645 -351 1686 1979 595 -294 56 -645 -272 698 10 -947 -2077 -2007 -144
$$ packed form
658303a859J216O89j222K99J285P65j275L57J043l46p41r16n2J868p87J366J334
659340C024J044k902j298J160k151J194J944q66k222J705r37L304o9j248J23k364
660317e59M64Q91p90o61J05j73l35q84k394N26M37L98N67J844J94j058j027k50
661416b705J33k054r67L361L97O14K692k113k46K979m5k165N07J582K786j654
662392C102j818p03j018p25q31j519j0K72J143J37m26O0j46L287j020J316K849
663430C950j867l646j64k51J128Lo99p86M26L47L82j414J056J644j775l245Q99
664468d012J690j208K96j60O18m71q98K18p44K509L47K216Q98k581R55J072j338
665505e93j228o37p25J538J294K037K93j384q89L50p01L73R70o88r57j130P0J863
$$ plain form
666604 -144 3625 5254 3768 1627 1051 725 1896 2272 -413 -381 1105 2648 1118 -1324 70 907
667581 907 1350 225 -2422 -2832 -462 -1199 -2464 845 2243 27 -1244 -1236 -2147 -3585 -4386 -4690 -3881
668619 -3881 -1543 -1218 -1117 1353 2128 1345 1119 1641 982 -2523 -2462 -3879 -2278 166 -800 -1325 -148
669656 -148 -747 -427 282 2106 3006 2844 2415 2128 2805 -42 -2301 -867 -715 -281 -835 -1922 -2165 -3191
670755 -3191 -4888 -2778 138 646 -222 -1697 -1384 17 134 2791 3546 2794 -1427 -1195 -427 -1450
671731 -1450 810 3289 2953 400 1370 505 260 1541 1145 -28 1489 1751 149 623 35 1646
672708 1646 2135 2697 1824 -294 -406 1735 2443 3386 1323 1882 1528 -238 778 1080 -1321 -1269 -2739
673746 -2739 -297 735 2057 2032 2701 2764 1537 782 621 -1400 390 2390 948 970 -1573 -943 -760
$$ packed form
666604a44L769J629j486k141n76l26J171L76k685L2J486J543j530k442J394Q37
667581I07M43j125k647m10K370p37j265L309J398k216j271Qr11j438q01l04Q09
668619c881K338L25J01K470P75p83k26N22o59l505O1j417J601K444r66n25J177
669656a48n99L20P09J824R00j62m29k87O77k847k259J434J52M34n54j087k43j026
670755c191j697K110K916N08q68j475L13J401J17K657P55p52m221K32P68j023
671731a450K260K479l36k553R70q65k45J281l96j173J517K62j602M74n88J611
672708A646M89N62q73k118j12K141P08R43k063N59l54j766J016L02k401N2j470
673746b739K442J032J322k5O69O3j227p55j61k021J790K000j442K2k543O30J83
$$ plain form
674784 -760 812 2587 233 -107 861 726 1792 2308 1401 1282 700 107 1506 1211 2846 2854 -82 -1497
675882 -1497 -736 -862 -2925 -3527 -3789 -1912 30 7 844 1277 372 -236 -1404 81 579 613 -313 -1866
676981 -1866 619 2967 3832 3159 3039 3531 126 -1383 -753 -197 -602 -1408 -2331 918 2019 188 -470
678019 -470 -229 -3464 -4690 -4904 -3930 -1549 -1921 -72 613 -427 -1377 -1152 -785 782 1926 3688 3786
679056 3786 4232 3470 1531 2024 1378 -543 2148 5549 3746 2422 691 1060 2011 1751 1389 79
680033 79 336 511 1113 2064 362 405 1677 -790 -2525 -912 -1784 -1950 -2262 -1922 -506 -1575 -2635
681070 -2635 1453 542 -55 795 782 398 298 1594 -1014 1840 2183 2224 1697 -22 -1359 -2476 -1791
682108 -1791 -1477 1565 4638 3422 202 -1395 -2158 -2595 -460 -372 2919 5645 2643 -430 -2441 -1984
$$ packed form
674784g60J572J775k354l40R68j35J066N16r07j19n82n93J399k95J635Qk936j415
675882a497P61j26k063o02k62J877J942k3Q37M33r05o08j168J485M98L4r26j553
676981a866K485K348Q65o73j20M92l405j509O30N56m05q06r23L249J101j831o58
678019d70K41l235j226k14R74K381l72J849O85j040r50K25L67J567J144J762R8
679056C786M46p62j939M93o46j921K691L401j803j324j731L69R51k60l62j310
680033G9K57J75O02R51j702M3J272k467j735J613q72j66l12L40J416j069j060
681070b635M088r11n97Q50j3l84j00J296k608K854L43M1n27j719j337j117O85
682108a791L14L042L073j216l220j597p63m37K135Q8L291K726l002l073k011M57
$$ plain form
683085 -1984 -3375 -4044 -2170 766 530 -980 -3038 -1666 1469 977 -388 -255 -485 -2143 -1475 -2118
684061 -2118 -2401 873 268 -1024 -2565 -5683 -7850 -7079 -5580 -5637 -3957 -168 340 287 3546 4773
685038 4773 3274 -1916 -2448 -1279 1005 182 -2095 -139 2360 -1826 -1220 1610 2210 2791 -46 1174
686015 1174 645 -553 -65 349 -322 -1956 -2656 -4172 -4543 -2083 -1497 -1180 -4078 -2511 -1205 -401 70
687052 70 827 -251 538 -87 116 1435 787 935 1131 1271 -179 1187 1288 1528 -956 -2762 -3146 -3463
688151 -3463 -3957 -1057 -2075 -620 -89 -830 -1120 -2441 -2490 -2095 -3129 -884 -1649 -3893 -1887 -2340 -1104
689188 -1104 1188 2041 2890 -21 -1092 1446 2846 3199 1769 2268 770 -275 802 3736 2517
690104 2517 1937 1320 368 -498 95 -72 942 2167 4965 5326 2676 1416 -2127 -4942 -5909 -2640
$$ packed form
683085a984j391o69J874K936k36j510k058J372L135m92j365J33k30j658O68o43
684061b118k83L274o05j292j541l118k167P71J499n7J680L789N08n3L259J227
685038D773j499n190n32J169K284q23k277J956K499m186O06K830O00N81k837J220
686015A174n29j198M88M14o71j634p00j516l71K460N86L17k898J567J306Q04M71
687052G0P57j078P89o25K03J319o48J48J96J40j450J366J01K40k484j806l84l17
688151c463m94K900j018J455N31p41k90j321m9L95j034K245p65k244K006m53J236
689188a104K292Q53Q49k911j071K538J400L53j430M99j498j045J077K934j219
690104B517n80o17r52q66N93j67J014J225K798L61k650j260l543k815r67L269
$$ plain form
691081 -2640 -1274 -129 -1832 -3369 -2409 -1228 -2796 -6581 -5102 -2142 -1514 -577 -748 -1251 -472 -1461
692057 -1461 -685 -1484 591 2715 2470 2330 2785 -599 -1815 -494 1162 2149 2685 1496 496 -344
693034 -344 -1140 -1573 24 2518 4723 3678 3389 2348 305 -446 -119 1698 3161 2559 1909 2808 1833
694072 1833 -908 -780 -76 371 2205 2079 2839 2801 815 1966 2536 1058 189 476 528 528 1154 798 -76
695232 -76 -1787 -1904 -2631 -2582 -1719 -1199 -540 1118 185 431 906 442 305 1167 1401 1015 -1200 -1623 826
696391 826 1876 738 145 435 2739 3808 3377 2211 1181 2908 2302 1667 1844 2898 2533 1910 773
697429 773 1312 -326 -2484 -922 -2513 -3099 -1799 596 -81 -78 -580 -1780 1291 3694 2462 2616 1776
698466 1776 -965 -794 336 2006 173 1686 4087 3620 2039 353 675 -177 -651 -1363 -4273 -2362
$$ packed form
691081b640J366J145j703j537R60J181j568l785J479K960O28R37j71n03P79r89
692057a461P76p99K075K124k45j40M55l384j216J321J656R87N36j189j000q40
693034c44p96m33J597K494K205j045k89j041k043p51L27J817J463o02o50Q99r75
694072A833k741J28P04M47J834j26P60l8j986J151N70j478q69K87N2%O26l56q74
695232g6j711j17p27M9Q63N20O59J658r33K46M75m64j37Q62K34l86k215m23K449
696391H26J050j138n93K90K304J069m31j166j030J727o06o35J77J054l65o23j137
697429G73N39j638k158J562j591n86J300K395o77Ln02j200L071K403j232J54q40
698466A776k741J71J130J670j833J513K401m67j581j686L22q52m74p12k910J911
$$ plain form
699443 -2362 -3944 -3917 -756 -1502 -1938 26 1075 -1505 -1507 -1959 146 1792 2841 2291 712 -1129 -3042
700481 -3042 -686 2756 3963 5285 4318 5133 2615 1405 -1052 -1035 791 2161 2666 3041 1731 1157
701457 1157 1631 20 -2647 -2384 -1383 -187 3270 1857 -2043 -1387 -254 -395 1371 432 -87 -337
702434 -337 -3530 -4693 -2233 -2419 -2858 -2632 -2523 -1203 -1298 -2356 -932 -1857 -106 421 1014 4093 5172
703472 5172 3251 1059 -1265 -1764 -1851 -2342 -2287 -484 2003 1726 -346 -2714 -907 -1519 -1310 217 1276
704509 1276 -548 -50 -1608 449 1114 -1811 -2550 849 2300 3676 2762 462 -197 1477 3456 554
705486 554 -372 -232 2621 3194 1493 1305 -235 -2194 516 643 -283 -3603 -2324 2079 1749 2650 2808
706524 2808 4165 2230 126 -3036 -1596 1305 -214 206 1059 439 3098 733 -907 -2202 -3503
$$ packed form
699443b362j582K7L161p46m36J964J049k580km52K105J646J049n50j579j841j913
700481c042K356L442J207J322r67Q15k518j210k457J7J826J370N05L75j310n74
701457A157M74j611k667K63J001J196L457j413l900O56J133j41J766r39n19k50
702434c37l193j163K460j86m39K26J09J320r5j058J424r25J751N27N93L079J079
703472E172j921k192k324m99q7m91N5J803K487k77k072k368J807o12K09J527J059
704509A276j824M98j558K057O65k925p39L399J451J376r14k300o59J674J979k902
705486E54r26J40K853N73j701j88j540j959K710J27r26l320J279M403l30R01J58
706524B808J357j935k104l162J440K901j519M20Q53o20K659k365j640j295j301
$$ plain form
707439 -3503 -290 2795 -144 -2102 -1820 -2158 -1415 -1103 237 3386 897 -824 -794 -584 -633 1277 3004
708477 3004 6111 5299 3698 1662 1134 3090 2250 971 -117 -1318 -690 848 996 -1402 -455 1196
709453 1196 1001 1192 571 -373 -401 3416 3352 1912 631 -1003 464 -48 -3285 -2946 -3223 -2043 573
710491 573 2214 -175 874 -52 654 -952 -360 -398 -1885 -2728 -2374 -1996 -1460 -1305 1509 2141 1917 610
711590 610 1014 3720 2157 2335 171 -1506 -270 672 369 291 2000 3975 4592 1255 -1828 -1310 -973
712628 -973 519 2866 2624 -320 -1555 908 -928 -2967 -1507 -2002 -1387 -675 -386 -936 -115 -634 568
713665 568 62 -492 -1201 -4578 -1920 1559 545 -3558 -2741 -1764 -7 525 416 1415 138 -125 165
714703 165 661 3222 1735 -642 -391 1662 3146 1798 -197 460 297 1027 -1400 -541 -1057 -1097 -957
$$ packed form
707439c503L213L085k939j958K82l38P43L12J340L149k489j721L0K10m9J910J727
708477C004L107q12j601k036n28J956q40j279j088j201O28J538J48k398R47J651
709453A196j95J91o21r44k8L817o4j440j281j634J467n12l237L39k77J180K616
710491E73J641k389J049r26P06j606N92l8j487q43L54L78N36J55K814O32k24j307
711590F10M04K706j563J78k164j677J236R42l03p8J709J975O17l337l083N18L37
712628i73J492K347k42k944j235K463j836k039J460m95O15P12K89n50Q21n19J202
713665E68n06n54p09l377K658L479j014m103Q17R77J757N32j09R99j277k63K90
714703A65M96K561j487k377K51K053J484j348j995O57j63P30k427Q59n16m0J40
$$ plain form
715740 -957 1336 2034 -365 -2066 -2351 -1044 73 -1076 -2048 -3879 -6625 -5412 -5201 -5506 -4257 -2533
716717 -2533 -2619 -3128 -2843 -3865 -3507 340 -302 -2550 -3507 -3226 -886 -1278 -2649 -2381 -420 -359 331 2939
717816 2939 2138 2773 -438 -5393 -6718 -2466 -3630 -3293 -3269 -1752 1608 1984 2496 2394 929 121 -3313
718853 -3313 -2823 -2501 -3071 -1929 -1281 100 2091 681 -376 -1314 -1710 -163 525 2204 836 -78
719830 -78 1267 -1006 -1861 -1157 2688 3231 1823 665 618 839 -370 1147 2573 435 -1604 -4020
720806 -4020 -2053 -203 -1041 -1276 -2172 -909 -564 -1656 -3989 -2929 -1475 558 -752 -427 -2185 -3360
721783 -3360 -3093 -1618 -1318 -506 1288 -1162 -3671 -3102 -1723 -1858 -2103 -2970 -1400 1272 -312 130
722760 130 736 2926 2150 2805 3366 1002 -2193 -3045 -3929 -4354 -2110 -812 96 -245 -831 -624 807
$$ packed form
715740i57K293O98k399j701k85J307J117j149r72j831k746J213K11l05J249J724
716717b533q6n09K85j022L58L847o42k248r57K81K340l92j371K68J961O1O90K608
717816B939q01O35l211m955j325M252j164L37K4J517L360L76N12j02j465q08l434
718853c313M90L22n70J142O48J381J991j410j057r38l96J547O88J679j368r14
719830g8J345k273q55P04L845N43j408j158m7K21j209J517J426k138k039k416
720806d020J967J850q38k35q96J263L45j092k333J060J454K033j310L25j758j175
721783c360K67J475L00Q12J794k450k509N69J379j35k45q67J570K672j584M42
722760A30O06K190p76O55N61k364l195q52q84m25K244J298R08l41n86K07J431
$$ plain form
723798 807 1541 -1649 -2661 -1288 -1336 -874 429 -612 302 1150 2169 3174 985 -1365 1402 2017
724774 2017 4081 4390 3123 2050 -2236 -3284 -3945 -4171 -4632 -4864 -4261 -3051 -2510 -1452 -947 -1027 2725
725812 2725 2066 -1035 267 -577 -3534 -3358 -3526 -2296 -4183 -2195 -1603 -813 -2084 -2319 -3253 -2869 -2702
726849 -2702 -3193 -3883 -4125 -2488 -1210 1256 1543 1843 2821 1717 -36 558 -6 -2082 -551 -1150 853
727887 853 1415 769 -953 127 1382 116 328 1375 4083 2386 2038 359 -1983 -2864 -1920 -2786
728864 -2786 366 219 1812 3643 1806 880 -1568 -1454 -1897 -675 -1516 -2035 879 -563 -1255 -1340 376
729901 376 -150 -901 88 138 -196 -900 -3515 -3826 -816 64 -684 -539 1105 221 -1814 -707 41 2191
731000 2191 1721 -199 -475 -2161 -1481 275 747 977 -309 420 325 4490 3259 -1152 -2810 -740
$$ packed form
723798H07P34l190j012J373m8M62J303j041R14Q48J019J005k189k350K767O15
724774B017K064L09j267j073m286j048o61k26m61k32O03J210N41J058N05q0L752
725812B725o59l101J302q44k957J76j68J230j887J988N92P90j271k35r34L84J67
726849b702m91o90k42J637J278K466K87L00R78j104j753N94n64k076J531n99K003
727887H53N62o46j722J080J255j266K12J047K708j697l48j679k342q81R44q66
728864b786L152j47J593J831j837r26k448J14m43J222q41n19K914j442o92q5J716
729901C76n26p51R89N0l34p04k615l11L010Q80p48J45J644q84k035J107P48K150
731000B191m70j920k76j686O80J756M72K30j286P29r5M165j231m411j658K070
$$ plain form
731977 -740 -176 -611 2332 2928 1836 1960 2518 -376 -3078 -3074 -2275 33 1770 2056 987 745 894 3860
733075 3860 3368 2115 1337 3355 4563 1996 912 -2025 -1175 -709 -1924 -537 968 -536 1492
733991 1492 467 -2319 -3771 -1900 -776 1246 -1283 -575 130 1719 -800 -1270 -1856 -2782 -4108 -3181
734968 -3181 -1728 -2797 -1154 856 563 -1553 -2819 -3054 -505 836 3493 1084 -3363 -2257 846
735883 846 1609 823 -2574 -1503 -946 302 292 -1854 -492 -1911 -417 333 -1629 -1427 -820 -2267 -3034
736921 -3034 464 2632 1570 -1501 -810 -458 204 768 -1674 -183 410 -178 -751 -3414 -1662 1931
737897 1931 1622 611 -1112 -2410 -2683 -3270 -312 1881 2485 1683 1038 -1487 -2489 -1502 1001 420
738874 420 -637 -769 -1745 -3449 -1465 -396 296 2373 -221 -1617 150 1494 1555 130 832 -221
$$ packed form
731977g40N64m35K943N96j092J24N58k894k702MP99K308J737K86j069k42J49K966
733075C860m92j253p78K018J208k567j084k937Q50M66j215J387J505j504K028
733991A492j025k786j452J871J124K022k529P08P05J589k519m70n86r26j326R27
734968c181J453j069J643K010k93k116j266k35K549J341K657k409m447J106L103
735883H46P63p86l397J071N57J248j0k146J362j419J494P50j962K02O07j447p67
736921c034L498K168j062l071O91L52O62N64k442J491N93n88n73k663J752L593
737897A931l09j011j723j298k73n87K958K193O04q02o45k525j002R87K503n81
738874D20j057j32r76j704J984J069O92K077k594j396J767J344O1j425P02j053
$$ plain form
739851 -221 488 905 -588 -1770 -2677 -275 1205 948 1557 931 2247 678 -449 137 641 221 -2887
740888 -2887 -1604 -1930 -1787 -3425 -2609 -2707 -1327 -1199 -676 -458 -810 -1862 -1201 200 -1578 -305 -772
741926 -772 -1559 -3411 -3347 -2840 -1886 -172 60 -1546 -252 1100 -1033 -7 1486 700 3288 1957
742903 1957 1644 3439 880 -2806 -3232 -1911 -2152 -176 1577 -1058 -1633 -1967 -1688 114 1036 600
743880 600 -821 445 -431 -1255 -2678 -462 1193 -374 645 2674 4045 2051 615 -2341 721
744795 721 230 -3050 -3644 -2149 75 37 -1652 925 1506 1876 1722 946 605 -244 -1685 -1780 -1029 -1766
745894 -1766 -2189 -1404 -1686 -3992 -2695 727 5214 4098 581 588 2604 2355 447 954 1035 792 499
746931 499 14 215 -129 306 825 -1542 -221 4082 3307 1798 -933 -2393 -1899 -238 -631 -308 1432
$$ packed form
739851b21P09M17j493j182r07K402J480k57O09o26J316j569j127N86N04m20l108
740888b887J283l26J43j638Q16r8J380J28N23K18l52j052O61J401j778J273m67
741926g72p87j852O4N07R54J714K32j606J294J352k133J026J493p86K588j331
742903A957l13J795k559l686m26J321k41J976J753k635n75l34K79J802R22m36
743880F00j421J266q76q24j423K216J655j567J019K029J371j994j436k956L062
744795G21m91l280n94J495K224l8j689K577N81L70j54p76l41q49j441r5P51p37
745894a766m23P85k82k306J297L422M487j116l517PK016k49j908N07Q1k43k93
746931D99m85K01l44M35N19k367J321M303p75j509k731j460M94J661l93L23J740
$$ plain form
747969 1432 828 -1692 -2355 -5652 -3177 1681 1352 1415 834 681 1006 -263 206 -186 -1126 -901 -105 -1235
749068 -1235 -2994 -2701 -1905 -1580 4430 3692 541 467 1913 215 -2680 -652 1802 1905 -449 -999
750044 -999 -4566 -4821 -1104 -713 613 2404 3132 -562 -281 -2589 -3744 -1441 -2666 -1739 36 915
751021 915 2677 2432 896 540 -2503 -2733 508 71 -1237 -3040 -2867 -765 -19 1337 1631 -601
751997 -601 1667 1586 484 -758 -1476 1216 1782 355 -342 -1290 -2032 -439 60 1553 207 -965 -1803
753035 -1803 -1304 -3346 -2186 -45 211 1788 1350 -115 -299 -238 -1650 -1364 -1763 -5006 -4555 -2181 -336
754073 -336 -3068 -3848 -3074 -4548 -4429 -888 -1179 -1983 -3707 -3372 -2180 341 -524 744 33 724 874
755111 874 849 1074 2476 1296 -1585 -1424 -1100 161 2254 2321 142 -1024 -1117 -590 -1868 -1080 -951 611
$$ packed form
747969A432o04k520o63l297K475M858l29O3n81j53L25j269M69l92r40K25P96j130
749068a235j759K93P96L25O010p38l151p4J446j698k895K028K454J03k354n50
750044i99l567k55L717L91J326J791P28l694K81k308j155K303j225R27J775Q79
751021I15J762k45j536l56l043k30L241m37j308j803J73K102P46J356K94k232
751997f01K268q1j102j242p18K692N66j427o97r48p42J593M99J493j346j172q38
753035a803M99k042J160K141K56J577m38j465j84O1j412K86l99l243M51K374J845
754073c36k732p80P74j474J19L541k91q04j724L35J192K521q65J268p11O91J50
755111H74k5K25J402j180k881J61L24J261K093O7k179j166r3N27j278P88J29J562
$$ plain form
756209 611 -2250 -2163 16 -3800 -4714 -3676 -2811 -4810 -2562 -1512 -977 -1378 -2349 -3118 -2276 -2552 -1675
757247 -1675 523 721 1271 591 794 2638 3531 3488 1955 -2879 -5891 -4476 450 1305 1005 -1104 2225
758285 2225 1979 -423 2798 3559 809 -330 -1036 -1416 -591 -1581 -3019 -3285 -1749 -2879 -2428 -2701 -2369
759322 -2369 -3724 -3946 -1351 -1465 -1001 -280 586 -266 -1699 -656 -392 1720 1005 312 -2229 -1682 91
760360 91 -384 -1875 -3702 -3251 -2845 280 2428 1707 -2481 -3053 -2407 -4110 -3599 -4387 -2428 -2257 -2103
761398 -2103 -1389 -2289 -3590 -5340 -3362 -2847 -1417 -54 -1299 -1269 99 22 150 213 -294 -728 -1405 -251
762496 -251 -643 972 1250 693 2243 92 -423 -2085 -2731 355 924 -772 -13 -542 -84 2514 1962
763534 1962 1992 2011 347 -3282 -3477 -2227 -565 -850 -2610 -2447 1031 1445 3620 4629 3111 2082
$$ packed form
756209F11k861Q7K179l816r14J038Q65j999K248J050N35m01r71p69Q42k76Q77
757247a675K198J98N50o80K03J844Q93m3j533m834l012J415M926Q55l00k109L329
758285B225k46k402L221P61k750j139p06l80Q25r90j438k66J536j130M51k73L32
759322b369j355k22K595j14M64P21Q66q52j433J043K64K112p15o93k541N47J773
760360I1m75j491j827M51M06L125K148p21m188n72O46j703N11p88J959J71J54
761398b103P14r00j301j750J978N15J430J363j245L0J368p7J28O3n07m34o77J154
762496b51l92J615K78n57J550k151n15j662o46L086N69j696P59n29M58K598n52
763534A962L0J9j664l629j95J250J662k85j760J63L478M14K175J009j518j029
$$ plain form
764510 2082 1918 -336 1657 3431 1349 1495 1880 -361 -1224 -377 -131 1 -1723 -3942 -2825 -1391
765487 -1391 982 1972 1162 605 925 1155 -88 427 1164 268 -1028 1422 -200 -2487 -3407 -2675 -2961
766525 -2961 -1737 -1455 -3906 -3070 -2966 -2289 -1908 -626 341 -1541 -3387 -4166 -2037 43 -1266 -3296
767501 -3296 -2895 -2279 -3223 -1729 -411 -280 -282 -422 -3019 -1459 -1727 -1802 -1957 -2351 -2875 -4196 -4119 -2494
768600 -2494 -1008 1566 2335 1274 -279 -240 -474 -457 1372 1763 883 -436 -3028 -2741 -1693 -3438 -2528
769638 -2528 -814 -720 -2907 -1274 64 -2526 -966 -1661 -1714 -880 -1121 -496 772 1037 1976 3863 652
770676 652 -968 -50 -428 781 8 -1961 -1614 -225 262 2377 1372 726 38 -511 -2340 -1829 -2001
771713 -2001 -2353 -2480 -603 2680 -506 -3061 -2775 -1030 -1134 -457 463 815 1377 1108 -1582 -2387 -4323
$$ packed form
764510B082j64k254J993J774k082J46L85k241q63Q47K46J32j724k219J117J434
765487a391K373R90q10n57L20K30j243N15P37q96j296K450j622k287r20P32k86
766525b961J224K82k451Q36J04O77L81J282R67j882j846p79K129K080j309k030
767501c296M01O16r44J494J318J31kj40k597J560k68p5j55l94n24j321P7J625
768600b494J486K574P69j061j553L9k34J7J829L91q80j319k592K87J048j745R10
769638b528J714R4k187J633J338k590J560o95n3Q34k41O25J268K65R39J887l211
770676F52j620R18l78J209p73j969L47J389M87K115j005o46o88n49j829N11j72
771713b001l52j27J877L283l186k555K86J745j04O77R20L52N62k69k690q05j936
$$ plain form
772751 -4323 -4792 -1849 511 1232 2192 1492 1310 1190 351 1100 1096 193 657 244 229 2121 -201 -1672
773849 -1672 -3314 -2632 -753 -1703 -1855 -995 644 1809 2290 2387 -766 -620 -2397 -2246 -1916 -361 -901
774887 -901 -2982 -2443 -411 184 -454 1419 2577 2000 538 -211 -1458 -1310 -109 -36 1405 798 -770
775925 -770 -1650 -2254 -2656 -3164 -2725 -3623 -4552 -3171 -3521 -859 1933 1887 2298 687 -99 762 1253 1579
777024 1579 1673 1666 2084 1058 1168 -529 393 1230 -219 -1631 1 1248 978 -1400 -1080 241 1642
778061 1642 -336 311 -411 -89 2095 779 -2922 -3945 -266 971 -1345 89 259 -1086 1059
778977 1059 -320 -659 -4309 -2400 -928 -3420 -1716 -2600 -2292 -653 -1289 957 1875 608 -1162 -2750
779953 -2750 -856 -325 -1719 -1912 -2034 -2174 -4195 -1812 -2477 -100 2410 2395 -149 -1632 -1495 -955 -467
$$ packed form
772751d323m69K943K360P21R60p00j82j20q39P49mr03M64m13j5J892k322j471
773849a672j642O82J879r50j52Q60J639J165M81R7l153J46j777J51L30J555n40
774887i01k081N39K032N95o38J873J158n77j462p49j247J48J201P3J441o07j568
775925g70q80o04m02n08M39q98r29J381l50K662K792m6M11j611p86Q61M91L26
777024A579R4pM18j026J10j697R22Q37j449j412J632J247k70k378L20J321J401
778061A642j978O47p22L22K184j316l701j023L679J237k316J434J70j345K145
778977A059j379l39l650J909J472k492J704q84L08J639o36K246R18j267j770j588
779953b750J894N31j394j93j22j40k021K383o65K377K510j5k544j483J37N40M88
$$ plain form
780991 -467 -1811 -1727 -1304 -1926 -2057 -2567 -2796 -2928 -2212 -618 86 840 -253 -1476 -2068 -2320 -770 -1226
782090 -1226 -1380 -511 960 -2016 -4408 -3228 -1006 -530 -999 -897 -164 1524 -1659 -3004 -1522 358
783066 358 2471 1132 2158 4912 5523 4849 3399 1364 471 -1077 -274 574 343 974 -1674 -3088
784043 -3088 -2409 -2768 -1389 -1855 -634 666 -1602 -331 2296 405 69 -2787 -3190 147 1122 -2000
785020 -2000 -2858 -1975 683 -865 -1333 -788 657 368 1280 1395 -363 -2169 -4646 -3973 -1536 -310
785996 -310 18 -158 311 1027 1219 -286 -1382 -1051 -31 -1794 -1934 -1604 -229 902 -68 -664 -1217
787034 -1217 591 2779 1948 7 361 1804 764 -2536 -3666 -4520 -3325 -1265 -973 -2521 -1897 82
788011 82 -1839 -1717 -3485 -3521 -2482 -2630 1351 1407 -215 -372 2408 3768 5984 7335 4100 3320 3457
$$ packed form
780991d67j344Q4M23o22j31n10k29j32P16J594P04P54j093j223n92k52J550m56
782090a226j54Q69J471k976k392J180K222M76m69J02P33J688l183j345J482J880
783066C58K113j339J026K754O11o74j450k035q93j548Q03Q48k31O31k648j414
784043c088O79l59J379m66J221J300k268J271K627j891l36k856m03L337R75l122
785020b000q58Q83K658j548m68N45J445k89R12J15j758j806k477O73K437J226
785996c10L28j76M69P16J92j505j096L31J020j763j40L30J375J131r70n96n53
787034a217J808K188q31j941L54J443j040l300j130q54J195K060K92j548O24J979
788011H2j921J22j768l6J039j48L981N6j622j57K780J360K216J351l235p80J37
$$ plain form
789048 3457 2277 2198 2005 1254 475 -1613 -4100 -4571 -4832 -3130 -2451 -3405 -3029 -3297 -2169 -2008 -2399 -2315
790147 -2315 -81 1974 1210 -517 -1278 -2491 -1202 1566 1133 -66 -888 -1474 -935 210 1174 1408
791123 1408 1018 -1472 -4426 -2389 -3144 -4667 -3746 -4692 -3088 1858 1833 -2890 -4961 -5359 -4911 -4245 -3993
792161 -3993 -2513 -1925 -1849 -1876 -461 2220 2768 -60 -310 472 -1033 -2085 -1843 -654 2854 2639 409
793199 409 936 2671 1831 -1119 -827 1284 -369 -691 1348 875 -3045 -4445 -2463 305 2065 726
794176 726 -500 -1804 -1735 601 295 -1553 -1030 -88 -610 585 -883 -1989 -1862 -1967 637 223 260
795213 260 1499 -645 -3182 -1530 -756 -1500 725 -211 -903 -1902 -1178 672 237 472 1674 -1738 -4257
796251 -4257 -5216 -3739 -2141 -2107 -239 84 2022 -608 -3442 -3427 -1309 -2434 -5231 -4094 -3804 -3052
$$ packed form
789048C457j180p9j93p51p79k088k487m71k61J702O79r54L76k68J128J61l91Q4
790147b315K234K055p64j727p61j213J289K768m33j199q22n86N39J145R64K34
791123A408l90k490k954K037p55j523R21r46J604M946k5m723k071l98M48O66K52
792161c993J480N88P6k7J415K681N48k828k50P82j505j052K42J189L508k15k230
793199D09N27J735q40k950K92K111j653l22K039m73l920j400J982K768J760j339
794176G26j226j304O9K336l06j848N23R42n22J195j468j106J27j05K604m14L7
795213B60J239k144k537J652P74p44K225r36o92r99P24J850m35K35J202l412k519
796251d257r59J477J598L4J868L23J938k630k834J5K118j125k797J137K90P52
$$ plain form
797227 -3052 -2555 -1258 -1092 -161 1198 1763 736 -2464 -1999 128 100 -185 2855 2830 727 1325 1314 646
798326 646 847 960 819 428 648 -621 820 568 -2524 -2021 -2810 -3839 -1699 -1992 -319 560 -826
799364 -826 -553 532 -474 820 1421 1536 -1730 -3914 -2924 -722 -282 -1988 -3255 -1972 1941 1414
800340 1414 -483 1709 3803 3913 4441 3856 3429 5811 1515 530 -2689 -2909 -690 -335 -2816 -2210
801317 -2210 -976 -2740 -3896 -1836 1129 861 692 -849 -724 23 -1417 -474 -497 -509 298 516 719
802354 719 264 -3101 -95 1010 218 1163 -244 -3394 -1111 -3258 -1452 1483 2003 2301 2968 4690
803331 4690 2986 -145 -543 65 552 -447 -1022 233 -1698 -2583 325 48 -528 142 706 1169 360
804369 360 310 -589 -1900 -1594 171 1651 2697 951 1828 3700 3568 2984 1269 120 1826 2432 2357
$$ packed form
797227c052M97J297J66R31J359N65j027l200M65K127k8k85L040k5k103N98j1o68
798326F46K01J13j41l91K20j269J441k52l092N03p89j029K140k93J673Q79j386
799364h26K73J085j006J294O01J15l266k184R90K202M40j706j267J283L913n27
800340A414j897K192K094J10N28n85m27K382m296r85l219k20K219L55k481O06
801317b210J234j764j156K060K965k68j69j541J25P47j440R43k3j2Q07K18K03
802354G19m55l365L006J105p92R45j407l150K283k147J806K935N20K98O67J722
803331D690j704l131l98O08M87r99n75J255j931q85K908k77n76O70N64M63q09
804369C60n0q99j311L06J765J480J046j746Q77J872j32n84j715j149J706O06p5
$$ plain form
805407 2357 626 -1845 -996 316 1325 37 292 -2026 -3315 -947 -1103 -1466 -846 -771 518 1110
806383 1110 2294 1541 -15 622 567 660 -763 739 1929 1805 2288 3864 5460 3339 5302 4049
807360 4049 3443 2775 2786 876 -465 964 -723 -834 -1597 125 3151 4353 4130 9789 23124 25426
808336 25426 15009 8840 9848 8354 5337 4579 4573 3600 1348 -1014 -1785 -674 580 923 1796 974
809313 974 -485 -1278 -488 463 -269 -936 -1939 -3075 -3186 -2073 864 677 -1347 793 1849 805
810290 805 1110 376 1642 -1 -2252 -1469 748 -637 -2726 -1947 -2383 -3487 -1782 -34 1821 1735
811266 1735 734 -505 1311 -776 491 -1 -1261 -2867 -2489 1126 773 -1185 -899 -2487 -351
812182 -351 1908 -134 771 835 -174 1118 1313 2156 -150 -1741 313 1757 1759 541 -986 -859 -485
$$ packed form
805407B357j731k471Q49J312J009j288K55k318j289K368j56l63O20P5J289N92
806383A110J184p53j556O37n5R3j423J502J190j24M83J576J596k121J963j253
807360D049o06o68J1j910j341J429j687j11p63J722L026J202k23N659J3335K302
808336B5426j0417o169J008j494l017p58or73k252k362p71J111J254L43Q73q22
809313I74j459p93P90R51p32o67j003j136j11J113K937j87k024K140J056j044
810290H05L05p34J266j643k251P83K217j385k089P79m36j104J705J748J855q6
811266A735j001j239J816k087J267m92j260j606L78L615l53j958K86j588K136
812182c51K259k042R05O4j009J292J95Q43k306j591K054J444Kj218j527J27L74
$$ plain form
813219 -485 -30 -54 -959 -1520 -2343 -1941 -664 -1022 363 -994 -2121 -3364 -1910 -603 -648 -1152 -1885 -2212
814318 -2212 -2733 -3135 -4627 -3657 -3086 780 1962 1386 156 -4135 -2974 -1789 -908 -1850 -2484 -1028
815295 -1028 282 -923 -2257 -2687 -1268 -2163 -2405 -1695 98 -718 -938 -701 -2241 -4686 -3705 -3361 54
816333 54 -712 -3463 -2772 -3372 -3469 -1068 -1627 -2393 -2129 -1112 -893 -312 -1399 -3043 -2691 -1271 2491 -1821
817431 -1821 -3864 -5626 -2800 -1247 -1477 -2007 -1520 -4310 -2544 -1314 -998 -1337 -2885 -3506 -3363 -3567
818408 -3567 -3434 -1845 -475 -1589 -1371 40 1676 2772 2354 3045 1372 -586 2108 1174 -153 -342
819385 -342 -1406 -1028 312 941 1829 1323 -1415 -2898 -2727 -2237 -2817 -1880 -282 974 -1006 -1881 -1489
820422 -1489 -1323 676 1673 -980 -1485 -726 2802 4105 3393 3345 3245 2552 2149 1732 -929 -4522 -3688
$$ packed form
813219d85M55k4r05n61q23M02J277l58J385j357j127j243J454J307m5n04p33l27
814318b212n21m02j492R70N71L866J182n76j230m291J161J185Q81r42o34J456
815295a028J310j205j334m30J419q95k42P10J793q16k20K37j540k445R81L44L415
816333E4p66k751O91o00r7K401n59p66K64J017K19N81j087j644L52J420L762m312
817431a821k043j762K826J553k30n30M87k790J766J230L16l39j548o21J43k04
818408c567J33J589J370j114K18J411J636J096m18O91j673j958K694r34j327j89
819385c42j064L78J340O29Q88n06k738j483J71M90n80R37J598J256j980q75L92
820422a489J66J999R97k653n05P59L528J303p12m8j00o93m03m17k661l593Q34
$$ plain form
821460 -3688 -2179 -965 1885 1516 -149 1527 3782 2171 -364 -2615 -3914 -3008 -2191 -1324 680
822375 680 -464 -3845 -4187 -3626 -1137 1183 -550 -1936 -3452 -3736 -1928 -1644 -2244 -2308 1348 1256 -547
823413 -547 864 -1190 -1442 -195 -447 -978 -1061 -1200 -10 -98 -1339 -525 1169 1086 3321 1059 1300 2386
824512 2386 1262 -590 141 -989 -2117 -2047 -1716 -1887 -278 701 1317 -693 -2483 -1449 646 390
825488 390 16 -1320 -550 -556 -1830 -1798 -52 2942 3809 2027 2720 -497 612 143 1513 167 -1222
826526 -1222 494 -140 -716 -1140 -632 115 1853 462 161 -285 -2198 -3651 -2555 94 3329 3004
827503 3004 3086 3823 2261 995 -1466 -1376 -222 427 1182 -554 -651 -692 -3180 -3655 -3604 -1761 -2347 -1096
828601 -1096 -2072 -4917 -3453 -1742 -2306 -1779 -1407 -2503 -2332 961 1266 688 -712 834 375 -88 -1108
$$ packed form
821460c688J509J214K850l69j665J676K255j611k535k251j299R06Q17Q67K004
822375F80j144l381l42N61K489K320j733j386j516k84J808K84o00o4L656r2j803
823413e47J411k054k52J247k52n31q3j39J190q8j241Q14J694q3K235k262K41J086
824512B386j124j852P31j130j128P0L31j71J609R79O16k010j790J034K095k56
825488C90l74j336P70oj274L2J746K994Q67j782O93l217J109m69J370j346j389
826526a222J716o34n76m24N08P47J738j391l01m46j913j453J096K649L235l25
827503C004Q2P37j562j266k461R0J154O49P55j736r7m1k488m75N1J843n86J251
828601a096r76k845J464J711n64N27L72j096J71L293L05n78j400J546m59m63j020
$$ plain form
829639 -1108 -3355 -3124 -3226 -1884 380 -249 1003 -169 -1850 -675 260 -81 240 -768 -1187 -1512
830616 -1512 -2949 -1069 -819 -1230 -754 -3254 -719 1721 1156 2120 5835 3274 -391 725 447 -1215
831592 -1215 43 165 1280 1568 1699 3079 2544 1505 2420 1758 1374 2092 1825 2553 1937 759 298
832630 298 -1117 -2700 -2861 -1476 7 619 72 -541 -59 -3497 -2381 594 1264 414 -725 -2928
833606 -2928 -1129 3110 2415 1077 1227 1718 3471 3445 2253 2426 1532 -502 1084 3117 3247 3969 3074
834644 3074 2262 1209 -326 -1132 -978 -958 390 -1419 -4024 -4061 -4092 -4057 -2523 571 623 -1584 -977 -1284
835743 -1284 -947 -969 -1832 -1421 -409 994 1560 2973 5500 5353 1645 -685 -727 308 2032 1149 -11
836781 -11 1052 1148 3656 1860 -613 -601 1122 305 -1028 -418 1184 976 740 1885 808 1341 1329 2210
$$ packed form
829639a108k247K31j02J342K264o29J252j172j681J175R35l41L21j008m19l25
830616a512j437J880K50m11M76k500K535K440n65R64L715k561l665J116k78j662
831592a215J258J22J115K88J31J380n35j039R15o62l84P18k67P28o16j178m61
832630B98j415j583j61J385J483O12n47o13M82l438J116K975O70q50j139k203
833606b928J799M239o95j338J50M91J753k6j192J73q94k034J586K033J30P22q95
834644C074q12j053j535q06J54K0J348j809k605l7l1L5J534L094N2k207O07l07
835743a284L37k2q63M11J012J403N66J413K527j47l708k330m2J035J724q83j160
836781a1J063R6K508j796k473J2J723q17j333O10J602k08k36J145j077N33j2Q81
$$ plain form
837879 2210 1391 2267 2246 621 -2421 -4913 -3565 -1876 -1214 -1053 -1648 -1598 -2507 -4017 -2002 -262 -1446
838917 -1446 -1713 -2686 -3476 -3186 -2020 -3155 -3136 -336 2206 1703 1332 -157 -859 2171 2512 519 -187
839954 -187 550 999 -1492 -314 -1371 -3089 -4946 -3544 -1429 87 299 505 2233 2446 2900 1475
840931 1475 976 1920 2442 842 -849 -594 -974 -424 1264 1275 -2215 0 3167 1883 466 -2062
841908 -2062 -3714 -2326 59 1277 -695 -661 -910 -1329 -1690 -2131 86 860 2743 1902 -551 233 1725
842946 1725 2163 372 171 986 2047 -315 -4150 -3662 -3157 -1753 -2269 -2443 -340 -95 -998 -2784 -2845
843983 -2845 -1306 881 2750 2474 -1096 -1703 -1358 -1521 -2074 -3436 -2425 -383 -219 -3238 -4622 -3976
844960 -3976 -4362 -2422 -1637 -3101 -4533 -4996 -3559 -2963 -1602 -4093 -5586 -4490 -2871 -3466 -1452 -1369
$$ packed form
837879B210q19Q76k1j625l042k492J348J689O62J61n95N0r09j510K015J740j184
838917a446k67r73p90K90J166j135J9K800K542n03l71j489p02L030L41j993p06
839954a87P37M49k491J178j057j718j857J402K115J516K12K06J728K13M54j425
840931A475m99R44N22j600j691K55l80N50J688J1l490K215L167j284j417k528
841908b062j652J388K385J218j972L4k49m19l61m41K217P74J883q41k453P84J492
842946A725M38j791k01Q15J061k362l835M88N05J404n16j74K103K45r03j786o1
843983b845J539K187J869k76l570o07L45j63n53j362J011K042J64l019j384O46
844960c976l86J940P85j464j432m63J437N96J361k491j493J096J619n95K014Q3
$$ plain form
845936 -1369 -1341 -3058 -2024 -1717 -3527 -3436 -3410 -4911 -2265 -389 -596 -2991 -3011 -3356 -4116 -4103 -3360 -3809
847035 -3809 -6199 -4871 -2940 -3012 -4052 -4375 -4024 -2541 -1371 -1443 -3836 -4503 -2011 -47 547 -713
848012 -713 -1244 -1572 -3500 -2035 -13 2381 1739 311 -97 2291 3909 1778 -1874 -2056 -1463 -2198
848988 -2198 -2875 -1113 -631 -187 -500 -61 1091 -484 -158 1230 763 1598 1836 -83 -1476 311 -855
850026 -855 -128 524 -2544 -2188 -2314 -1193 1214 1297 249 202 256 1627 2086 -889 -1808 -575 320 123
851124 123 -1286 -788 -598 -146 -796 -496 329 2406 2384 1019 2240 2045 502 -929 -1638 -680 147 1641
852223 1641 873 2136 2036 1220 -654 -997 887 882 1494 1083 100 -2068 -1287 -1925 -545 4156 5089 2949
853322 2949 1436 584 1951 3884 314 374 264 7 -1470 -1114 778 2652 676 -2114 -1121 138
$$ packed form
845936a369K8j717J034L07j810R1K6j501K646J876k07k395k0l45p60J3P43m49
847035c809k390J328J931p2j040l23L51J483J170p2k393o67K492J964N94j260
848012g13n31l28j928J465K022K394o42j428m08K388J618k131l652j82N93p35
848988b198o77J762M82M44l13M39J152j575L26J388m67Q35K38j919j393J787j166
850026h55P27O52l068L56j26J121K407Q3j048m7N4J371M59k975r19J233Q95j97
851124A23j409M98J90M52o50L00Q25K077k2j365J221j95j543j431p09R58Q27J494
852223A641p68J263j00q16j874l43J884nO12m11r83k168P81o38J380M701R33k140
853322B949j513q52J367J933l570O0j10k57j477L56J892J874j976k790R93J259
$$ plain form
854299 138 -569 1266 1813 1517 811 1749 3911 1551 -20 2075 802 453 1666 967 1218 2525 1817
855336 1817 1287 1784 2544 1901 687 -831 -518 -1016 -1776 -1619 -1859 312 787 2437 3779 2914 1261
856374 1261 660 153 1307 2437 185 987 1505 521 877 -1625 -3579 -1197 -425 397 -1269 387
857351 387 -1044 -1769 -2999 -2734 -2037 -1427 -1832 -347 -569 -782 -632 687 2354 323 -1203 -3353 -2071
858388 -2071 -427 -1011 -2067 -1214 -841 -2876 -2147 -2014 -3024 -3339 -3558 -1275 663 555 846 -2859 -1618
859426 -1618 2016 3214 3093 1697 878 95 788 1497 500 -502 -154 1410 1949 987 -590 -1607 -2568
860464 -2568 -3662 -1238 -215 525 -499 291 -112 1409 -709 -1475 -1377 -1189 -1421 559 377 -579 -2050
861501 -2050 -5589 -4647 -1756 -923 -872 -1092 2035 1708 1173 173 2310 1118 2639 2659 1651 2928 1841
$$ packed form
854299A38p07J835N47k96p06R38K162k360j571K095j273l49J213o99K51J307p08
855336A817n30M97P60o43j214j518L13m98p60J57k40K171M75J650J342q65j653
856374A261o01n07J154J130k252Q02N18r84L56k502j954K382P72Q22j666J656
857351C87j431p25j230K65O97O10m05J485k22k13J50J319J667k031j526k150J282
858388b071J644n84j056Q53L73k035P29J33j010l15k19K283J938j08K91l705J241
859426a618L634J198j21j396q19p83O93P09r97j002L48J564N39r62j577j017r61
860464b568j094K424J023P40j024P90m03J521k118p66R8J88k32J980j82r56j471
861501b050l539R42K891Q33N1k20L127l27n35j000K137j192J521K0j008J277j087
$$ plain form
862539 1841 1697 1612 -26 -1282 -2465 -1785 -472 -366 -975 -1481 -524 735 40 152 -2273 -1727 -2215
863577 -2215 248 2996 1112 -952 -2200 -2072 -1901 -2859 -2552 -1294 1483 3119 1835 -76 -776 106
864553 106 -188 1476 2379 -118 -1743 -3119 -1846 -3145 -1895 1233 435 -2387 -1411 -1450 -526 -220 499
865591 499 -1097 -1521 -2049 -110 1426 852 -146 -1925 -134 1979 2733 -1584 -158 2719 2138 1135
866567 1135 2212 1396 -642 -391 -996 -1314 -2002 -425 -187 -11 -257 -1705 -1079 -476 1297 555 -1456
867605 -1456 -1567 -3937 -3343 -952 2440 184 -1628 -1643 -765 -74 1412 1436 2322 3802 2013 2926 3336
868643 3336 2650 156 132 -1558 -2410 -677 -2118 -4254 -3835 -552 -1233 -1868 -605 -1570 -2247 -3260 -2054
869681 -2054 -668 637 -74 -1249 -251 524 -564 -1623 1161 1668 2010 1103 452 631 -121 868 1092
$$ packed form
862539A841j44q5j638j256j183O80J313J06o09n06R57J259o95J12k425N46m88
863577b215K463K748j884k064j248J28J71r58L07J258K777J636j284j911p00Q82
864553A06k94J664R03k497j625j376J273j299J250L128p98k822R76l9R24L06P19
865591D99j596m24n28J939J536n74r98j779J791K113P54m317J426K877n81j003
866567A135J077q16k038K51o05l18o88J577K38J76k46j448O26O03J773p42k011
867605a456j11k370N94K391L392k256j812j5Q78O91J486K4Q86J480j789R13M10
868643C336o86k494k4j690q52J733j441k136M19L283o81o35J263r65o77j013J206
869681b054J386J305p11j175R98P75j088j059K784N07L42r07o51J79p52R89K24
$$ plain form
870718 1092 349 313 410 -437 -2080 -1701 -3802 -3896 -3624 -2840 -3360 -2305 -865 -208 1247 -219 -649 -1095
871817 -1095 -2725 -3914 -2998 -494 54 -1168 -293 567 757 -997 -95 -216 185 -3551 -3623 -2466 -5162
872854 -5162 -5864 -5961 -2148 -3552 -4319 -3167 -4181 -3902 -1920 -1943 -2238 -1115 -1468 -3347 -3440 -2857 -2071 -2415
873953 -2415 -2330 -811 -1292 -1746 -811 -612 -1362 -1161 -1317 -2518 -1761 -3509 -3232 -2954 -1728 -1340 -2448 -1933
875052 -1933 -159 -175 138 1145 1494 -774 -1774 -1019 -10 180 -927 -3525 -2299 -1163 -881 -366
876029 -366 -1713 -1288 -867 -473 -2195 -2238 254 1152 848 1114 -733 263 946 970 2907 1441 -1380 -3039
877127 -3039 -951 3316 3323 586 1299 4083 3353 2807 140 -2960 -2154 -1332 -1093 70 187 -1380 96
878165 96 -893 -1284 -773 1312 126 417 1711 2434 -540 -331 1341 3834 4693 4178 -96 -579 -615 -1931
$$ packed form
870718A092p43l6R7q47j643L79k101r4K72P84n20J055J440O57J455j466m30m46
871817a095j630j189R16K504N48j222Q75Q60J90j754R02j21M01l736p2J157k696
872854e162p02r7L813j404p67J152j014K79J982k3k95J123l53j879r3N83P86l44
873953b415Q5J519m81m54R35J99p50K01j56j201P57j748K77K78J226L88j108N15
875052a933J774j6L13J007L49k268j000P55J009J90j107k598J226J136K82N15
876029c66j347M25M21L94j722m3K492Q98l04K66j847R96O83K4J937j466k821j659
877127c039K088M267Pk737P13K784p30n46k667l100Q06Q22K39J163J17j567J476
878165I6r89l91N11K085j186K91J294P23k974K09J672K493Q59n15m274m83l6j316
$$ plain form
879263 -1931 -4101 -3427 -1529 83 1040 -304 -2380 -3800 -5040 -2453 684 -1296 -1082 1991 -779
880179 -779 -1987 -3287 -1526 18 657 35 -1353 -1051 497 -1611 -4026 -1785 -1246 -2117 -260 -906
881156 -906 -199 -1646 -937 -2054 -2554 -277 252 -59 1360 4123 3408 3110 2157 -376 -232 -2108 -5107
882193 -5107 -4317 -3979 -2333 -2270 -1747 -949 -1597 -283 1774 1189 353 151 25 -3527 -1522 -804 101 -656
883292 -656 -346 984 993 -685 -2459 -3104 -3412 -4481 -3894 -3630 -3543 -2819 -1083 -2265 -1496 -426 772 1507
884391 1507 -2398 -2798 -718 867 549 -2056 -1132 -3969 -667 990 154 -1793 -1959 -511 100 443
885367 443 -1512 -675 -559 -376 -161 -3177 -3911 -2566 -654 344 1236 1075 -583 -1092 -1001 1693 587
886405 587 -694 -481 304 -437 156 -234 1694 515 -941 -677 -684 413 -939 -857 -268 60 93 889 -652
$$ packed form
879263a931k170O74J898J612R57j344k076j420j240K587L137j980K14L073k770
880179g79j208j300J761J544O39o22j388L02J548k108k415K241N39q71J857o46
881156i06P07j447P09j117n00K277N29l11J419K763p15k98r53k533J44j876k999
882193e107P90L38J646O3N23P98o48J314K057n85q36k02j26l552K005P18R05p57
883292f56L10J330Rj678j774o45l08j069N87K64Q7P24J736j182P69J070J198P35
884391A507l905m00K080J585l18k605R24k837L302J657q36j947j66J448O11L43
885367D43j955Q37J16J83K15l016p34J345J912R98Q92j61j658n09R1K694j106
886405E87j281K13P85p41N93l90J928j179j456K64pJ097j352Q2N89L28L3P96j541
$$ plain form
887565 -652 -1352 -2587 -941 195 -482 -929 851 867 518 386 -1169 -12 -412 -2439 -3067 -1520 -909
888602 -909 -560 -2444 -378 -1424 -1752 -940 -1282 -300 310 -424 -659 -277 1240 3118 1039 -1419 -3792
889640 -3792 -4748 -4826 -4190 -1339 -1621 -431 1040 -561 -3594 -265 604 -349 -1854 -1733 -1014 -594 -792
890678 -792 151 -218 86 -187 -1816 -799 840 1714 70 348 2140 2082 574 -716 -1464 -2193 -3763
891716 -3763 -2477 48 244 -689 -2365 -3624 -3021 -2394 -1021 -124 936 633 -1321 1007 1293 -453
892692 -453 -2486 -3713 -2423 -2484 -2286 -2379 -882 -2164 -4794 -3852 -5906 -3248 -298 1390 1625 1165 -1030
893730 -1030 -913 -2562 1067 2050 164 -1756 -1376 -2209 -2419 -188 -1744 -1722 -3230 -2977 -1649 -1314 1883
894767 1883 182 -766 -1065 -1362 -366 2219 299 -947 -171 1033 -1319 -1957 -378 1073 141 920
$$ packed form
887565f52p00j235J646J136o77m47J780J6l49j32j555J157m00k027o28J547O11
888602i09L49j884K066j046l28Q12l42R82O10p34k35L82J517J878k079k458k373
889640c792r56p8O36K851k82J190J471j601l033L329Q69r53j505J21P19M20j98
890678g92R43l69L04k73j629J017J639Q74j644K78J792n8j508j290p48p29j570
891716c763J286K525J96r33j676j259O03O27J373Q97J060l03j954K328K86j746
892692d53k033j227J290o1J98r3J497j282k630R42k054K658K950J688K35m60k195
893730a030J17j649L629R83j886j920L80q33k10K231j556K2j508K53J328L35L197
894767A883j701r48k99k97R96K585j920j246P76J204k352o38J579J451r32P79
$$ plain form
895744 920 661 871 125 -548 722 1307 2763 1552 1073 1288 -468 -1197 -1984 -1407 926 723 1007 -1627
896843 -1627 -730 -872 -1376 -911 -736 -1098 -3827 -3679 -4900 -3169 -2471 -4158 -4266 -3209 -613 -150 353
897881 353 -2604 -2356 457 1828 2304 2388 1209 -531 -2676 -2690 -3214 -2892 -703 154 -733 7 -481 152
898979 152 1013 -1200 -2317 -3224 114 1263 1689 841 560 1739 2802 -460 -1046 55 -460 1496
899956 1496 1523 -679 -3950 -4952 -5450 -3899 -1248 -459 94 -1126 -1418 -1599 -741 -899 -1848 -561 -1180
900993 -1180 61 -1264 -2259 -1689 126 1050 -950 -1550 -1494 -407 -1521 -963 -2430 -1411 -2047 -3082
901970 -3082 -854 1022 -1626 -1970 -4384 -2921 -1562 509 -1648 -1233 -3036 -1881 428 2384 1667
902886 1667 51 -1651 -1221 -752 -1735 -3473 -2090 1314 640 -1089 -1962 -2154 -428 1181 -218 -231
$$ packed form
895744I20k59K10p46o73J270N85J456j211m79K15j756p29p87N77K333k03K84k634
896843a627Q97j42n04M65J75l62k729J48j221J731O98j687j08J057K596M63N03
897881C53k957K48K813J371M76Q4j179j740k145j4n24L22K189Q57q87P40m88O33
898979A52Q61k213j117r07L338J149M26q48k81J179J063l262n86J101n15J956
899956A496K7k202l271j002m98J551K651P89N53j220k92j81Q58j58r49J287o19
900993a180J241j325r95N70J815R24k000o00N6J087j114N58j467J019o36j035
901970c082K228J876k648l44k414J463J359K071k157M15j803J155K309J956p17
902886A667j616j702M30M69r83j738J383L404o74j729q73j92J726J609j399j3
$$ plain form
903862 -231 -296 -1264 -430 -586 402 -536 -1549 1219 -1954 -2135 -1616 -876 -1660 142 1810 585 895 -1136
904961 -1136 -3067 -3076 -2870 -663 -738 649 3239 2639 -596 -1210 -138 1086 1095 -68 -352 -2337 -3157 -2546
906060 -2546 -2661 -618 2241 1204 831 -4 -814 -1586 -1489 -1744 -4332 -5295 -2524 -1043 -1095 -711 -892 1046
907158 1046 401 -3728 -842 -774 -612 -2110 -2161 -670 -1903 607 2935 3772 3323 2653 1364 1318 1204
908196 1204 120 -573 -1002 -2276 654 1110 -754 383 2700 806 -148 -1852 -2934 -454 -457 -685
909173 -685 -4599 -4088 -2573 -2406 -973 -2425 -4926 -5319 -2982 -1506 -1500 -566 -248 -86 1313 11 -357
910210 -357 -1770 -3726 -1631 -446 2651 2853 2198 543 -1620 -1380 -2421 -1813 -2249 -5 -163 -1990
911187 -1990 -1802 -707 -1926 -316 736 -601 547 -1895 -2785 1088 3731 160 -583 553 338
$$ packed form
903862b31o5r68Q34j56R88r38j013K768l173j81N19P40p84J802J668j225L10k031
904961a136j931rK06K207p5J387K590o00l235o14J072J224Rj163k84j985q20O11
906060b546j15K043K859j037l73q35q10p72R7k55k588r63K771J481n2L84j81J938
907158A046o45m129K886O8J62j498n1J491j233K510K328Q37m49o70j289m6j14
908196A204j084o93m29j274K930M56j864J137K317j894r54j704j082K480lk28
909173f85l914N11J515J67J433j452k501l93K337J476OR34L18J62J399j302l68
910210c57j413j956K095J185L097K02o55j655k163K40j041O08m36K244j58j827
911187a990J88J095j219J610J052j337J148k442q90L873K643l571p43J136k15
$$ plain form
912102 338 -592 -794 -2535 -2413 -1441 158 108 1422 589 -82 3384 5332 1546 -2563 -3300 -2374 -2239
913140 -2239 530 786 120 -1873 -4344 -2268 -306 559 195 1704 762 3531 136 -1826 511 1575
$$ packed form
912102C38r30k02j741J22R72J599n0J314q33o71L466J948l786m109p37R26J35
913140b239K769K56o66j993k471K076J962Q65l64J509r42K769l395j962K337J064
$$ [...]
##END=
