##TITLE= PTOLUALDEHYDE
##JCAMP-DX= 5.00 $$From Command Line Converter 1.0
##DATA TYPE= NMR Spectrum
##DATA CLASS=  XYDATA

##ORIGIN= Exported from Command Line Converter 1.0
##OWNER= SVB
##$URL= http://wwwchem.uwimona.edu.jm:1104/software/jcampdx.html
##SPECTROMETER/DATA SYSTEM= NUTS EXPORT
##.OBSERVE FREQUENCY= 300.149506
##.OBSERVE NUCLEUS= ^1H
##INSTRUMENTAL PARAMETERS= 1H
##XUNITS= PPM
##YUNITS= ARBITRARY UNITS
##XFACTOR= 0.0000133267
##YFACTOR= 6.8481030000
##FIRSTX=  -1.637507
##FIRSTY= -5740.000000
##LASTX=  11.689200
##NPOINTS= 32768
##MAXY= 6714735.000000
##MINY= -133368.000000
##DELTAX=   0.000407
##XYDATA= (X++(Y..Y))
$$ plain form
-122875 -839 -814 -785 -750 -719 -715 -750 -800 -835 -855 -864 -842 -791 -759 -775 -811 -841 -879 -915 -910 -846 -766 -729 -751 -781 -763 -718 -729 -819 -906 -915 -857
-121929 -857 -795 -776 -814 -878 -921 -925 -901 -858 -809 -794 -822 -842 -811 -756 -739 -773 -811 -819 -813 -821 -836 -838 -822 -806 -802 -794 -766 -736 -730 -754 -804 -863 -888
-120925 -888 -850 -781 -746 -774 -836 -883 -894 -893 -897 -884 -845 -823 -856 -908 -917 -875 -826 -811 -828 -843 -825 -787 -775 -810 -844 -829 -789 -775 -793 -813
-120009 -813 -822 -823 -819 -805 -781 -758 -754 -766 -769 -746 -717 -718 -757 -816 -859 -848 -774 -702 -709 -786 -839 -808 -737 -702 -719 -754 -785 -821 -861 -875 -843 -790
-119033 -790 -751 -748 -769 -786 -789 -798 -818 -832 -829 -816 -803 -802 -813 -814 -791 -774 -788 -806 -790 -747 -703 -684 -697 -728 -758 -802 -869 -921 -914 -859 -813 -818 -848
-118021 -848 -854 -838 -840 -856 -842 -796 -765 -771 -791 -795 -793 -819 -866 -894 -887 -866 -852 -849 -844 -817 -781 -770 -781 -786 -782 -781 -785 -802 -852 -920 -935 -858 -745 -687
-116984 -687 -705 -759 -797 -805 -800 -791 -769 -732 -704 -716 -765 -811 -816 -788 -770 -790 -837 -880 -900 -890 -852 -809 -791 -798 -805 -805 -818 -836 -827 -797 -785 -775 -727
-115980 -727 -670 -676 -763 -878 -949 -942 -885 -842 -857 -908 -930 -894 -831 -792 -787 -786 -771 -760 -766 -774 -767 -759 -767 -788 -816 -859 -901 -894 -832 -773 -767 -806 -844 -839
$$ packed form
-122875h39K5K9L5L1Ml5n0l5k0rK2N1L2j6l6l0l8l6NO4Q0L7k2l0J8M5j1r0q7rN8
-121929h57O2J9l8o4m3mK4M3M9J5k8k0L1N5J7l4l8qOqj5kJ6J6MQK8L0Ok4n0n9k5
-120925h88L8O9L5k8o2m7j1JmJ3L9K2l3n2rM2M9J5j7j5J8L8J2l5l4J5M0J4j8k0
-120009h13rjMJ4K4K3Mj2lK3K9jl9n9m3J1P4P2pp7n3L1P1L5j7l5l1l6m0j4L2N3
-119033g90L9Lk1j7lrk0j4LJ3J3Jj1jK3J7j4j8J6M3M4J9j3l1l0m4o7n2PN5M6nl0
-118021h48oJ6kj6J4M6L1ok0mKk6m7k8PK1J4LNK7L6J1j1nMJmj7n0o8j5P7J13N8
-116984f87j8n4l8qNRK2L7K8j2m9m6nK8J8k0m7m3k0J0L8M3J8pp%j3j8RL0J2J0M8
-115980g27N7oq7j15p1PN7M3j5n1k2L6O3L9NJJ5J1oqPQqk1k8m3m2PO2N9Ol9l8N
$$ plain form
-114938 -839 -790 -730 -696 -703 -744 -805 -869 -901 -875 -824 -807 -829 -839 -810 -779 -787 -824 -845 -820 -771 -742 -745 -747 -732 -738 -811 -914 -958 -914 -843 -815
-113992 -815 -818 -800 -757 -740 -764 -791 -784 -753 -727 -725 -744 -780 -827 -867 -894 -911 -903 -845 -761 -715 -730 -759 -752 -724 -722 -761 -812 -839 -837 -829 -824 -812 -803 -815
-112954 -815 -829 -804 -734 -668 -662 -730 -830 -893 -878 -797 -720 -709 -764 -823 -830 -780 -723 -716 -756 -789 -776 -747 -753 -799 -832 -816 -775 -746 -732 -715
-112039 -715 -705 -727 -775 -815 -823 -805 -772 -745 -757 -817 -871 -856 -785 -736 -763 -825 -842 -786 -713 -687 -715 -776 -851 -905 -891 -810 -731 -715 -753
-111154 -753 -788 -805 -837 -882 -890 -850 -818 -834 -871 -883 -854 -798 -741 -723 -758 -817 -857 -859 -834 -813 -820 -838 -833 -804 -802 -869 -959 -978 -902 -800 -728
-110208 -728 -687 -681 -724 -790 -830 -836 -827 -806 -781 -764 -750 -733 -727 -745 -765 -777 -801 -854 -904 -910 -872 -822 -782 -766 -789 -831 -845 -816 -786 -801 -845
-109265 -845 -864 -834 -778 -735 -718 -735 -786 -852 -904 -927 -911 -860 -805 -777 -780 -789 -782 -754 -730 -735 -765 -790 -796 -805 -842 -880 -871 -816 -770 -763 -769 -753 -722
-108258 -722 -709 -723 -745 -768 -794 -822 -854 -882 -897 -887 -837 -766 -718 -720 -754 -788 -813 -825 -822 -802 -770 -741 -732 -743 -762 -780 -795 -799 -790 -791 -823 -861
$$ packed form
-114938h39M9O0L4pm1o1o4l2K6N1J7k2j0K9L1ql7k1K5M9K9lkJ5op3j03m4M4P1K8
-113992h15lJ8M3J7k4k7PL1K6Kj9l6m7m0k7j7QN8Q4M6j5k9PK8Kl9n1k7KQNJ2Rj2
-112954h15j4K5P0O6Oo8j00o3J5Q1P7J1n5n9pN0N7Pm0l3J3K9om6l3J6M1K9J4J7
-112039g15J0k2m8m0qJ8L3K7j2o0n4J5P1M9k7o2j7N6P3K6k8o1p5n4J4Q1P9J6l8
-111154g53l5j7l2m5qM0L2j6l7j2K9N6N7J8l5n9m0kK5K1pj8NK9Ko7r0j9P6J02P2
-110208g28M1Om3o6m0oRK1K5J7J4J7Oj8k0j2k4n3n0oL8N0M0J6k3m2j4K9L0j5m4
-109265h45j9L0N6M3J7j7n1o6n2k3J6N1N5K8lrPK8K4nl0k5orl7l8RN5M6PoJ6L1
-108258g22J3j4k2k3k6k8l2k8j5J0N0P1M8kl4l4k5j2LK0L2K9Rj1j9j8j5mRjl2l8
$$ plain form
-107281 -861 -861 -821 -786 -791 -829 -858 -844 -806 -785 -795 -808 -812 -832 -876 -912 -905 -869 -836 -809 -779 -756 -766 -809 -860 -880 -850 -791 -753 -755 -760 -733 -699
-106300 -699 -714 -787 -858 -870 -840 -826 -845 -864 -858 -839 -823 -814 -808 -795 -788 -816 -866 -887 -866 -840 -839 -840 -818 -785 -772 -787 -814 -835 -849 -856 -856 -855 -857 -854
-105263 -854 -852 -857 -857 -839 -808 -777 -744 -710 -696 -719 -761 -799 -826 -843 -849 -847 -848 -854 -846 -811 -770 -755 -772 -800 -814 -814 -825 -855 -873 -854 -832 -855 -900
-104259 -900 -903 -856 -814 -814 -846 -868 -854 -826 -812 -794 -751 -706 -701 -734 -769 -788 -794 -781 -747 -716 -721 -766 -820 -845 -828 -790 -759 -742 -727 -712 -716 -750
-103282 -750 -797 -824 -822 -800 -772 -748 -740 -751 -785 -837 -874 -855 -793 -747 -759 -817 -866 -857 -796 -740 -729 -744 -746 -739 -750 -777 -799 -813 -826 -844 -858
-102336 -858 -846 -793 -723 -676 -661 -659 -665 -699 -764 -827 -851 -838 -822 -821 -823 -811 -790 -773 -763 -764 -782 -812 -825 -803 -772 -770 -795 -817 -820 -817 -824 -840 -853
-101332 -853 -851 -827 -786 -744 -726 -756 -833 -913 -938 -900 -837 -780 -719 -648 -602 -619 -705 -822 -908 -920 -879 -845 -845 -862 -871 -865 -835 -778 -718 -695
-100417 -695 -727 -785 -827 -838 -838 -858 -891 -893 -848 -804 -806 -836 -849 -839 -836 -856 -860 -820 -763 -736 -759 -815 -868 -884 -857 -814 -794 -800 -803 -783 -755 -736
$$ packed form
-107281h61%M0L5nl8k9J4L8K1j0j3mk0m4l6PL6L3K7L0K3j0m3n1k0L0N9L8knK7L4
-106300f99j5p3p1j2L0J4j9j9OJ9J6ROJ3Pk8n0k1K1K6JjK2L3J3j5k7k1j4p%JkL
-105263h54Kn%J8L1L1L3L4J4k3m2l8k7j7oKjoQL5M1J5j7k8j4%j1l0j8J9K2k3m5
-104259i00lM7M2%l2k2J4K8J4J8M3M5Nl3l5j9oJ3L4L1nm5n4k5J7L8L1J7J5J5ml4
-103282g50m7k7KK2K8K4Qj1l4n2l7J9O2M6j2n8m9RO1N6J1j5kPj1k7k2j4j3j8j4
-102336h58J2N3P0M7J5Kol4o5o3k4J3J6JkJ2K1J7J0jj8l0j3K2L1Kk5k2lLpj6j3
-101332h53KK4M1M2J8l0p7q0k5L8O3N7O1P1M6j7q6j17q6j2M1L4%j7rOL0N7O0K3
-100417f95l2n8m2j1%k0l3kM5M4kl0j3J0Lk0mM0N7K7k3n6n3j6K7M3K0olK0K8J9
$$ plain form
-99440 -736 -732 -754 -800 -850 -882 -880 -844 -802 -793 -813 -820 -800 -793 -826 -855 -829 -762 -708 -702 -747 -821 -894 -934 -921 -863 -798 -772 -786 -801 -809 -827 -846
-98459 -846 -840 -818 -811 -821 -837 -840 -815 -767 -734 -738 -767 -808 -857 -892 -889 -858 -822 -802 -813 -854 -894 -902 -882 -861 -858 -861 -846 -817 -798 -795 -796 -800 -804 -799 -787
-97391 -787 -777 -770 -777 -799 -826 -846 -851 -838 -824 -825 -826 -802 -769 -771 -811 -843 -836 -817 -823 -859 -911 -955 -950 -879 -797 -770 -801 -836 -831 -783 -729 -711 -746 -811
-96357 -811 -862 -885 -901 -914 -890 -820 -745 -701 -689 -702 -746 -812 -864 -872 -837 -805 -824 -873 -890 -865 -848 -871 -914 -933 -908 -852 -798 -782 -818
-95472 -818 -877 -911 -892 -828 -766 -748 -776 -808 -818 -807 -793 -789 -787 -773 -751 -750 -781 -834 -882 -898 -868 -811 -761 -738 -733 -735 -754 -803 -857 -875 -853
-94526 -853 -828 -826 -848 -875 -889 -870 -823 -780 -770 -790 -822 -866 -917 -960 -975 -938 -856 -792 -803 -858 -871 -818 -769 -778 -813 -825 -821 -825 -835 -843 -851 -851
-93550 -851 -831 -792 -748 -724 -756 -850 -945 -972 -917 -829 -765 -741 -731 -720 -714 -723 -758 -820 -886 -924 -917 -869 -805 -765 -779 -840 -904 -921 -882 -824
-92634 -824 -778 -747 -739 -768 -815 -835 -818 -780 -739 -718 -739 -789 -839 -866 -856 -820 -793 -805 -846 -877 -866 -817 -779 -794 -848 -883 -866 -819 -785
$$ packed form
-99440g36Mk2m6n0l2KL6M2Rk0pK0Pl3k9K6O7N4Om5p4p3m0J3N8O5K6j4j5qj8j9
-98459h46OK2Pj0j6lK5M8L3mk9m1m9l5LL1L6K0j1m1m0qK0K1LlJ5K9J9LjmmNJ2
-97391g87J0Ppk2k7k0nJ3J4jjK4L3km0l2PJ9ol6n2m4NP1Q2K7l1l5NM8N4J8l5o5
-96357h11n1k3j6j3K4P0P5M4J2j3m4o6n2qL5L2j9m9j7K5J7k3m3j9K5N6N4J6l6
-95472h18n9l4J9O4O2J8k8l2j0J1J4MKJ4K2Jl1n3m8j6L0N7N0K3Nkj9m9n4j8K2
-94526h53K5Kk2k7j4J9M7M3J0k0l2m4n1m3j5L7Q2O4j1n5j3N3M9rl5j2Mmj0qq%
-93550h51K0L9M4K4l2r4r5k7N5Q8O4K4J0J1Orl5o2o6l8PM8O4M0j4o1o4j7L9N8
-92634h24M6L1Qk9m7k0J7L8M1K1k1n0n0k7J0L6K7j2m1l1J1M9L8j5n4l5J7M7L4
$$ plain form
-91749 -785 -786 -794 -769 -722 -714 -774 -859 -909 -917 -912 -901 -860 -785 -712 -684 -709 -762 -819 -874 -915 -923 -891 -843 -810 -804 -805 -786 -749 -727 -744 -794 -836 -834
-90738 -834 -789 -735 -710 -737 -824 -940 -1014 -990 -893 -796 -742 -729 -747 -778 -791 -781 -763 -755 -785 -864 -958 -1012 -1002 -950 -901 -870 -829 -750 -649
-89853 -649 -568 -543 -589 -689 -813 -934 -1021 -1040 -998 -930 -850 -754 -664 -617 -627 -689 -787 -872 -884 -825 -770 -775 -820 -859 -879 -905 -939 -940
-89003 -940 -878 -778 -696 -674 -706 -754 -792 -827 -872 -911 -905 -844 -775 -753 -784 -832 -880 -927 -948 -914 -842 -770 -700 -632 -602 -640 -722 -792 -833
-88118 -833 -866 -906 -947 -960 -915 -819 -729 -704 -755 -836 -887 -889 -870 -869 -891 -899 -866 -809 -751 -692 -631 -597 -612 -663 -729 -794 -837 -846 -838 -842 -851 -839
-87141 -839 -806 -785 -795 -809 -785 -727 -693 -722 -778 -790 -735 -665 -650 -705 -781 -838 -883 -935 -983 -993 -933 -821 -716 -662 -662 -704 -774 -843
-86287 -843 -887 -905 -918 -923 -889 -795 -677 -609 -632 -718 -801 -851 -893 -942 -971 -957 -909 -843 -767 -709 -702 -752 -820 -864 -867 -856 -871 -903 -899 -844
-85371 -844 -779 -750 -774 -820 -839 -824 -813 -817 -818 -814 -827 -848 -829 -760 -693 -694 -756 -808 -797 -752 -750 -817 -891 -897 -837 -773 -751 -754 -747 -732 -753 -827 -892
$$ packed form
-91749g85jqK5M7Qo0q5n0qNJ1M1P5P3K8k5n3n7n5m1qL2M8L3OjJ9L7K2j7n0m2K
-90738h34M5N4K5k7q7j16p4K4R7R7N4J3j8l1j3J0J8Ql0p9r4n4J0N2M9L1M1P9J01
-89853f49Q1K5m6j00j24j21q7j9M2O8Q0R6R0M7j0o2r8q5j2N9N5nm5l9k0k6l4j
-89003i40O2J00Q2K2l2m8l8l5m5l9OO1O9K2l1m8m8m7k1L4P2P2P0O8L0l8q2p0m1
-88118h33l3m0m1j3M5R6R0K5n1q1n1kJ9Jk2qL3N7N8N9O1L4j5n1o6o5m3rQmrJ2
-87141h39L3K1j0j4K4N8L4k9n6j2N5P0J5n5p6n7m5n2m8j0O0J12J05N4%m2p0o9
-86287h43m4j8j3nL4R4J18O8k3q6q3n0m2m9k9J4M8O6P6N8Pn0o8m4lJ1j5l2MN5
-85371h44O5K9k4m6j9J5J1mjMj3k1J9O9O7jo2n2J1M5Ko7p4oO0O4K2lPJ5k1p4o5
$$ plain form
-84360 -892 -874 -786 -717 -720 -754 -763 -755 -774 -832 -886 -900 -882 -863 -837 -788 -741 -740 -778 -801 -777 -752 -801 -908 -963 -900 -794 -767 -826 -861 -810
-83445 -810 -735 -707 -719 -723 -696 -665 -681 -760 -840 -838 -758 -693 -709 -759 -755 -706 -714 -806 -872 -817 -709 -685 -756 -813 -806 -792 -810 -824 -801 -767 -768
-82499 -768 -799 -808 -774 -739 -745 -772 -785 -786 -792 -792 -769 -737 -733 -771 -840 -891 -865 -757 -651 -626 -681 -750 -775 -758 -755 -792 -819 -787 -716 -675 -704
-81553 -704 -772 -814 -800 -757 -736 -748 -761 -749 -735 -751 -777 -767 -733 -744 -811 -857 -818 -748 -737 -792 -833 -817 -786 -787 -800 -777 -717 -671 -683
-80668 -683 -751 -824 -846 -810 -771 -776 -814 -829 -798 -756 -744 -761 -785 -811 -840 -862 -852 -817 -794 -798 -803 -790 -779 -782 -769 -716 -657 -637 -658 -682 -687
-79722 -687 -680 -682 -698 -719 -741 -765 -780 -769 -741 -723 -714 -706 -718 -751 -752 -697 -661 -717 -826 -894 -886 -845 -811 -777 -736 -716 -759 -858 -926 -882 -762
-78776 -762 -680 -685 -733 -766 -774 -776 -784 -793 -800 -813 -835 -846 -807 -729 -687 -726 -802 -841 -820 -778 -765 -786 -801 -784 -756 -758 -804 -862 -890 -866 -806 -747
-77799 -747 -721 -732 -764 -786 -773 -742 -736 -770 -809 -813 -792 -773 -769 -779 -811 -862 -894 -869 -806 -759 -758 -792 -826 -830 -805 -783 -792 -816 -815 -787 -755 -737
$$ packed form
-84360h92J8Q8O9ll4rQj9n8n4j4J8J9K6M9M7Jl8k3K4K5m9j07n5O3J06K7n9l5N1
-83445h10P5K8j2mK7L1j6p9q0KQ0O5j6n0MM9qr2o6N5J08K4p1n7PJ4j8j4K3L4j
-82499g68l1rL4L5ok7j3jo%K3L2Ml8o9n1K6J08J06K5n5o9k5J7Ll7k7L2P1M1k9
-81553g04o8m2J4M3K1j2j3J2J4j6k6J0L4j1o7m6L9P0J1n5m1J6L1jj3K3O0M6j2
-80668f83o8p3k2L6L9nl8j5L1M2J2j7k4k6k9k2J0L5K3mnJ3J1lJ3N3N9K0k1k4n
-79722f87Pkj6k1k2k4j5J1K8J8RQj2l3jN5L6n6j09o8QM1L4L4M1K0m3r9o8M4J20
-78776g62Q2nm8l3qkqrpj3k2j1L9P8M2l9p6l9K1M2J3k1j5J7K8km6n8k8K4O0N9
-77799g47K6j1l2k2J3L1Ol4l9mK1J9Mj0l2n1l2K5O3M7Jl4l4mK5K2rk4JK8L2J8
$$ plain form
-76826 -737 -746 -797 -865 -883 -820 -733 -704 -754 -837 -903 -934 -925 -891 -852 -811 -757 -711 -702 -725 -749 -773 -811 -850 -854 -823 -794 -796 -818 -829 -814 -777
-75880 -777 -740 -734 -774 -821 -823 -783 -756 -780 -841 -899 -917 -884 -814 -754 -754 -807 -861 -893 -923 -941 -910 -838 -786 -791 -830 -853 -849 -844 -841 -813 -765 -748
-74903 -748 -791 -850 -866 -819 -728 -649 -642 -695 -731 -692 -604 -540 -544 -602 -677 -748 -802 -831 -837 -848 -877 -901 -895 -870 -864 -890 -910 -880 -815 -772 -773 -784
-73922 -784 -766 -722 -687 -690 -724 -773 -834 -901 -946 -952 -938 -938 -953 -950 -921 -904 -931 -988 -1026 -1005 -935 -875 -868 -896 -916 -919 -911 -878 -813 -753 -741 -766
-72946 -766 -780 -761 -729 -702 -680 -664 -649 -629 -624 -656 -688 -675 -638 -645 -718 -799 -820 -781 -746 -754 -783 -795 -790 -777 -751 -719 -703 -721 -773 -838 -875
-72000 -875 -857 -806 -779 -789 -784 -727 -654 -634 -685 -746 -760 -752 -779 -827 -838 -807 -782 -789 -813 -828 -828 -817 -808 -815 -831 -843 -846 -834 -804 -778 -786 -807 -785
-70996 -785 -735 -723 -765 -813 -836 -844 -833 -792 -739 -709 -707 -711 -709 -720 -755 -786 -786 -764 -750 -767 -809 -840 -830 -787 -748 -730 -721 -706 -692 -694 -716 -749
-70019 -749 -779 -786 -759 -723 -731 -792 -840 -818 -759 -731 -744 -768 -784 -785 -774 -764 -753 -737 -740 -779 -830 -851 -828 -770 -719 -717 -749 -764 -759 -761 -771 -769 -757
$$ packed form
-76826g37rn1o8j8O3Q7K9n0q3o6l1RL4L9M1N4M6Rk3k4k4l8l9mL1K9kk2j1J5L7
-75880g77L7Om0m7kM0K7k4o1n8j8L3P0O0%n3n4l2l0j8L1P2N2nl9k3MNLK8M8J7
-74903g48m3n9j6M7R1P9Pn3l6L9Q8O4mn8p5p1n4k9oj1k9k4OK5Ok6k0L0O5M3jj1
-73922g84J8M4L5ll4m9o1o7m5oJ4%j5LK9J7k7n7l8K1P0O0Pk8k0lQL3O5O0J2k5
-72946g66j4J9L2K7K2J6J5K0Nl2l2J3L7pp3q1k1L9L5qk9j2NJ3K6L2J6j8n2o5l7
-72000h75J8N1K7j0NN7P3K0n1o1j4Qk7m8j1L1K5pk4j5%J1Rpj6j2lJ2L0K6qk1K2
-70996g85N0J2m2m8k3qJ1M1N3L0KmKj1l5l1%K2J4j7m2l1J0M3L9J8RJ5J4kk2l3
-70019g49l0pK7L6qo1m8K2N9K8j3k4j6jJ1J0J1J6ll9n1k1K3N8N1Kl2j5Nkj0KJ2
$$ plain form
-69012 -757 -750 -749 -760 -795 -847 -887 -896 -865 -797 -719 -678 -703 -772 -836 -860 -834 -778 -732 -724 -745 -754 -740 -747 -793 -829 -816 -785 -778 -783 -771 -746 -717 -687
-68001 -687 -664 -680 -735 -782 -794 -803 -834 -867 -873 -862 -848 -830 -793 -736 -683 -672 -715 -784 -834 -845 -841 -847 -861 -857 -822 -783 -780 -831 -914 -969 -950 -862
-67024 -862 -762 -713 -726 -760 -778 -769 -740 -709 -702 -729 -760 -762 -752 -774 -836 -892 -899 -869 -828 -775 -699 -620 -581 -608 -690 -780 -828 -812 -766 -746
-66109 -746 -762 -776 -762 -741 -762 -832 -901 -905 -843 -778 -766 -798 -823 -816 -798 -803 -837 -872 -876 -863 -862 -870 -858 -828 -811 -814 -814 -804 -815 -860 -910 -922 -899
-65105 -899 -878 -881 -895 -913 -932 -940 -920 -879 -841 -834 -840 -802 -703 -601 -558 -592 -679 -768 -811 -807 -787 -769 -746 -706 -661 -640 -649 -669 -681 -681 -669 -674
-64128 -674 -721 -780 -804 -811 -833 -834 -781 -727 -745 -824 -898 -918 -872 -783 -692 -643 -662 -727 -789 -828 -856 -877 -871 -827 -762 -716 -710 -737 -789 -869 -943
-63182 -943 -956 -904 -845 -823 -825 -813 -784 -770 -803 -877 -948 -968 -931 -876 -844 -821 -770 -699 -653 -656 -686 -705 -695 -678 -691 -755 -838 -887 -877 -807
-62267 -807 -708 -637 -644 -726 -835 -915 -941 -937 -914 -850 -751 -672 -657 -701 -774 -844 -887 -892 -864 -818 -773 -753 -756 -760 -749 -740 -758 -799 -829 -821 -786 -746
$$ packed form
-69012g57PJj1l5n2m0rL1O8P8M1k5o9o4k4K6N6M6Qk1rJ4pm6l6J3L1PnJ2K5K9L0
-68001f87K3j6n5m7j2rl1l3oJ1J4J8L7N7N3J1m3o9n0j1Moj4ML5L9Ln1q3n5J9Q8
-67024h62J00M9j3l4j8RK9L1Pk7l1kJ0k2o2n6pL0M1N3P6P9L9k7q2r0m8J6M6K0
-66109g46j6j4J4K1k1p0o9mO2O5J2l2k5PJ8nl4l5mJ3JqJ2L0J7l%J0j1m5n0j2K3
-65105h99K1lj4j8j9qK0M1L8PoL8R9J02M3l4q7q9m3MK0J8K3M0M5K1rk0j2%J2n
-64128f74m7n9k4pk2jN3N4j8p9p4k0M6Q9R1M9j9o5o2l9k8k1OM4O5M6Ok7n2q0p4
-63182i43j3N2N9K2kJ2K9J4l3p4p1k0L7N5L2K3N1P1M6ll0j9J0J7j3o4q3m9J0P0
-62267h07R9P1pq2j09q0k6MK3O4R9P9J5m4p3p0m3nK8M6M5K0lmJ1Rj8m1l0QL5M0
$$ plain form
-61286 -746 -701 -638 -587 -602 -682 -770 -818 -828 -822 -819 -826 -807 -733 -648 -634 -702 -786 -835 -845 -833 -814 -798 -782 -754 -732 -756 -826 -887 -900 -878
-60371 -878 -860 -860 -854 -821 -770 -728 -713 -731 -772 -817 -854 -882 -881 -819 -724 -675 -701 -731 -702 -664 -694 -785 -873 -924 -932 -901 -855 -809 -758 -714 -708
-59425 -708 -732 -749 -749 -762 -807 -856 -862 -812 -742 -709 -739 -809 -887 -928 -891 -781 -677 -648 -693 -760 -809 -832 -839 -839 -834 -808 -759 -709 -680 -687 -732
-58479 -732 -799 -861 -881 -831 -734 -659 -656 -707 -765 -815 -864 -891 -859 -778 -713 -722 -792 -855 -860 -816 -759 -709 -688 -722 -797 -865 -897 -909 -924 -937
-57563 -937 -933 -919 -919 -933 -927 -899 -883 -885 -873 -841 -820 -820 -819 -795 -758 -733 -739 -770 -809 -832 -816 -760 -710 -717 -778 -845 -880 -892 -906 -918 -896 -839 -790
-56556 -790 -783 -803 -814 -808 -796 -782 -774 -797 -851 -905 -931 -923 -893 -870 -873 -869 -826 -774 -770 -812 -828 -775 -707 -727 -841 -928 -884 -759 -692 -737 -821
-55613 -821 -848 -793 -696 -624 -621 -684 -767 -815 -820 -812 -812 -818 -821 -818 -803 -786 -792 -818 -831 -800 -728 -643 -591 -611 -698 -806 -888 -925 -920 -895 -882 -891 -919
-54606 -919 -947 -944 -889 -809 -751 -719 -680 -639 -648 -732 -841 -907 -903 -856 -821 -823 -843 -843 -812 -778 -766 -762 -740 -710 -712 -763 -824 -856 -866 -868 -854 -818
$$ packed form
-61286g46M5O3N1j5q0q8m8j0OLpJ9P4Q5J4o8q4m9j0J2J9J6J6K8K2k4p0o1j3K2
-60371h78J8%OL3N1M2J5j8m1m5l7k8JO2R5M9k6l0K9L8l0r1q8n1qL1M6M6N1M4O
-59425g08k4j7%j3m5m9oN0P0L3l0p0p8m1L7J10J04K9m5o7m9k3p%NK6M9N0K9pm5
-58479g32o7o2k0N0R7P5Ln1n8n0m9k7L2Q1O5rp0o3nM4N7N0K1l4p5o8l2j2j5j3
-57563i37MJ4%j4OK8J6kJ2L2K1%JK4L7K5ol1l9k3J6N6N0po1o7l5j2j4j2K2N7M9
-56556g90Pk0j1OJ2J4Qk3n4n4k6QL0K3lMM3N2Mm2j6N3O8k0j14q7M4J25O7m5q4
-55613h21k7N5R7P2Lo3q3m8nQ%olLJ5J7ok6j3L1P2Q5N2k0q7j08q2l7NK5J3rk8
-54606i19k8LN5Q0N8L2L9M1rq4j09o6MM7L5kk0%L1L4J2MK2L0kn1o1l2j0kJ4L6
$$ plain form
-53630 -818 -785 -774 -779 -787 -799 -814 -824 -816 -791 -763 -762 -789 -805 -780 -745 -752 -810 -871 -891 -868 -834 -820 -833 -840 -811 -754 -711 -706 -739 -792 -840 -858
-52649 -858 -843 -826 -832 -839 -815 -773 -751 -750 -756 -773 -792 -775 -714 -666 -691 -791 -901 -960 -945 -883 -828 -818 -840 -844 -797 -728 -704 -755 -840 -903
-51733 -903 -920 -896 -849 -803 -768 -755 -783 -842 -884 -879 -844 -801 -750 -692 -648 -645 -681 -733 -776 -800 -805 -808 -814 -795 -741 -697 -708 -756 -782 -759 -728
-50787 -728 -743 -793 -811 -765 -694 -665 -691 -723 -724 -723 -761 -824 -857 -845 -825 -821 -827 -841 -858 -870 -876 -885 -889 -878 -865 -860 -845 -802 -738 -682 -650 -644 -664
-49780 -664 -716 -794 -881 -942 -930 -840 -729 -655 -613 -588 -596 -626 -626 -570 -505 -492 -545 -632 -712 -768 -802 -820 -829 -838 -847 -845 -817 -767 -723 -718 -736 -736
-48807 -736 -712 -700 -728 -767 -763 -717 -688 -716 -780 -831 -838 -807 -772 -767 -793 -828 -843 -823 -779 -737 -712 -703 -712 -734 -760 -778 -779 -768 -760 -763 -766 -770 -785 -810
-47769 -810 -816 -782 -732 -713 -749 -812 -860 -874 -854 -814 -782 -778 -772 -730 -656 -577 -523 -533 -618 -722 -782 -803 -826 -853 -863 -850 -829 -811 -786 -753
-46854 -753 -739 -767 -822 -868 -868 -816 -753 -721 -735 -774 -793 -765 -721 -710 -720 -722 -736 -786 -840 -835 -768 -697 -679 -727 -817 -901 -928 -900 -851 -804
$$ packed form
-53630h18L3J1nqj2j5j0QK5K8Jk7j6K5L5pn8o1k0K3L4J4j3pK9N7M3Nl3n3m8j8
-52649h58J5J7opK4M2K2Joj7j9J7O1M8k5j00j10n9J5O2N5J0k2mM7O9K4n1q5o3
-51733i03j7K4M7M6L5J3k8n9m2NL5M3N1N8M4Ll6n2m3k4nloJ9N4M4j1m8k6K3L1
-50787g28j5n0j8M6P1K9k6l2jJl8o3l3J2K0Moj4j7j2ormJ1J3NJ5M3O4N6L2Ok0
-49780f64n2p8q7o1J2R0J11P4M2K5ql0%N6O5J3n3q7q0n6l4j8rrrKK8N0M4Nj8%
-48807g36K4J2k8l9MM6K9k8o4n1pL1L5Nk6l5j5K0M4M2K5Rrk2k6j8jJ1Qllmj5k5
-47769h10oL4N0J9l6o3m8j4K0M0L2MOM2P4P9N4j0q5j04o0k1k3k7j0J3K1J8K5L3
-46854g53J4k8n5m6%N2O3L2j4l9j9K8M4J1j0kj4n0n4NO7P1J8m8r0q4k7K8M9M7
$$ plain form
-45938 -804 -760 -739 -758 -788 -786 -750 -710 -684 -670 -673 -696 -731 -762 -767 -746 -725 -725 -739 -747 -739 -721 -704 -696 -710 -763 -839 -895 -900 -860 -819 -816 -836 -829 -775
-44904 -775 -705 -654 -658 -733 -838 -898 -879 -817 -754 -704 -674 -677 -714 -758 -778 -770 -754 -745 -743 -755 -783 -807 -806 -793 -787 -794 -819 -861 -889 -864 -795 -736
-43927 -736 -732 -773 -802 -785 -764 -781 -815 -827 -826 -829 -817 -782 -756 -763 -782 -787 -779 -765 -740 -719 -743 -817 -878 -856 -753 -649 -622 -683 -781 -849 -849
-42977 -849 -794 -736 -719 -753 -803 -828 -832 -867 -925 -928 -841 -737 -711 -776 -851 -847 -767 -701 -700 -733 -767 -819 -875 -870 -790 -712 -706 -769 -855 -911 -897
-42031 -897 -818 -718 -661 -681 -752 -817 -832 -783 -687 -602 -603 -702 -830 -912 -937 -941 -941 -921 -880 -848 -855 -887 -906 -880 -817 -757 -729 -717 -698 -674
-41115 -674 -661 -651 -627 -594 -574 -575 -602 -662 -735 -778 -782 -776 -779 -794 -811 -815 -794 -749 -701 -677 -681 -682 -663 -655 -682 -722 -729 -688 -630 -599 -613 -667 -748
-40108 -748 -833 -884 -863 -766 -639 -566 -600 -747 -949 -1077 -1018 -782 -490 -309 -353 -562 -722 -645 -314 132 489 615
-39442 615 499 199 -164 -371 -323 -150 -42 -197 -676 -1255 -1684 -1860 -1757 -1509 -1323 -1292 -1435 -1668 -1753 -1564
$$ packed form
-45938h04M4K1j9l0KL6M0K6J4lk3l5l1nK1K1%j4qQJ8J7Qj4n3p6n6nM0M1Lk0PN4
-44904g75P0N1mp5j05o0J9O2O3N0L0ll7m4k0QJ6RKj2k8k4JJ3Opk5m2k8K5O9N9
-43927g36Mm1k9J7K1j7l4j2JlJ2L5K6pj9nQJ4K5K1k4p4o1K2J03J04K7o1r8o8%
-42977h49N5N8J7l4n0k5ml5n8lQ7J04K6o5p5MQ0O6Jl3l4n2n6NQ0P8Oo3q6n6J4
-42031h97P9J00N7k0p1o5j5M9R6Q5jr9j28q2k5m%K0M1L2pl2j9K6O3O0K8J2J9K4
-41115f74J3J0K4L3K0jk7o0p3m3mOlj5j7mK1M5M8K4mjJ9Qk7m0pM1N8L1j4n4q1
-40108g48q5n1K1R7J27P3l4j47k02j28N9K36K92J81m4k09j60P7L31M46L57J26
-39442F15j16l00l63k07M8J73J08j55m79n79m29j76J03K48J86L1j43k33q5J89
$$ plain form
-38825 -1564 -1211 -855 -609 -554 -667 -830 -914 -852 -687 -554 -539 -624 -748 -849 -896 -924 -968 -998 -968 -894 -838 -836 -877 -928
-38097 -928 -966 -974 -946 -906 -897 -934 -992 -1025 -1008 -950 -876 -806 -759 -751 -790 -871 -960 -1008 -983 -914 -875 -919 -1026 -1129 -1177 -1141 -1030 -900
-37243 -900 -820 -812 -835 -835 -787 -708 -648 -636 -658 -687 -717 -750 -762 -737 -715 -744 -801 -834 -828 -791 -736 -692 -700 -767 -849 -882 -838 -755 -707 -723 -764
-36297 -764 -783 -779 -773 -767 -744 -702 -661 -652 -691 -748 -776 -765 -748 -736 -722 -711 -723 -769 -814 -805 -729 -647 -624 -669 -744 -807 -831 -814 -778 -752 -741
-35351 -741 -729 -715 -723 -759 -793 -806 -808 -808 -791 -751 -717 -721 -763 -811 -838 -833 -819 -835 -895 -952 -948 -876 -790 -747 -757 -799 -854 -903 -911 -857 -780 -750
-34370 -750 -783 -822 -825 -810 -799 -776 -743 -740 -779 -806 -790 -761 -755 -766 -778 -793 -825 -856 -842 -775 -716 -721 -773 -820 -836 -831 -822 -810 -782 -748 -729 -737
-33394 -737 -767 -820 -886 -932 -934 -913 -910 -922 -907 -857 -805 -778 -765 -745 -715 -703 -725 -755 -763 -751 -711 -637 -576 -580 -637 -700 -748 -779 -779 -741 -698
-32448 -698 -695 -732 -789 -851 -895 -882 -815 -737 -673 -619 -581 -586 -647 -732 -774 -750 -707 -693 -713 -738 -743 -736 -759 -833 -905 -910 -857 -805 -773 -760 -782
$$ packed form
-38825a564L53L56K46N5j13j63q4O2J65J33J5q5j24j01m7k8m4l0L0P4N6Km1n1
-38097i28l8qK8M0Rl7n8l3J7N8P4P0M7Ql9q1q9m8K5O9L9m4j07j03m8L6J11J30
-37243i00Q0Qk3%M8P9O0J2k2k9l0l3j2K5K2k9n7l3OL7N5M4qo7q2l3M4Q3M8j6m1
-36297g64j9MOOK3M2M1Rl9n7k8J1J7J2J4J1j2m6m5RP6Q2K3m5p5o3k4J7L6K6J1
-35351g41J2J4ql6l4j3k%J7M0L4mm2m8k7NJ4j6o0n7MP2Q6M3j0m2n5m9qN4P7L0
-34370g50l3l9lJ5J1K3L3Ll9k7J6K9Oj1j2j5l2l1J4O7N9nn2m7j6NRJ2K8L4J9q
-33394g37l0n3o6m6kK1Lj2J5N0N2K7J3K0L0J2k2l0qJ2M0P4O1mn7o3m8l1%L8M3
-32448f98Ll7n7o2m4J3O7P8O4N4L8no1q5m2K4M3J4k0k5nPk3p4p2nN3N2L2J3k2
$$ plain form
-31502 -782 -836 -878 -869 -808 -716 -617 -533 -499 -535 -598 -622 -587 -528 -497 -518 -588 -691 -793 -859 -890 -920 -971 -1033 -1094 -1151 -1201 -1230 -1223 -1169
-30617 -1169 -1068 -938 -825 -784 -824 -883 -894 -852 -799 -767 -735 -681 -638 -644 -693 -752 -790 -801 -805 -818 -831 -842 -860 -873 -856 -808 -768 -773
-29762 -773 -819 -865 -871 -841 -811 -804 -812 -819 -822 -829 -848 -873 -879 -864 -867 -910 -952 -952 -935 -943 -967 -974 -964 -966 -980 -972 -919 -832 -736 -651 -596 -587 -629 -695 -738 -726
-28667 -726 -690 -684 -724 -789 -847 -873 -861 -839 -841 -871 -896 -886 -846 -812 -804 -802 -783 -768 -787 -828 -850 -834 -779 -704 -643 -644 -719 -809 -835 -789 -735
-27721 -735 -725 -753 -792 -827 -854 -864 -861 -838 -791 -750 -765 -825 -856 -820 -777 -797 -865 -899 -869 -817 -776 -746 -734 -763 -823 -862 -836 -758 -687
-26836 -687 -673 -720 -795 -854 -855 -785 -682 -631 -694 -831 -924 -901 -820 -781 -792 -794 -764 -733 -723 -732 -755 -794 -828 -827 -789 -744 -722 -731 -768 -818
-25920 -818 -844 -827 -790 -768 -762 -748 -722 -706 -719 -752 -781 -791 -776 -754 -754 -771 -770 -744 -714 -695 -675 -656 -660 -681 -694 -692 -698 -711 -702 -674 -679 -743 -826
-24913 -826 -872 -867 -825 -764 -721 -725 -770 -825 -857 -855 -832 -816 -822 -838 -830 -785 -748 -772 -838 -866 -813 -731 -694 -707 -727 -726 -710 -693 -689 -718 -779 -844
$$ packed form
-31502g82n4m2RO1R2R9Q4L4l6o3k4L5N9L1k1p0j03j02o6l1l0n1o2o1n7n0k9PN4
-30617a169J01J30J13M1m0n9j1M2N3L2L2N4M3om9n9l8j1mj3j3j1j8j3J7M8M0n
-29762g73m6m6oL0L0Pqplpj9k5oJ5lm3m2%J7qk4pJ0kj4QN3Q7R6Q5N5Rm2o6m3J2
-28667g26L6Om0o5n8k6J2K2kl0k5J0M0L4QKJ9J5j9m1k2J6N5P5O1jp5r0k6M6N4
-27721g35J0k8l9l5k7j0LK3M7M1j5o0l1L6M3k0o8l4L0N2M1L0J2k9o0l9K6P8P1
-26836f87J4m7p5n9jP0J03N1o3j37r3K3Q1L9j1kL0L1J0rk3l9l4JL8M5K2rl7n0
-25920h18k6J7L7K2OJ4K6J6j3l3k9j0J5K2%j7JK6L0J9K0J9mk1j3Koj3RK8no4q3
-24913h26m6NM2O1M3mm5n5l2KK3J6oj6QM5L7k4o6k8N3Q2L7j3k0JJ6J7Mk9o1o5
$$ plain form
-23932 -844 -879 -878 -854 -805 -737 -695 -720 -783 -818 -789 -720 -669 -680 -728 -764 -782 -805 -829 -830 -809 -779 -728 -643 -570 -580 -674 -779 -829 -835 -848
-23017 -848 -893 -938 -931 -862 -780 -751 -793 -871 -922 -912 -865 -827 -807 -782 -752 -727 -704 -686 -701 -750 -793 -807 -800 -793 -798 -795 -764 -721 -704 -724 -769
-22071 -769 -817 -837 -819 -784 -759 -753 -765 -781 -771 -737 -713 -730 -780 -829 -848 -835 -813 -807 -814 -816 -800 -764 -721 -692 -692 -711 -730 -740 -748 -755 -754 -743 -741
-21064 -741 -760 -794 -818 -816 -805 -824 -866 -883 -859 -838 -849 -858 -835 -810 -817 -832 -816 -781 -771 -801 -834 -836 -813 -784 -767 -779 -814 -835 -821 -789 -770
-20118 -770 -772 -783 -787 -778 -747 -697 -657 -664 -722 -788 -816 -793 -765 -780 -821 -830 -789 -737 -715 -713 -705 -704 -739 -797 -835 -835 -802 -738 -662 -616 -627 -678 -734
-19114 -734 -769 -774 -767 -769 -783 -794 -801 -816 -825 -812 -788 -771 -761 -750 -740 -736 -747 -778 -806 -793 -734 -663 -617 -611 -660 -767 -884 -943 -915 -832 -745
-18168 -745 -695 -694 -712 -698 -639 -584 -596 -682 -791 -866 -891 -893 -900 -907 -887 -821 -719 -617 -561 -586 -665 -721 -717 -693 -686 -694 -707 -735 -777 -810 -814
-17222 -814 -795 -778 -774 -762 -728 -685 -659 -663 -697 -736 -744 -708 -674 -702 -782 -835 -827 -799 -791 -782 -744 -694 -678 -703 -729 -720 -702 -730 -811 -889 -894 -815 -713
$$ packed form
-23932h44l5JK4M9O8M2k5o3l5K9O9N1j1m8l6j8k3k4jK1L0N1Q5P3j0r4j05n0oj3
-23017h48m5m5PO9Q2K9m2p8n1J0M7L8K0K5L0K5K3J8j5m9m3j4PPnLL1M3J7k0m5
-22071g69m8k0J8L5K5Oj2j6J0L4K4j7n0m9j9J3K2OpkJ6L6M3K9%j9j9j0qpJJ1K
-21064g41j9l4k4KJ1j9m2j7K4K1j1rK3K5pj5J6L5J0l0l3kK3K9J7j2l5k1J4L2J9
-20118g70kj1mRL1N0M0pn8o6k8K3K8j5m1rM1N2K2KQJl5n8l8%L3O4P6M6j1n1n6
-19114g34l5nPkj4j1pj5rJ3K4J7J0J1J0Mj1l1k8J3N9P1M6Om9j07j17n9K8Q3Q7
-18168g45N0Jj8J4N9N5j2q6j09p5k5kppK0O6J02J02N6k5p9n6MK4Pqj3k8m2l3m
-17222h14J9J7MJ2L4M3K6ml4l9qL6L4k8q0n3QK8QRL8N0J6k5k6RJ8k8q1p8nP9J02
$$ plain form
-16211 -713 -654 -623 -572 -520 -523 -577 -629 -656 -692 -763 -838 -858 -834 -846 -934 -1009 -959 -809 -680 -621 -586 -534 -493 -499 -531 -554 -583 -649 -741
-15326 -741 -810 -829 -806 -783 -792 -823 -828 -781 -706 -643 -619 -628 -633 -617 -610 -643 -697 -741 -781 -833 -874 -870 -820 -757 -720 -724 -736 -725 -720 -772 -852 -875 -811
-14319 -811 -717 -668 -680 -698 -681 -660 -677 -698 -662 -588 -559 -597 -637 -635 -621 -645 -709 -772 -804 -812 -817 -827 -831 -806 -744 -686 -656 -621 -561 -516 -531
-13373 -531 -593 -662 -712 -744 -767 -778 -781 -794 -826 -858 -873 -864 -818 -739 -663 -623 -624 -647 -670 -691 -731 -794 -853 -879 -863 -807 -736 -694 -712 -775
-12457 -775 -835 -832 -751 -635 -556 -571 -688 -831 -892 -837 -720 -622 -628 -754 -900 -952 -879 -729 -612 -615 -707 -806 -865 -859 -784 -692 -651
-11633 -651 -680 -750 -820 -841 -797 -716 -639 -613 -663 -759 -825 -822 -776 -740 -743 -786 -823 -794 -702 -622 -617 -668 -709 -719 -719 -720 -712 -703 -727 -787 -846 -858
-10657 -858 -812 -728 -651 -621 -632 -658 -694 -749 -798 -805 -768 -723 -698 -691 -689 -682 -673 -669 -686 -732 -794 -832 -810 -739 -672 -645 -654 -691 -760 -841 -882 -856
-9680 -856 -799 -761 -752 -746 -718 -683 -685 -741 -802 -803 -746 -694 -697 -747 -784 -766 -713 -674 -668 -683 -710 -750 -797 -823 -807 -775 -774 -806 -834 -822 -763 -695
$$ packed form
-16211g13N9L1N1N2ln4n2k7l6p1p5k0K4j2q8p5N0J50J29N9L5N2M1ol2k3k9o6r2
-15326g41o9j9K3K3rl1nM7P5O3K4rnJ6Pl3n4m4m0n2m1MN0O3L7mj2J1Nn2q0k3O4
-14319h11R4M9j2j8J7K1j7k1L6P4K9l8m0KJ4k4o4o3l2qnj0mK5O2N8L0L5O0M5j5
-13373e31o2o9n0l2k3j1lj3l2l2j5RM6P9P6M0jk3k3k1m0o3n9k6J6N6P1M2j8o3
-12457g75o0LQ1J16P9j5j17j43o1N5J17R8oj26j46n2P3J50J17lr2r9n9OP5R2M1
-11633f51k9p0p0k1M4Q1P7K6n0r6o6LM6L6lm3l7K9R2Q0Nn1m1j0%jQRk4o0n9j2
-10657h58M6Q4P7L0j1k6l6n5m9pL7M5K5PKPRMj7m6o2l8K2P1O7K7rl7o9q1m1K6
-9680h56N7L8ROK8L5kn6o1jN7N2ln0l7J8N3L9Oj5k7m0m7k6J6L2Jl2k8J2N9O8
$$ plain form
-8707 -695 -682 -744 -827 -865 -853 -826 -803 -780 -749 -729 -733 -736 -709 -676 -677 -708 -736 -755 -767 -768 -754 -722 -687 -678 -705 -743 -762 -763 -765 -771 -778 -802 -856
-7700 -856 -917 -950 -950 -919 -848 -750 -678 -673 -728 -801 -847 -846 -807 -749 -682 -614 -564 -555 -597 -662 -715 -737 -739 -735 -730 -721 -714 -721 -722 -682 -618 -584 -602 -642
-6658 -642 -671 -689 -714 -771 -858 -930 -944 -897 -800 -659 -511 -439 -482 -573 -594 -508 -417 -442 -587 -754 -881 -984 -1068 -1097 -1054 -968
-5869 -968 -881 -814 -781 -785 -801 -788 -733 -681 -684 -736 -790 -837 -910 -1001 -1043 -984 -861 -755 -699 -650 -581 -529 -538 -579 -594 -589 -618 -678 -725 -749
-4953 -749 -776 -817 -858 -854 -756 -592 -462 -422 -434 -453 -485 -550 -633 -692 -713 -739 -820 -946 -1050 -1078 -1010 -835 -567 -305 -189
-4188 -189 -263 -425 -540 -579 -607 -671 -755 -833 -927 -1050 -1146 -1143 -1034 -877 -719 -578 -483 -451 -475 -538 -635 -746 -831 -858 -815
-3425 -815 -726 -653 -652 -717 -780 -786 -748 -701 -650 -593 -551 -559 -618 -687 -730 -748 -760 -765 -744 -703 -669 -653 -653 -685 -752 -812 -823 -788 -742 -708 -682
-2479 -682 -663 -654 -649 -631 -596 -571 -584 -640 -709 -751 -756 -748 -751 -766 -774 -749 -689 -631 -606 -606 -613 -631 -666 -703 -738 -776 -801 -778 -714 -662 -670 -721 -745
$$ packed form
-8707f95J3o2q3l8J2K7K3K3L1K0mlK7L3jl1k8j9j2jJ4L2L5Rk7l8j9jkopk4n4
-7700h56o1l3%L1P1R8P2Nn5p3m6JL9N8O7O8N0Rm2o5n3k2kMNRPpjM0O4L4j8m0
-6658f42k9j8k5n7q7p2j4M7R7J41J48P2m3r1k1Q6R1k5j45j67j27j03q4k9M3Q6
-5869i68Q7O7L3mj6J3N5N2ln2n4m7p3r1m2N9J23J06N6M9O9N2rm1j5Nk9o0m7k4
-4953g49k7m1m1MR8J64J30M0j2j9l2o5q3n9k1k6q1j26j04k8O8J75K68K62J16
-4188a89p4j62j15l9k8o4q4p8r4j23r6LJ09J57J58J41R5L2k4o3r7j11q5k7M3
-3425h15Q9P3Jo5o3oL8M7N1N7M2qn9o9m3j8j2nK1M1L4J6%l2o7o0j1L5M6L4K6
-2479f82J9RNJ8L5K5j3n6o9m2nQlj5qK5O0N8K5%pj8l5l7l5l8k5K3O4N2qn1k4
$$ plain form
-1472 -745 -706 -641 -606 -610 -635 -662 -664 -628 -589 -614 -699 -757 -739 -708 -734 -799 -827 -769 -662 -603 -642 -737 -792 -756 -676 -633 -638 -649 -652 -667
-556 -667 -697 -723 -712 -643 -545 -504 -574 -695 -775 -780 -742 -695 -656 -627 -599 -575 -568 -586 -618 -623 -520 -257 70 249 159 -119 -414
268 -414 -614 -688 -640 -505 -381 -387 -526 -641 -592 -429 -336 -423 -631 -801 -811 -666 -471 -363 -379 154 3289 10887
937 10887 20694 25913 21683 10787 569 -4381 -4737 -3367 -2139 -1456 -1125 -931 -774 -640 -560 -563
1424 -563 -633 -694 -659 -515 -358 -307 -376 -458 -454 -332 -111 121 201 29 -298 -577 -698 -701 -671 -654 -635 -583 -512 -466 -468 -509
2221 -509 -560 -584 -556 -500 -461 -461 -498 -557 -607 -639 -682 -751 -787 -722 -588 -504 -546 -665 -746 -725 -652 -625 -677 -734 -714 -625 -556 -571
3075 -571 -623 -617 -548 -500 -526 -596 -656 -671 -628 -570 -564 -608 -632 -612 -581 -570 -581 -606 -630 -642 -642 -633 -630 -659 -714 -748 -729 -687 -674 -700 -741
4021 -741 -770 -780 -778 -769 -752 -728 -692 -651 -645 -696 -759 -772 -734 -699 -696 -703 -697 -697 -710 -711 -687 -679 -714 -752 -732 -655 -581 -571 -641 -734 -768 -723 -667
$$ packed form
-1472g45L9O5L5mk5k7kL6L9k5q5n8J8L1k6o5k8N8J07N9l9r5n5L6Q0M3nj1lj5
-556f67l0k6J1O9R8M1p0j21q0nL8M7L9K9K8K4Pj8l2nJ03K63L27J79r0k78k95
268d14k00p4M8J35J24oj39j15M9J63R3q7k08j70j0J45J95J08j6N33L135P598
937A0887R807N219m230j0896j0218m950l56J370J228O83L31J94J57J34Q0l
1424e63p0o1L5J44J57N1o9q2MJ22K21K32Q0j72l27k79j21lL0J7J9N2P1M6km1
2221e09n1k4K8N6L9%l7n9n0l2m3o9l6O5J34Q4m2j19q1K1P3K7n2n7K0Q9O9j5
3075e71n2OO9M8k6p0o0j5M3N8Om4k4K0L1J1j1k5k4j2%RLk9n5l4J9M2J3k6m1
4021g41k9j0KRJ7K4L6M1On1o3j3L8L5LpO%j3jK4Ql5l8K0P7P4J0p0r3l4M5N6
$$ plain form
5025 -667 -665 -696 -695 -647 -607 -622 -663 -662 -603 -540 -529 -574 -641 -699 -741 -778 -813 -820 -784 -723 -671 -645 -642 -653 -663 -669 -682 -715 -756 -768 -720 -639
6001 -639 -600 -656 -788 -920 -986 -969 -901 -820 -721 -553 -316 -134 -135 -321 -591 -849 -1020 -1046 -954 -858 -839 -854 -813 -738 -751
6767 -751 -896 -1038 -1039 -926 -805 -684 -500 -273 -124 -139 -272 -404 -465 -477 -492 -529 -593 -686 -780 -822 -801 -753 -701 -647
7503 -647 -607 -590 -578 -557 -542 -557 -605 -660 -673 -625 -565 -541 -558 -606 -684 -771 -818 -786 -691 -602 -570 -590 -630 -663 -671 -644 -602 -579 -597
8388 -597 -637 -649 -591 -504 -472 -516 -588 -642 -663 -643 -593 -548 -550 -594 -629 -623 -603 -607 -640 -674 -690 -697 -712 -732 -736 -713 -671 -630 -605 -602 -612 -615
9364 -615 -598 -575 -578 -618 -661 -679 -691 -722 -742 -727 -702 -697 -696 -676 -655 -657 -665 -642 -557 -385 -139 77 121 -48 -338 -601 -736 -746
10219 -746 -707 -678 -658 -628 -582 -538 -521 -545 -604 -684 -756 -782 -753 -699 -654 -626 -604 -590 -609 -659 -689 -674 -663 -703 -765 -786 -754 -706 -668
11104 -668 -643 -622 -599 -587 -612 -674 -727 -739 -724 -717 -719 -707 -683 -658 -630 -612 -637 -704 -756 -737 -660 -587 -565 -577 -583 -595 -649 -731 -784 -780 -745
$$ packed form
5025f67Kl1JM8M0j5m1JN9O3J1m5o7n8m2l7l5pL6O1N2K6Lj1j0oj3l3m1j2M8Q1
6001f39L9n6j32j32o6J7O8Q1R9J68K37J82jj86k70k58j71k6R2R6J9j5M1P5j3
6767g51j45j42jJ13J21J21J84K27J49j5j33j32o1j2j5l7o4r3r4m2K1M8N2N4
7503f47M0J7J2K1J5j5m8n5j3M8O0K4j7m8p8q7m7L2R5Q9L2k0m0l3qK7M2K3j8
8388e97m0j2N8Q7L2m4p2n4k1K0N0M5km4l5OK0ml3l4j6pj5k0mK3M2M1K5Lj0l
9364f15J7K3lm0m3j8j2l1k0J5K5NJK0K1kqK3Q5J72K46K16M4j69k90k63j35j0
10219g46L9K9K0L0M6M4J7k4n9q0p2k6K9N4M5K8K2J4j9n0l0J5J1m0o2k1L2M8L8
11104f68K5K1K3J2k5o2n3j2J5PkJ2K4K5K8J8k5o7n2J9P7P3K2j2oj2n4q2n3ML5
$$ plain form
12049 -745 -703 -657 -600 -543 -508 -516 -568 -646 -722 -761 -734 -663 -621 -654 -719 -737 -691 -625 -590 -600 -635 -665 -673 -680 -713 -765 -799 -801 -786 -759 -708
12995 -708 -647 -606 -591 -568 -523 -499 -545 -639 -706 -706 -660 -618 -619 -675 -761 -815 -798 -740 -697 -680 -660 -627 -603 -614 -647 -671 -684 -705 -725 -712
13911 -712 -662 -618 -616 -651 -691 -717 -727 -715 -673 -621 -587 -588 -615 -642 -651 -652 -669 -687 -666 -618 -607 -655 -712 -732 -721 -703 -695 -690 -661 -600 -565 -629
14884 -629 -773 -898 -927 -858 -756 -689 -672 -674 -684 -707 -724 -719 -705 -701 -699 -680 -649 -627 -615 -594 -555 -522 -526 -568 -625 -672 -685 -656 -614 -604
15800 -604 -636 -659 -633 -590 -592 -654 -729 -760 -740 -707 -696 -712 -739 -757 -747 -704 -642 -592 -571 -570 -591 -635 -676 -697 -706 -712 -702 -665 -623 -616 -655
16746 -655 -717 -772 -804 -811 -805 -811 -830 -822 -765 -692 -643 -611 -573 -526 -487 -487 -549 -670 -800 -892 -939 -955 -932 -854 -747 -666 -636 -617 -547 -410
17661 -410 -263 -192 -232 -355 -510 -668 -818 -954 -1052 -1090 -1058 -967 -831 -685 -585 -564 -594 -612 -580 -511 -454 -469 -589 -773
18397 -773 -920 -959 -912 -836 -762 -699 -660 -635 -614 -605 -620 -638 -648 -662 -683 -706 -744 -808 -871 -896 -867 -790 -686 -588 -527 -501 -496 -521 -583
$$ packed form
12049g45M2M6N7N7L5qn2p8p6l9K7P1M2l3o5j8M6O6L5j0l5l0qpl3n2l4kJ5K7N1
12995g08O1M1J5K3M5K4m6r4o7%M6M2jn6q6n4J7N8M3J7K0L3K4j1l3k4j3k1k0J3
13911g12N0M4Kl5m0k6j0J2M2N2L4jk7k7rjj7j8K1M8J1m8n7k0J1J8QNK9O1L5o4
14884f29j44j25k9O9J02O7J7kj0k3j7NJ4MKJ9L1K2J2K1L9L3mm2n7m7j3K9M2J0
15800f04l2k3K6M3ko2p5l1K0L3J1j6k7j8J0M3O2N0K1Jk1m4m1k1roJ0L7M2Pl9
16746f55o2n5l2pOoj9QN7P3M9L2L8M7L9%o2j21j30r2m7j6K3P8J07Q1L0J9P0J37
17661d10J47P1m0j23j55j58j50j36r8l8L2R1J36J46J00K1l0j8L2O9N7j5j20j84
18397g73j47l9M7P6P4O3L9K5K1Rj5j8j0j4k1k3l8o4o3k5K9P7J04R8O1K6Nk5o2
$$ plain form
19282 -583 -650 -684 -690 -697 -724 -767 -823 -875 -885 -820 -700 -576 -476 -394 -335 -331 -388 -466 -529 -600 -713 -851 -956 -1005 -1022 -1017 -957 -821
20132 -821 -657 -545 -517 -537 -556 -562 -573 -604 -652 -700 -728 -727 -711 -703 -706 -722 -742 -748 -732 -707 -695 -691 -671 -636 -624 -656 -702 -719 -696 -671 -687
21077 -687 -736 -765 -749 -718 -702 -694 -688 -695 -709 -713 -695 -664 -641 -653 -696 -737 -741 -715 -696 -706 -720 -704 -669 -663 -709 -765 -762 -695 -634 -623 -639 -646 -651
22089 -651 -671 -701 -721 -725 -715 -694 -680 -693 -719 -710 -660 -615 -616 -666 -731 -765 -743 -688 -640 -623 -650 -701 -736 -730 -707 -695 -689 -676 -675 -704 -741 -750
23065 -750 -727 -695 -666 -655 -683 -733 -755 -744 -734 -739 -749 -756 -753 -738 -727 -729 -735 -740 -754 -771 -770 -754 -740 -728 -711 -707 -730 -760 -764 -740 -701 -665 -648
24069 -648 -653 -670 -696 -724 -730 -698 -653 -651 -710 -781 -793 -728 -650 -644 -719 -785 -770 -706 -671 -691 -732 -771 -797 -787 -739 -691 -684 -708 -717 -674 -594 -540
25046 -540 -565 -654 -753 -822 -848 -825 -763 -690 -644 -648 -682 -716 -742 -744 -705 -636 -578 -566 -611 -696 -777 -805 -773 -732 -724 -723 -691 -655 -665 -707 -725
25992 -725 -714 -704 -694 -656 -602 -572 -591 -654 -724 -748 -711 -649 -621 -655 -719 -748 -711 -657 -661 -736 -820 -850 -825 -791 -767 -752 -745 -741 -728 -708
$$ packed form
19282e83o7l4opk7m3n6n2j0O5J20J24J00Q2N9Mn7p8o3p1j13j38j05m9j7NO0J36
20132h21J64J12K8k0j9oj1l1m8m8k8JJ6Qlj6k0oJ6K5J2MK0L5J2l2m6j7K3K5j6
21077f87m9k9J6L1J6QOpj4mJ8L1K3j2m3m1mK6J9j0j4J6L5Om6n6LO7O1J1j6pn
22089f51k0l0k0mJ0K1J4j3k6RN0M5jn0o5l4K2N5M8J7k7n1l5OK3J2OJ3Jk9l7r
23065g50K3L2K9J1k8n0k2J1J0nj0pLJ5J1konj4j7JJ6J4J2J7Mk3l0mK4L9L6J7
24069f48nj7k6k8oL2M5Kn9p1j2O5P8Op5o6J5O4L5k0m1l9k6J0M8M8Pk4rM3Q0N4
25046e40k5q9r9o9k6K3O2P3M6ml4l4k6kL9O9N8J2m5q5q1k8L2M1QJL2L6j0m2j8
25992g25J1J0J0L8N4L0j9o3p0k4L7O2K8l4o4k9L7N4mp5q4l0K5L4K4J5PMJ3K0
$$ plain form
26907 -708 -689 -672 -666 -681 -704 -704 -678 -651 -638 -634 -642 -665 -696 -725 -745 -743 -712 -674 -661 -663 -637 -575 -531 -555 -628 -676 -679 -694 -744 -768 -726 -677
27888 -677 -699 -782 -848 -842 -790 -759 -770 -772 -737 -711 -742 -798 -812 -760 -687 -650 -666 -713 -768 -827 -881 -913 -910 -884 -860 -852 -849 -823 -766 -701 -666
28834 -666 -676 -697 -691 -669 -674 -712 -742 -731 -702 -699 -711 -687 -615 -558 -569 -630 -683 -696 -685 -698 -754 -812 -820 -769 -701 -650 -623 -622 -645 -675 -691
29780 -691 -688 -682 -700 -741 -765 -753 -750 -807 -895 -936 -897 -826 -793 -817 -849 -821 -735 -660 -654 -695 -720 -700 -665 -663 -710 -783 -836 -835 -793 -757 -744 -731
30757 -731 -701 -662 -645 -666 -715 -767 -801 -805 -783 -759 -754 -764 -756 -712 -649 -610 -631 -713 -802 -836 -807 -762 -739 -730 -721 -720 -719 -698 -673 -689 -729 -724 -669
31761 -669 -647 -708 -789 -807 -758 -707 -704 -737 -747 -704 -648 -653 -723 -793 -812 -802 -804 -806 -778 -730 -706 -718 -742 -769 -800 -811 -771 -692 -625 -608 -630
32707 -630 -666 -710 -755 -770 -735 -688 -676 -691 -695 -682 -671 -673 -681 -664 -601 -529 -520 -593 -684 -734 -737 -720 -708 -719 -739 -731 -680 -635 -651 -719 -772 -763
33683 -763 -724 -717 -746 -753 -708 -652 -638 -675 -740 -797 -794 -723 -650 -636 -677 -731 -769 -775 -751 -721 -702 -694 -691 -697 -714 -735 -747 -742 -727 -714 -715 -730 -734 -698
$$ packed form
26907g08J9J7Oj5k3%K6K7J3Mqk3l1k9k0KL1L8J3kK6O2M4k4p3m8lj5n0k4M2M9
27888f77k2q3o6ON2L1j1kL5K6l1n6j4N2P3L7j6m7n5n9n4l2LK6K4QLK6N7O5L5
28834f66j0k1OK2nl8l0J1K9Lj2K4P2N7j1o1n3j3J1j3n6n8qN1O8N1K7Jk3l0j6
29780f91LOj8m1k4J2Ln7q8m1L9P1L3k4l2K8Q6P5Om1k5K0L5Km7p3n3JM2L6J3J3
30757g31L0L9J7k1m9n2l4mK2K4Nj0QM4O3L9k1q2q9l4K9M5K3RRJJK1K5j6m0NN5
31761f69K2o1q1j8M9N1Ll3j0M3N6np0p0j9J0kkK8M8K4j2k4k7l1j1M0P9O7J7k2
32707f30l6m4m5j5L5M7J2j5mJ3J1kqJ7O3P2Rp3r1n0lJ7J2j1k0QN1M5j6o8n3R
33683g63L9Pk9pM5N6J4l7o5n7LP1P3J4m1n4l8oK4L0J9QLoj7k1j2NJ5J3jj5mL6
$$ plain form
34725 -698 -636 -614 -663 -730 -749 -726 -711 -717 -733 -759 -792 -808 -790 -751 -709 -666 -627 -619 -668 -760 -826 -808 -731 -675 -673 -690 -703 -726 -761 -775
35641 -775 -759 -737 -729 -727 -726 -720 -700 -689 -723 -800 -857 -835 -744 -655 -633 -682 -744 -760 -730 -699 -699 -714 -719 -725 -748 -772 -773 -757 -748 -758 -772 -763 -735 -724
36675 -724 -743 -763 -754 -724 -703 -709 -726 -733 -728 -727 -737 -747 -744 -743 -758 -775 -777 -778 -776 -746 -699 -684 -721 -762 -741 -665 -610 -625 -687 -738 -746 -711 -655 -627
37713 -627 -659 -739 -815 -841 -812 -754 -699 -661 -645 -652 -678 -720 -774 -819 -825 -798 -764 -728 -693 -683 -713 -758 -797 -808 -750 -620 -517 -545 -674
38598 -674 -783 -805 -767 -722 -706 -724 -750 -747 -698 -624 -560 -527 -540 -603 -695 -775 -818 -834 -836 -814 -768 -730 -714 -704 -699 -712 -720 -696 -667 -682
39513 -682 -729 -771 -798 -806 -772 -685 -590 -554 -595 -677 -749 -782 -778 -751 -720 -704 -709 -720 -732 -755 -792 -806 -766 -698 -660 -675 -712 -720 -679 -631 -631
40459 -631 -680 -723 -724 -703 -694 -699 -706 -712 -709 -689 -669 -680 -730 -781 -780 -718 -641 -602 -608 -641 -688 -736 -774 -796 -810 -807 -775 -722 -682 -680 -693 -674 -620 -575
41494 -575 -584 -648 -730 -789 -820 -827 -801 -739 -675 -648 -676 -730 -753 -715 -653 -626 -643 -677 -714 -746 -760 -767 -792 -842 -883 -880 -831 -761 -694 -644 -614
$$ packed form
34725f98O2K2m9o7j9K3J5oj6k6l3j6J8L9M2M3L9Qm9r2o6J8P7N6Kj7j3k3l5j4
35641g75J6K2QKJOK0J1l4p7n7K2R1Q9K2m9o2j6L0L1%j5nok3k4jJ6Rj0j4RK8J1
36675g24j9k0RL0K1oj7pNJj0j0LJj5j7kjKL0M7J5l7m1K1P6N5j5o2n1qL5N6K8
37713f27l2q0p6k6K9N8N5L8J6pk6m2n4m5oK7L4L6L5J0l0m5l9j1N8J30J03k8j29
38598f74j09k2L8M5J6j8k6LM9P4O4L3j3o3r2q0m3j6kK2M6L8J6J0Nj3qK4K9j5
39513f82m7m2k7qL4Q7R5L6m1q2p2l3MK7L1J6nj1j2k3l7j4M0O8L8j5l7qM1M8%
40459f31m9m3jK1RnpoLK0K0j1n0n1JO2P7L9ol3m7m8l8k2j4LL2N3M0Kj3J9N4M5
41494e75ro4q2n9l1pK6O2O4K7k8n4k3L8O2K7j7l4l7l2j4pk5n0m1LM9P0O7N0L0
$$ plain form
42440 -614 -605 -617 -646 -661 -643 -629 -661 -720 -756 -745 -705 -676 -700 -768 -819 -808 -752 -694 -671 -692 -728 -735 -708 -687 -702 -736 -747 -724 -710 -734
43355 -734 -764 -754 -713 -688 -686 -677 -652 -649 -693 -754 -764 -707 -647 -644 -681 -712 -730 -749 -760 -747 -719 -700 -699 -702 -691 -660 -631 -631 -652 -661 -649 -636 -652
44367 -652 -712 -789 -840 -848 -822 -786 -761 -762 -779 -795 -801 -794 -782 -777 -783 -790 -776 -731 -667 -613 -588 -594 -631 -687 -725 -720 -691 -679 -690 -708 -725 -734 -725 -701
45404 -701 -677 -670 -686 -724 -773 -804 -773 -682 -601 -596 -642 -663 -640 -617 -638 -708 -799 -857 -844 -771 -692 -656 -666 -694 -712 -714 -703 -683 -651 -620
46320 -620 -617 -649 -687 -699 -672 -622 -593 -615 -662 -687 -674 -648 -648 -693 -763 -808 -797 -760 -738 -723 -681 -614 -554 -530 -567 -657 -744 -773 -755 -734
47235 -734 -724 -708 -681 -661 -645 -619 -600 -620 -673 -713 -708 -666 -625 -617 -632 -651 -682 -734 -787 -808 -784 -722 -651 -607 -602 -627 -662 -685 -682 -667 -669
48181 -669 -699 -741 -775 -781 -754 -715 -694 -692 -684 -655 -628 -634 -656 -663 -671 -716 -781 -802 -746 -658 -624 -676 -747 -755 -687 -606 -571 -593 -651 -706 -739 -756
49154 -756 -761 -736 -696 -689 -724 -750 -729 -678 -649 -671 -719 -746 -724 -665 -605 -592 -639 -699 -712 -677 -642 -643 -680 -725 -754 -767 -780 -788 -780 -765 -750
$$ packed form
42440f14Rj2k9j5J8J4l2n9l6J1M0K9k4o8n1J1N6N8K3k1l6pK7K1j5l4j1K3J4k4
43355g34l0J0M1K5KRK5Lm4o1j0N7O0Ll7l1j8j9j1J3K8J9JlJ1L1K9%k1rJ2J3j6
44367f52o0p7n1qK6L6K5jj7j6oPJ2NopJ4M5O4N4K5ol7n6l8NK9J2j1j8j7rRK4
45404g01K4Pj6l8m9l1L1R1Q1Nm6k1K3K3k1p0r1n8J3P3P9L6j0k8j8kJ1K0L2L1
46320f20Ll2l8j2K7N0K9k2m7k5J3K6%m5p0m5J1L7K2J5M2O7O0K4l7r0q7k9J8K1
47235g34J0J6K7K0J6K6J9k0n3m0NM2M1Qj5j9l1n2n3k1K4O2P1M4Nk5l5k3LJ5k
48181f69l0m2l4oK7L9K1KQK9K7ok2pqm5o5k1N6Q8L4n2p1qO8Q1L5k2n8n5l3j7
49154g56nK5M0Pl5k6K1N1K9k2m8k7K2N9O0J3m7o0j3L5L5jl7m5k9j3j3qQJ5J5
$$ plain form
50100 -750 -719 -672 -641 -637 -632 -611 -597 -616 -661 -709 -749 -776 -778 -745 -695 -663 -662 -680 -705 -717 -697 -660 -638 -625 -603 -583 -600 -667 -753 -806 -807
51046 -807 -776 -740 -709 -695 -697 -678 -622 -581 -615 -709 -792 -813 -781 -733 -701 -698 -715 -724 -711 -698 -701 -700 -679 -658 -657 -659 -647 -634 -657 -713 -763 -788
52023 -788 -802 -798 -765 -736 -757 -803 -789 -693 -594 -573 -624 -676 -679 -642 -608 -603 -626 -664 -706 -727 -709 -680 -686 -739 -815 -890 -939 -933 -879 -822 -797
52973 -797 -806 -846 -887 -880 -814 -730 -650 -576 -525 -518 -546 -580 -601 -610 -619 -647 -700 -763 -803 -799 -758 -703 -666 -670 -693 -693 -660 -632 -628 -637 -650 -657 -653 -647 -658
54041 -658 -695 -747 -789 -786 -733 -681 -670 -685 -694 -691 -688 -691 -696 -707 -721 -732 -741 -753 -760 -739 -694 -657 -649 -659 -678 -707 -729 -712 -653 -591 -567 -583 -595
55045 -595 -582 -579 -625 -699 -747 -744 -713 -700 -713 -720 -697 -673 -690 -741 -777 -760 -708 -653 -622 -624 -651 -683 -718 -762 -803 -823 -813 -768 -699 -636 -610
55991 -610 -620 -648 -683 -708 -706 -678 -652 -641 -654 -699 -766 -808 -786 -718 -661 -653 -678 -709 -746 -787 -813 -799 -742 -676 -642 -636 -626 -607 -608 -640 -669
56937 -669 -657 -622 -615 -649 -686 -709 -742 -790 -815 -784 -704 -614 -571 -612 -691 -724 -697 -661 -653 -669 -685 -686 -677 -672 -679 -703 -732 -725 -653 -557 -514 -563
$$ packed form
50100g50L1M7L1MNK1J4j9m5m8m0k7kL3N0L2Jj8k5j2K0L7K2J3K2K0j7o7q6n3j
51046h07L1L6L1J4kJ9N6M1l4r4q3k1L2M8L2Lj7rJ3J3lJK1K1JkJ2J3k3n6n0k5
52023g88j4ML3K9k1m6J4R6R9K1n1n2lL7L4Nk3l8m2k1J8K9on3p6p5m9ON4N7K5
52973g97rm0m1PO6Q4Q0P4N1Pk8l4k1rrk8n3o3m0MM1N5L7mk3%L3K8Mrj3pMOj1
54041f58l7n2m2LN3N2J1j5rLLlnj1j4j1rj2pK1M5L7Qj0j9k9k2J7N9O2K4j6j2
55045e95J3Lm6p4m8LL1J3j3pK3K4j7n1l6J7N2N5L1kk7l2l5m4m1k0J0M5O9O3K6
55991f10j0k8l5k5KK8K6J1j3m5o7m2K2O8N7Qk5l1l7m1k6J4N7O6L4OJ0J9jl2k9
56937f69J2L5Pl4l7k3l3m8k5L1Q0R0M3m1p9l3K7L6Qj6j6jRNpk4k9PP2R6M3m9
$$ plain form
57918 -563 -660 -723 -720 -687 -665 -654 -642 -632 -631 -638 -647 -660 -676 -686 -678 -657 -639 -624 -611 -622 -666 -708 -700 -653 -622 -641 -685 -705 -689 -670 -665 -665 -667
58925 -667 -681 -697 -694 -669 -647 -645 -649 -637 -615 -613 -645 -695 -726 -719 -685 -661 -672 -708 -734 -724 -683 -636 -597 -566 -543 -538 -569 -645 -738 -795 -784 -722
59902 -722 -654 -617 -620 -653 -697 -740 -774 -803 -821 -798 -725 -638 -588 -579 -582 -590 -618 -667 -717 -752 -766 -763 -755 -749 -734 -695 -646 -615 -621 -658 -700 -716 -705
60906 -705 -704 -731 -753 -745 -728 -727 -738 -751 -762 -766 -753 -710 -654 -632 -669 -722 -734 -711 -695 -702 -714 -714 -702 -701 -713 -723 -728 -737 -750 -766 -780 -772 -728 -663
61948 -663 -612 -599 -625 -670 -713 -743 -761 -770 -771 -778 -801 -816 -787 -735 -719 -758 -800 -801 -773 -758 -765 -769 -759 -745 -732 -714 -690 -666 -644 -633 -638 -641 -627
62955 -627 -614 -626 -652 -662 -656 -654 -646 -602 -541 -537 -622 -741 -822 -850 -855 -868 -872 -817 -688 -541 -451 -458 -552 -685 -802 -869 -871 -821 -754 -717
63870 -717 -717 -723 -710 -680 -663 -674 -697 -718 -737 -755 -756 -730 -683 -639 -630 -654 -668 -651 -624 -622 -649 -671 -663 -646 -653 -674 -678 -656 -640 -665 -728 -781 -782
64874 -782 -734 -669 -605 -550 -520 -528 -576 -653 -729 -762 -722 -630 -548 -516 -535 -584 -644 -695 -734 -761 -768 -752 -714 -655 -583 -531 -522 -552 -599 -646
$$ packed form
57918e63r7o3LL3K2J1J2J0Jprj3j6j0QK1J8J5J3j1m4m2QM7L1j9m4k0J6J9N%k
58925f67j4j6LK5K2KmJ2K2Kl2n0l1PL4K4j1l6k6J0M1M7L9L1K3Nl1p6r3n7J1O2
59902g22O8L7ll3m4m3l4k9j8K3P3Q7N0Rlqk8m9n0l5j4LQOJ5L9M9L1ol7m2j6J1
60906g05Jk7k2QJ7Jj1j3j1mJ3M3N6K2l7n3j2K3J6pj2%J2Jj2j0nrj3j6j4QM4O5
61948f63N1J3k6m5m3l0j8rjpk3j5K9N2J6l9m2jK8J5pmJ0J4J3J8K4K4K2J1nlJ4
62955f27J3j2k6j0OKQM4O1Mq5j19q1k8nj3mN5J29J47R0pr4j33j17o7kN0O7L7
63870g17%oJ3L0J7j1k3k1j9j8jK6M7M4Rk4j4J7K7Kk7k2QJ7pk1mK2J6k5o3n3j
64874g82M8O5O4N5L0qm8p7p6l3M0R2Q2L2j9m9o0n1l9k7pJ6L8N9P2N2Rl0m7m7
$$ plain form
65790 -646 -680 -695 -687 -649 -596 -568 -598 -674 -745 -770 -762 -755 -753 -733 -678 -600 -533 -510 -534 -589 -658 -709 -700 -645 -606 -608 -620 -610 -592 -605 -663 -729
66766 -729 -747 -703 -641 -608 -607 -623 -649 -665 -640 -584 -551 -575 -628 -658 -647 -619 -603 -601 -609 -619 -624 -627 -636 -640 -621 -582 -539 -509 -517 -578 -666 -725 -723
67773 -723 -675 -634 -626 -635 -644 -664 -696 -717 -708 -668 -609 -558 -554 -600 -653 -661 -623 -584 -579 -604 -628 -634 -621 -601 -591 -605 -624 -625 -626 -665 -731 -760 -719 -655
68808 -655 -643 -683 -701 -661 -618 -630 -679 -718 -733 -733 -717 -678 -616 -556 -537 -562 -599 -633 -678 -725 -735 -693 -635 -603 -603 -620 -639 -655 -670 -679
69723 -679 -677 -671 -664 -642 -601 -575 -595 -649 -692 -696 -681 -683 -707 -724 -709 -678 -671 -706 -754 -772 -741 -678 -625 -616 -639 -644 -620 -605 -628 -668 -690 -684 -664
70735 -664 -650 -651 -662 -678 -702 -727 -739 -731 -700 -653 -615 -611 -639 -673 -683 -666 -663 -697 -727 -695 -617 -558 -555 -593 -635 -651 -630 -589 -559 -553 -575 -612
71711 -612 -647 -664 -657 -635 -625 -627 -618 -597 -594 -617 -639 -629 -598 -588 -617 -662 -703 -726 -715 -674 -638 -638 -662 -679 -684 -692 -703 -704 -698 -688 -665 -635 -623
72718 -623 -637 -655 -652 -633 -612 -601 -605 -624 -647 -658 -661 -685 -723 -722 -657 -597 -616 -689 -730 -694 -626 -604 -656 -734 -770 -747 -695 -637 -573 -520 -518
$$ packed form
65790f46l4j5QL8N3K8l0p6p1k5QPKK0N5P8O7K3k4n5o9n1RN5L9kj2J0J8j3n8o6
66766g29j8M4O2L3Jj6k6j6K5N6L3k4n3l0J1K8J6Kqj0nlrmJ9L9M3L0qo1q8n9K
67773g23M8M1Qrrk0l2k1RM0N9N1Mm6n3qL8L9Nk5k4oJ3K0J0j4j9jjl9o6k9M1O4
68808f55J2m0j8M0M3j2m9l9j5%J6L9O2O0J9k5l7l4m5m7j0M2N8L2%j7j9j6j5r
69723f79KOPK2M1K6k0n4m3mJ5kk4j7J5L1Pl5m8j8L1O3N3Rk3nK4J5k3m0k2OK0
70735f64J4jj1j6k4k5j2QL1M7L8Mk8l4j0J7Ll4l0L2P8N9Ll8m2j6K1M1L0Ok2l7
71711f12l5j7PK2J0kRK1Lk3k2J0L1J0k9m5m1k3J1M1L6%k4j7nqj1jOJ0K3L0J2
72718f23j4j8LJ9K1J1mj9k3j1lk4l8JO5O0j9p3m1L6O8K2n2p8l6K3N2N8O4N3K
$$ plain form
73661 -518 -574 -645 -694 -728 -766 -794 -776 -707 -644 -635 -658 -661 -643 -645 -677 -702 -691 -656 -635 -631 -611 -567 -540 -568 -631 -683 -695 -692 -706 -728 -730 -727
74638 -727 -748 -770 -743 -679 -637 -636 -640 -625 -600 -591 -607 -632 -642 -643 -654 -661 -641 -609 -597 -618 -656 -690 -708 -703 -684 -678 -700 -728 -719 -656 -584 -565 -627
75645 -627 -729 -791 -775 -717 -670 -655 -666 -684 -688 -669 -645 -646 -684 -742 -774 -751 -695 -650 -624 -586 -518 -454 -450 -526 -624 -665 -638 -609 -627 -668
76560 -668 -686 -674 -653 -639 -640 -652 -677 -716 -750 -747 -708 -666 -648 -647 -639 -611 -571 -533 -522 -558 -632 -700 -724 -700 -658 -629 -615 -609 -610 -615 -618 -629 -656
77572 -656 -681 -679 -655 -637 -640 -655 -663 -667 -685 -704 -691 -655 -647 -687 -722 -705 -661 -643 -662 -684 -680 -651 -631 -635 -630 -583 -527 -530 -611 -713 -760 -726 -650
78579 -650 -593 -595 -649 -707 -725 -701 -657 -628 -647 -703 -724 -663 -571 -525 -539 -577 -605 -606 -587 -580 -597 -620 -630 -629 -630 -643 -651 -630 -583 -547 -558 -617
79552 -617 -683 -710 -683 -630 -592 -576 -568 -561 -568 -604 -664 -714 -720 -699 -687 -690 -685 -662 -634 -618 -618 -621 -609 -593 -605 -649 -688 -701 -692 -659 -611 -586 -605
80559 -605 -644 -673 -678 -660 -646 -666 -704 -717 -687 -628 -562 -516 -526 -594 -671 -702 -672 -619 -595 -616 -654 -676 -683 -678 -655 -620 -598 -593 -587 -566 -538
$$ packed form
73661e18n6p1m9l4l8k8J8O9O3Rk3lJ8kl2k5J1L5K1MK0M4K7k8o3n2j2Lj4k2kL
74638g27k1k2K7O4M2JmJ5K5Rj6k5j0jj1pK0L2J2k1l8l4j8NJ9Ok2k8RO3P2J9o2
75645f27j02o2J6N8M7J5j1j8mJ9K4jl8n8l2K3N6M5K6L8O8O4Mp6r8m1K7K9j8m1
76560f68j8J2K1J4jj2k5l9l4LL9M2J8JQK8M0L8J1l6p4o8k4K4M2K9J4Ojnlj1k7
77572f56k5KK4J8lj5qmj8j9J3L6Qm0l5J7M4J8j9k2MK9K0mNM7N6lq1j02m7L4P6
78579f50N7kn4n8j8K4M4K9j9n6k1O1R2M6j4l8k8jJ9Pj7k3j0Jjj3qK1M7L6j1n9
79552f17o6k7K7N3L8J6QPpl6o0n0oK1J2lNK3K8J6%lJ2J6j2m4l9j3RL3M8K5j9
80559f05l9k9nJ8J4k0l8j3L0N9O6M6j0o8p7l1L0N3K4k1l8k2pNK3L5K2NOK1K8
$$ plain form
81505 -538 -524 -534 -561 -587 -602 -605 -601 -604 -623 -646 -663 -677 -694 -696 -668 -627 -597 -581 -575 -590 -634 -682 -704 -692 -660 -630 -623 -637 -641 -612 -579 -592
82486 -592 -653 -722 -752 -719 -637 -564 -553 -605 -678 -726 -741 -735 -711 -670 -640 -639 -641 -617 -591 -603 -641 -657 -625 -568 -539 -570 -638 -691 -705 -691
83401 -691 -680 -692 -711 -701 -664 -633 -619 -612 -608 -615 -630 -650 -662 -652 -623 -609 -627 -658 -672 -661 -628 -591 -568 -558 -557 -580 -636 -697 -723 -702 -655
84347 -655 -613 -588 -589 -617 -654 -674 -671 -653 -624 -585 -545 -530 -563 -638 -716 -744 -700 -620 -571 -580 -611 -631 -641 -656 -667 -657 -623 -583 -564 -575
85263 -575 -605 -645 -694 -730 -730 -698 -659 -630 -613 -618 -639 -648 -642 -652 -683 -702 -680 -618 -545 -502 -514 -559 -590 -602 -629 -675 -708 -703 -663 -599 -545
86209 -545 -539 -565 -578 -574 -581 -602 -627 -661 -713 -753 -749 -693 -606 -529 -503 -522 -533 -515 -506 -536 -591 -650 -705 -727 -688 -617 -581 -593 -596 -570 -558 -590
87185 -590 -632 -644 -639 -642 -633 -577 -500 -486 -562 -659 -701 -681 -631 -582 -569 -618 -699 -744 -718 -655 -607 -588 -583 -583 -586 -594 -624 -684 -739 -752 -714 -639
88159 -639 -563 -538 -577 -639 -689 -716 -702 -637 -552 -504 -517 -559 -577 -563 -552 -572 -603 -607 -575 -530 -510 -532 -586 -643 -672 -654 -607 -584 -616
$$ packed form
81505e38J4j0k7k6j5lMlj9k3j7j4j7kK8M1L0J6Oj5m4m8k2J2L2L0Pj4mK9L3j3
82486e92o1o9l0L3Q2P3J1n2p3m8j5OK4M1L0JkK4K6j2l8j6L2N7K9l1o8n3j4J4
83401f91J1j2j9J0L7L1J4PMpj5k0j2J0K9J4j8l1j4J1L3L7K3J0Jk3n6o1k6K1M7
84347f55M2K5jk8l7k0LJ8K9L9M0J5l3p5p8k8M4Q0M9rl1k0j0j5j1J0L4M0J9j1
85263e75l0m0m9l6%L2L9K9J7nk1rOj0l1j9K2O2P3M3j2m5l1j2k7m6l3NM0O4N4
86209e45Ok6j3Mpk1k5l4n2m0MN6Q7P7K6j9j1J8Rl0n5n9n5k2L9P1L6j2lK6J2l2
87185e90m2j2NlRN6P7J4p6r7m2K0N0M9J3m9q1m5K6O3M8J9N%lql0o0n5j3L8P5
88159f39P6K5l9o2n0k7J4O5Q5M8j3m2j8J4J1k0l1mL2M5K0k2n4n7k9J8M7K3l2
$$ plain form
89044 -616 -666 -678 -646 -603 -571 -561 -573 -596 -628 -669 -698 -695 -672 -643 -608 -566 -535 -535 -565 -588 -573 -557 -592 -666 -713 -703 -663 -642 -653 -662
89959 -662 -642 -611 -591 -566 -503 -406 -335 -359 -473 -601 -668 -659 -609 -573 -574 -586 -584 -587 -616 -656 -685 -699 -699 -692 -690 -691 -677 -657 -655 -664 -650 -601 -548
90966 -548 -532 -564 -612 -642 -650 -648 -636 -605 -558 -513 -497 -524 -578 -617 -611 -574 -549 -555 -563 -543 -509 -501 -535 -585 -614 -608 -590 -577 -568 -573 -600 -630 -634 -619
92008 -619 -614 -626 -642 -649 -645 -638 -637 -650 -670 -675 -648 -594 -535 -491 -474 -479 -491 -500 -516 -542 -567 -575 -566 -551 -542 -540 -525 -492 -488 -553 -654 -716 -714 -675 -639
93073 -639 -615 -589 -552 -515 -490 -484 -496 -506 -499 -488 -499 -529 -560 -584 -596 -591 -578 -582 -608 -631 -621 -585 -544 -516 -523 -573 -637 -654 -592 -487 -420
94019 -420 -438 -511 -575 -595 -596 -612 -645 -670 -663 -623 -572 -541 -542 -557 -547 -500 -440 -409 -421 -456 -503 -562 -610 -610 -553 -462 -372 -320 -303 -265 -162
94965 -162 -31 51 61 20 -60 -167 -274 -363 -438 -496 -522 -524 -526 -528 -509 -484 -483 -503 -510 -498 -500 -532 -565 -563 -524 -485 -470 -482 -511 -548 -571
95911 -571 -576 -599 -645 -660 -609 -528 -466 -444 -467 -528 -593 -622 -609 -586 -586 -610 -627 -611 -571 -532 -516 -540 -595 -640 -636 -590 -539 -510 -496 -486
$$ packed form
89044f16n0j2L2M3L2J0j2k3l2m1k9LK3K9L5M2L1%l0k3J5J6l5p4m7J0M0K1j1r
89959f62K0L1K0K5O3R7P1k4j14j28o7RN0L6jj2Klk9m0k9j4%PKjJ4K0KrJ4M9N3
90966e48J6l2m8l0qKJ2L1M7M5J6k7n4l9OL7K5oqK0L4Ql4n0k9OJ8J3Rnk7l0mJ5
92008f19Nj2j6pMPJj3k0nK7N4N9M4J7nj2rj6k6k5qRJ5RKJ5L3Mo5j01o2KL9L6
93073f39K4K6L7L7K5Oj2j0PJ1j1l0l1k4j2NJ3mk6k3J0L6M1K8pn0o4j7O2J05O7
94019d20j8p3o4k0jj6l3k5PM0N1L1jj5J0M7O0L1j2l5m7n9m8%N7R1R0N2J7L8J03
94965a62J31Q2J0m1q0j07j07q9p5n8k6kkkJ9K5Jk0pJ2kl2l3KL9L9J5j2k9l7k3
95911e71nk3m6j5N1Q1O2K2k3o1o5k9J3K3%k4j7J6M0L9J6k4n5m5MM6N1K9J4J0
$$ plain form
96827 -486 -495 -533 -568 -560 -514 -485 -511 -561 -576 -546 -516 -530 -582 -628 -636 -612 -579 -561 -561 -557 -533 -517 -554 -629 -674 -647 -570 -500 -477 -495 -522
97773 -522 -543 -563 -592 -616 -612 -581 -555 -544 -526 -491 -457 -446 -477 -544 -601 -589 -528 -508 -563 -605 -542 -408 -306 -280 -310 -367 -446 -547
98627 -547 -657 -735 -742 -678 -583 -508 -485 -512 -559 -596 -623 -655 -679 -657 -572 -455 -365 -333 -356 -413 -494 -583 -637 -616 -549 -509 -526 -567
99481 -567 -590 -601 -632 -681 -707 -675 -605 -539 -497 -478 -478 -485 -476 -456 -461 -494 -524 -523 -505 -495 -505 -530 -550 -555 -556 -562 -564 -557 -540 -517 -498 -501 -539 -613
100519 -613 -701 -764 -760 -681 -566 -470 -427 -435 -471 -519 -568 -615 -656 -676 -657 -606 -546 -492 -465 -498 -576 -642 -665 -653 -625 -593 -570 -561 -559 -559 -573
101465 -573 -607 -652 -693 -716 -705 -658 -598 -544 -506 -495 -515 -548 -573 -587 -588 -565 -510 -438 -394 -424 -521 -625 -673 -660 -629 -622 -639 -649 -628
102350 -628 -586 -560 -579 -625 -648 -630 -615 -629 -637 -601 -535 -477 -452 -466 -511 -565 -611 -651 -693 -710 -678 -623 -589 -558 -499 -439 -439 -502 -569 -595
103265 -595 -582 -556 -544 -558 -582 -589 -567 -548 -579 -656 -706 -669 -575 -499 -479 -498 -534 -568 -575 -553 -541 -569 -613 -631 -624 -622 -630 -613 -557 -493 -477
$$ packed form
96827d86rl8l5QM6K9k6n0j5L0L0j4n2m6qK4L3J8%MK4J6l7p5m5K7P7P0K3j8k7
97773e22k1k0k9k4ML1K6J1J8L5L4J1l1o7n7J2O1K0n5m2O3J34J02K6l0n7p9j01
98627e47j10p8pO4R5P5K3k7m7l7k7l2k4K2Q5J17R0L2k3n7q1q9n4K1O7M0j7m1
99481e67k3j1l1m9k6L2P0O6M2J9%pRK0nl3l0JJ8J0j0k5k0njokPJ7K3J9ll8p4
100519f13q8o3MP9J15R6M3ql6m8m9m7m1k0J9N1O0N4K7l3p8o6k3J2K8L2K3RK%j4
101465e73l4m5m1k3J1M7O0N4L8J1k0l3k5j4jK3N5P2M4l0r7j04m8J3L1Pj7j0K1
102350f28M2K6j9m6k3J8J5j4qL6O6N8K5j4m5n4m6m0m2j7L2N5L4L1N9O0%o3o7k6
103265e95J3K6J2j4k4pK2J9l1p7n0L7R4P6K0j9l6l4pK2J2k8m4j8PKqJ7N6O4J6
$$ plain form
104211 -477 -526 -602 -643 -628 -602 -605 -629 -644 -644 -637 -616 -568 -517 -504 -532 -564 -572 -571 -574 -569 -563 -581 -623 -641 -610 -569 -563 -577 -584 -590 -616 -655 -680 -669
105253 -669 -617 -545 -476 -442 -459 -510 -556 -583 -603 -611 -589 -555 -544 -560 -581 -593 -592 -567 -524 -495 -504 -531 -557 -570 -568 -558 -552 -550 -552 -561 -558 -532 -502
106257 -502 -497 -516 -550 -597 -649 -689 -701 -677 -643 -632 -646 -647 -601 -515 -455 -483 -572 -614 -542 -409 -315 -306 -360 -445 -526 -566 -565 -564 -591 -619 -612
107203 -612 -568 -515 -482 -475 -477 -495 -553 -640 -695 -679 -614 -560 -553 -570 -574 -575 -608 -669 -707 -689 -637 -586 -549 -526 -512 -502 -503 -538 -603 -644 -615 -549
108180 -549 -509 -512 -539 -582 -635 -669 -662 -623 -573 -541 -556 -618 -670 -658 -586 -506 -472 -506 -573 -618 -618 -579 -522 -485 -503 -550 -566 -540 -511 -501
109095 -501 -495 -481 -461 -447 -457 -495 -538 -569 -590 -604 -606 -605 -604 -598 -588 -585 -578 -555 -525 -521 -555 -611 -650 -633 -569 -523 -540 -591 -624 -621 -588 -539 -508
110099 -508 -523 -563 -585 -579 -573 -581 -588 -580 -564 -561 -576 -601 -622 -624 -590 -530 -492 -503 -542 -581 -614 -644 -651 -600 -503 -442 -478 -563 -606 -607 -620 -635 -603
111106 -603 -521 -449 -449 -516 -587 -610 -595 -580 -571 -553 -530 -529 -565 -620 -655 -650 -621 -596 -584 -577 -574 -572 -560 -535 -516 -518 -536 -551 -553 -545 -544 -557 -573 -570 -552
$$ packed form
104211d77m9p6m1J5K6lk4j5%PK1M8N1J3k8l2qJlNOj8m2j8L1M1Oj4pok6l9k5J1
105253f69N2P2O9L4j7n1m6k7k0qK2L4J1j6k1j2JK5M3K9rk7k6j3KJ0OKkrLK6L0
106257e02Nj9l4m7n2m0j2K4L4J1j4jM6Q6O0k8q9m2P2J33R4Rn4q5q1m0JJk7k8P
107203f12M4N3L3Pkj8n8q7n5J6O5N4Pj7mjl3o1l8J8N2N1L7K3J4J0jl5o5m1K9O6
108180e49M0lk7m3n3l4PL9N0L2j5o2n2J2P2Q0L4l4o7m5%L9N7L7j8m7j6K6K9J0
109095e01OJ4K0J4j0l8m3l1k1j4kJJOJ0LPK3L0Ml4n6l9J7O4M6j7n1l3LL3M9L1
110099e08j5m0k2OOqpQJ6Lj5k5k1kL4O0L8j1l9l9l3l0pN1R7O1l6q5m3jj3j5L2
111106f03Q2P2%o7p1k3J5J5RJ8K3Jl6n5l5NK9K5J2PLKJ2K5J9kj8j5kQJj3j6LJ8
$$ plain form
112179 -552 -536 -533 -536 -533 -532 -551 -604 -661 -667 -604 -509 -439 -429 -465 -503 -523 -545 -578 -597 -588 -569 -553 -517 -452 -410 -452 -559 -641 -659 -651 -648 -626
113155 -626 -573 -523 -515 -534 -523 -458 -395 -413 -496 -542 -505 -452 -452 -483 -486 -462 -457 -490 -525 -532 -537 -570 -615 -628 -592 -531 -490 -492 -513 -515 -508 -519 -542
114159 -542 -550 -537 -516 -501 -493 -494 -520 -578 -639 -660 -632 -574 -511 -469 -465 -487 -500 -484 -462 -466 -498 -535 -569 -610 -645 -633 -566 -498 -489 -531 -572 -577
115136 -577 -555 -530 -518 -507 -470 -415 -397 -441 -497 -506 -477 -455 -455 -449 -419 -394 -419 -485 -531 -527 -521 -557 -594 -553 -440 -358 -387 -492 -577 -597
116051 -597 -567 -519 -473 -438 -416 -421 -459 -508 -533 -525 -507 -497 -500 -507 -507 -505 -522 -560 -587 -582 -566 -562 -565 -556 -529 -500 -492 -514 -549 -574 -584 -585 -578 -560 -528
117124 -528 -493 -478 -490 -515 -534 -541 -554 -578 -581 -540 -484 -456 -458 -474 -503 -555 -614 -641 -620 -567 -520 -514 -559 -616 -614 -551 -521 -587 -677 -680 -590 -486
118100 -486 -414 -376 -386 -454 -531 -558 -531 -491 -481 -520 -602 -670 -653 -558 -490 -516 -575 -565 -479 -396 -386 -458 -573 -664 -677 -619 -547 -504
118955 -504 -486 -489 -520 -556 -562 -538 -519 -528 -556 -576 -566 -530 -485 -440 -412 -424 -482 -560 -612 -620 -604 -590 -578 -559 -524 -475 -439 -443 -482 -526 -557
$$ packed form
112179e52J6LlLJj9n3n7oO3R5P0J0l6l8k0k2l3j9RJ9J6L6O5M2m2j07q2j8QLK2
113155f26N3N0Qj9J1O5O3j8q3m6L7N3%l1lK4Nl3l5pnl3m5j3L6O1M1kk1kPj1k3
114159e42qJ3K1J5Qjk6n8o1k1K8N8O3M2Mk2j3J6K2ml2l7l4m1l5J2O7O8Rm2m1n
115136e77K2K5J2J1L7N5J8m4n6rK9K2%OL0K5k5o6m6MOl6l7M1J13Q2k9j05q5k0
116051e97L0M8M6L5K2nl8m9k5QJ8J0lp%Kj7l8k7NJ6MlRK7K9Qk2l5k5j0jPJ8L2
117124e28L5J5j2k5j9pj3k4lM1N6K8kj6k9n2n9k7K1N3M7Om5n7KO3L0o6r0lR0J04
118100d86P2L8j0o8p7k7K7M0J0l9q2o8J7R5O8k6n9J0Q6Q3J0p2j15r1j3N8P2M3
118955e04J8ll1l6oK4J9rk8k0J0L6M5M5K8j2n8p8n2qJ6J4J2J9L5M9L6ml9m4l1
$$ plain form
119901 -557 -569 -578 -604 -644 -658 -627 -573 -532 -509 -494 -491 -516 -576 -644 -676 -654 -608 -569 -545 -537 -546 -565 -583 -594 -590 -560 -502 -446 -433 -476 -549
120847 -549 -608 -619 -581 -533 -520 -541 -547 -516 -485 -484 -486 -462 -424 -405 -416 -437 -445 -448 -466 -501 -533 -549 -551 -541 -507 -460 -441 -472 -510 -510 -489 -496 -536
121851 -536 -569 -566 -540 -520 -519 -537 -564 -577 -566 -549 -547 -553 -563 -591 -630 -645 -630 -611 -587 -551 -528 -549 -594 -608 -578 -539 -537 -577 -629 -656 -638
122797 -638 -580 -505 -437 -394 -390 -422 -455 -461 -441 -409 -386 -406 -480 -575 -653 -709 -755 -785 -783 -752 -711 -677 -652 -636 -628 -616 -578 -513 -439 -379 -342
123743 -342 -340 -378 -431 -449 -414 -375 -405 -532 -696 -790 -766 -671 -577 -501 -436 -401 -425 -494 -558 -580 -562 -516 -455 -400 -381 -401 -432 -449
124597 -449 -447 -439 -424 -392 -383 -445 -555 -645 -687 -683 -630 -552 -494 -472 -471 -480 -493 -497 -497 -500 -496 -489 -518 -610 -728 -802 -794 -725 -649 -615 -622 -623 -587 -546 -542
125670 -542 -545 -506 -423 -324 -236 -197 -237 -342 -455 -510 -498 -486 -526 -585 -607 -592 -580 -585 -597 -592 -549 -468 -392 -373 -414 -457 -464 -458 -474 -503
126585 -503 -513 -506 -504 -508 -493 -455 -426 -434 -462 -479 -494 -534 -578 -571 -517 -476 -473 -479 -469 -454 -464 -502 -526 -500 -451 -441 -469 -478 -455 -450 -485 -500 -446
$$ packed form
119901e57j2rk6m0j4L1N4M1K3J5Lk5o0o8l2K2M6L9K4Qrj9j8j1ML0N8N6J3m3p3
120847e49n9j1L8M8J3k1oL1L1JkK4L8J9j1k1qlj8l5l2j6kJ0L4M7J9l1l8%K1pm0
121851e36l3LK6K0Jj8k7j3J1J7Koj0k8l9j5J5J9K4L6K3k1m5j4L0L9Km0n2k7J8
122797f38N8P5O8M3Ml2l3oK0L2K3k0p4r5p8n6m6l0KL1M1L4K5J6QJ2L8O5P4O0L7
123743c42Kl8n3j8L5L9l0j27j64r4K4R5R4P6O5L5k4o9o4k2J8M6O1N5J9k0l1j7
124597d49KQJ5L2Ro2j10r0m2MN3P8N8K2Jrj3m%lMPk9r2j18p4QO9P6L4pjL6M1M
125670e42lL9Q3R9Q8L9m0j05j13n5J2J2m0n9k2J5J2nj2NM3Q1P6J9m1m3pOj6k9
126585e03j0PKmJ5L8K9qk8j7j5m0m4PN4M1LoJ0J5j0l8k4K6M9J0k8rK3Nl5j5N4
$$ plain form
127592 -446 -362 -331 -377 -443 -473 -474 -474 -480 -490 -507 -517 -493 -436 -385 -393 -450 -492 -481 -470 -512 -560 -540 -473 -447 -483 -533 -559 -558 -520 -439 -355
128538 -355 -334 -392 -481 -541 -556 -550 -543 -532 -507 -466 -429 -425 -459 -506 -521 -489 -453 -458 -501 -551 -585 -587 -547 -485 -450 -460 -471 -445 -409 -407 -431 -443
129511 -443 -434 -423 -413 -402 -403 -426 -456 -468 -468 -481 -512 -530 -506 -457 -422 -415 -432 -472 -530 -570 -561 -511 -462 -447 -467 -499 -512 -505 -506 -523 -531 -516 -501
130518 -501 -504 -503 -483 -466 -477 -498 -493 -466 -453 -454 -437 -395 -369 -399 -465 -498 -461 -391 -350 -363 -412 -455 -472 -482 -501 -506 -470 -416 -393 -421 -476
131464 -476 -519 -541 -551 -545 -516 -469 -423 -399 -408 -426 -424 -409 -400 -407 -427 -441 -429 -398 -375 -379 -409 -442 -463 -484 -517 -548 -553 -539 -531 -545 -564 -567 -546
132476 -546 -511 -473 -439 -409 -398 -419 -459 -484 -483 -486 -506 -515 -494 -464 -460 -492 -539 -565 -542 -493 -464 -462 -459 -459 -473 -472 -422 -367 -383 -457 -502 -475 -425
133483 -425 -421 -467 -502 -492 -457 -423 -399 -400 -433 -474 -488 -471 -445 -426 -407 -379 -348 -339 -369 -414 -435 -423 -413 -429 -458 -474 -482 -500 -526 -525 -485
134429 -485 -449 -459 -498 -520 -507 -486 -474 -458 -429 -401 -397 -430 -490 -526 -496 -431 -401 -426 -465 -485 -491 -488 -455 -375 -284 -248 -288 -357 -416 -478
$$ packed form
127592d46Q4L1m6o6l0j%oj0j7j0K4N7N1qn7m2J1J1m2m8K0O7K6l6n0k6JL8Q1Q4
128538c55K1n8q9o0j5OPJ1K5M1L7Ml4m7j5L2L6nm3n0l4kM0O2L5j0j1K6L6Kk4j2
129511d43RJ1J0J1jk3l0j2%j3l1j8K4M9L5Pj7m0n8m0RN0M9J5k0l2j3Pjj7qJ5J5
130518e01lJK0J7j1k1NK7J3jJ7M2K6l0o6l3L7P0M1j3m9m3j7j0j9nL6N4K3k8n5
131464d76m3k2j0OK9M7M6K4rj8KJ5Rpk0j4J2L1K3ml0l3k1k1l3l1nJ4Qj4j9lK1
132476e46L5L8L4L0J1k1m0k5Jlk0rK1L0Ml2m7k6K3M9K9KL%j4JN0N5j6p4m5K7N0
133483d25Mm6l5J0L5L4K4jl3m1j4J7K6J9J9K8L1Rl0m5k1J2J0j6k9j6qj8k6JM0
134429d85L6j0l9k2J3K1J2J6K9K8Ml3o0l6L0O5L0k5l9k0oLL3Q0R1L6m0o9n9o2
$$ plain form
135344 -478 -552 -590 -540 -445 -398 -424 -449 -413 -351 -341 -395 -446 -443 -404 -370 -338 -298 -287 -341 -426 -480 -487 -471 -461 -459 -440 -389 -342 -344 -391 -444
136287 -444 -476 -484 -475 -458 -433 -410 -419 -473 -532 -535 -471 -392 -365 -395 -442 -467 -478 -500 -524 -506 -430 -362 -402 -546 -663 -644 -525 -412 -357
137175 -357 -346 -324 -192 84 372 475 338 69 -203 -407 -518 -548 -530 -491 -437 -385 -358 -368 -404 -430 -429 -418 -430 -460 -475
137938 -475 -455 -405 -352 -328 -338 -361 -373 -377 -383 -390 -396 -419 -458 -470 -419 -348 -327 -360 -397 -424 -448 -455 -441 -445 -477 -505 -520 -535 -534 -482 -390 -323
138915 -323 -341 -428 -497 -492 -441 -403 -397 -413 -447 -485 -500 -480 -440 -402 -391 -416 -439 -420 -385 -411 -498 -551 -496 -377 -296 -291 -308 -298 -274 -269
139830 -269 -286 -305 -313 -313 -315 -320 -307 -259 -191 -132 -81 -45 -81 -214 -360 -410 -365 -312 -301 -307 -305 -307 -325 -335 -327 -334 -382 -444 -472 -459 -439 -446 -465
140837 -465 -462 -440 -425 -413 -376 -329 -330 -385 -441 -459 -442 -405 -364 -333 -328 -347 -378 -408 -423 -415 -401 -400 -403 -379 -334 -305 -323 -398 -510 -603 -618
141780 -618 -537 -389 -260 -254 -380 -528 -577 -507 -373 -235 -151 -174 -303 -457 -542 -513 -389 -251 -204 -292 -450 -561 -545
$$ packed form
135344d78p4l8N0R5M7k6k5L6O2J0n4n1LL9L4L2M0J1n4q5n4pJ6J0KJ9N1M7km7n3
136287d44l2qRJ7K5K3rn4n9lO4P9K7l0m7k5j1k2k4J8P6O8m0j44j17J9J19J13N5
137175c57J1K2J32K76K88J03j37k69k72k04j11l0J8L9N4N2K7j0l6k6JJ1j2l0j5
137938d75K0N0N3K4j0k3j2mopok3l9j2N1P1K1l3l7k7k4pJ4ml2k8j5j5JN2R2O7
138915c23j8q7o9NN1L8Oj6l4l8j5K0M0L8J1k5k3J9L5k6q7n3N5J19Q1Nj7J0K4N
139830b69j7j9q%knJ3M8O8N9N1L6l6j33j46n0M5N3J1oKkj8j0Qpm8o2k8J3K0pj9
140837d65LK2J5J2L7M7jn5n6j8J7L7M1L1Nj9l1l0j5QJ4JlK4M5K9j8p5j12r3j5
141780f18Q1J48J29Oj26j48m9P0J34J38Q4k3j29j54q5K9J24J38M7q8j58j11J6
$$ plain form
142480 -545 -428 -308 -267 -317 -433 -564 -635 -597 -479 -365 -316 -332 -370 -394 -390 -349 -295 -288 -351 -433 -467 -440 -390 -366 -379 -396 -379
143304 -379 -338 -316 -342 -386 -396 -383 -393 -422 -415 -355 -288 -262 -286 -344 -401 -425 -425 -441 -475 -481 -435 -377 -357 -369 -364 -328 -317 -368 -437 -459 -437
144250 -437 -420 -425 -434 -436 -433 -426 -413 -397 -389 -385 -371 -341 -318 -326 -368 -421 -453 -448 -420 -390 -352 -294 -244 -246 -282 -291 -259 -245 -284 -341 -366 -369 -393 -438 -453
145323 -453 -403 -318 -273 -300 -350 -357 -324 -286 -263 -259 -280 -313 -326 -309 -300 -336 -383 -366 -284 -219 -220 -258 -295 -330 -368 -383 -361 -322 -284 -248 -226
146269 -226 -250 -332 -440 -520 -534 -495 -441 -398 -364 -333 -308 -289 -266 -225 -167 -118 -116 -161 -213 -247 -297 -405 -542 -632 -653 -631 -574 -471
147123 -471 -342 -226 -147 -95 -34 55 138 154 87 -44 -216 -397 -539 -612 -626 -597 -512 -375 -239 -163 -157 -171 -155 -108 -77
147882 -77 -93 -143 -203 -279 -379 -460 -462 -384 -297 -264 -279 -293 -274 -235 -204 -205 -236 -261 -249 -215 -201 -233 -291 -323 -284 -185 -86 -29 -4 1
148797 1 -20 -74 -143 -197 -220 -243 -316 -429 -519 -558 -563 -540 -462 -320 -157 -31 36 67 83 63 -18 -144 -272 -377 -447 -468 -461
$$ packed form
142480e45J17J20M1n0j16j31p1L8J18J14M9j6l8k4MM1N4Po3q2l4K7N0K4j3j7J7
143304c79M1K2k6m4j0J3j0k9PO0O7K6k4n8n7k4%j6l4oM6N8K0j2NL6J1n1o9k2K2
144250d37J7nrkLPJ3J6QMJ4L0K3qm2n3l2NK8L0L8N8N0kl6rL2J4l9n7k5lk4m5j5
145323d53N0Q5M5k7n0pL3L8K3Mk1l3j3J7Rl6m7J7Q2O5jl8l7l5l8j5K2L9L8L6K2
146269b26k4q2j08q0j4L9N4M3L4L1K5J9K3M1N8M9Km5n2l4n0j08j37r0k1K2N7J03
147123d71J29J16P9N2O1Q9Q3J6o7j31j72j81j42p3j4K9Q5J37J36P6Oj4J6M7L1
147882g7j6n0o0p6j00q1kP8Q7L3j5j4J9L9L1jl1k5J2L4J4l2n8l2L9R9R9N7K5N
148797Ak1n4o9n4k3k3p3j13r0l9nK3P8J42J63J26O7L1J6k0q1j26j28j05p0k1P
$$ plain form
149624 -461 -470 -495 -482 -397 -271 -164 -114 -120 -151 -173 -185 -214 -255 -269 -241 -217 -240 -294 -328 -323 -316 -339 -360 -329 -266 -229 -226 -234 -233 -213 -171
150567 -171 -120 -88 -95 -127 -140 -105 -62 -83 -187 -298 -325 -279 -243 -252 -266 -252 -225 -214 -225 -256 -286 -292 -271 -248 -259 -317 -392 -430 -392
151455 -392 -293 -181 -114 -124 -180 -214 -205 -193 -212 -248 -274 -269 -229 -189 -200 -260 -301 -270 -207 -189 -228 -258 -231 -172 -138 -137 -140 -137 -125 -90 -35
152398 -35 5 -7 -70 -134 -130 -45 45 57 -16 -123 -230 -315 -345 -301 -237 -223 -265 -299 -283 -240 -216 -217 -216 -207 -206 -220 -237 -250 -259 -260 -257 -261 -269
153405 -269 -272 -276 -290 -296 -276 -240 -208 -180 -156 -151 -168 -187 -205 -229 -246 -231 -196 -181 -203 -231 -225 -205 -207 -215 -190 -153 -146 -176 -205 -203 -171 -127 -90
154416 -90 -83 -112 -158 -196 -207 -180 -118 -47 -15 -59 -167 -264 -274 -196 -102 -43 -23 -32 -79 -155 -221 -230 -167 -74 -18 -21 -43 -26 30 63 39
155362 39 3 0 17 -1 -83 -176 -203 -167 -123 -101 -93 -77 -42 -17 -40 -97 -136 -131 -110 -100 -96 -80 -51 -14 25 50 43 10 -22 -23 4 32
156339 32 49 73 110 139 146 145 145 141 122 90 53 8 -58 -134 -175 -151 -94 -60 -61 -68 -70 -70 -71 -80 -97 -107 -96 -78 -72 -85 -109 -132 -146 -141 -101
$$ packed form
149624d61rk5J3Q5J26J07N0ol1k2j2k9m1j4K8K4k3n4l4NPk3k1L1O3L7LqJK0M2
150567a71N1L2pl2j3L5M3k1j04j11k7M6L6rj4J4K7J1j1l1l0oK1K3j1n8p5l8L8
151455c92R9J12O7j0n6l4RJ2j9l6k6NM0M0j1o0m1L1O3J8l9l0K7N9L4JlLJ2L5N5
152398c5M0j2o3o4MQ5R0J2p3j07j07q5l0M4O4J4m2l4J6M3K4jJRJj4j7j3rjLmq
153405b69lmj4oK0L6L2K8K4Nj7j9j8k4j7J5L5J5k2k8OK0kqK5L7Pl0k9KL2M4L7
154416i0Pk9m6l8j1K7O2P1L2m4j08r7j0P8R4N9K0rm7p6o6rO3R3N6lk2J7N6L3k4
155362C9l6lJ7j8q2r3k7L6M4K2QJ6L5K5k3n7l9NK1J0MJ6K9L7L9K5pl3l2jK7K8
156339C2J7K4L7K9Pj%mj9l2l7m5o6p6m1K4N7L4jpk%jrj7j0J1J8Oj3k4k3j4NM0
$$ plain form
157404 -101 -30 42 84 100 111 126 144 162 169 156 125 77 10 -61 -107 -125 -122 -83 4 109 182 202 196 196 196 167 103 34 -14 -29 -19
158350 -19 0 18 44 89 141 166 165 182 237 289 295 246 148 31 -64 -127 -176 -202 -178 -114 -51 -11 20 56 95 131 153 137 81 20
159265 20 -24 -67 -118 -138 -79 30 104 105 89 108 161 218 268 305 307 275 241 230 225 199 164 158 193 235 257 256 239 225 241 281 294
160211 294 247 172 111 70 51 72 135 202 233 238 267 331 385 383 337 311 326 326 267 187 145 140 135 114 96 114 175 237 251 221 202
161157 202 234 293 324 302 241 171 113 89 110 162 214 244 246 216 174 163 210 299 387 430 414 365 319 292 290 319 376 443 492 496
162073 496 451 391 355 366 407 442 463 476 472 454 451 464 458 427 423 470 515 514 498 509 533 544 558 594 638 681 745 833 910 924 858
163023 858 753 697 737 830 911 975 1034 1053 984 860 781 790 827 827 806 808 814 772 690 627 619 657 714 769 796 778 740 711 679 632
163939 632 613 656 713 712 668 651 689 735 740 705 663 635 612 582 562 571 599 624 649 670 676 665 642 609 602 662 771 859 879 830 746
$$ packed form
157404a01P1P2M2J6J1J5J8J8Pj3l1m8o7p1m6j8LL9Q7J05P3K0o%%k9o4o9m8j5J0
158350a9J9J8K6M5N2K5jJ7N5N2Om9r8j17r5o3m9k6K4O4O3M0L1L6L9L6K2j6n6o1
159265B0m4m3n1k0N9J09P4Jj6J9N3N7N0L7Kl2l4j1nk6l5oL5M2K2jj7j4J6M0J3
160211B94m7p5o1m1j9K1O3O7L1NK9O4N4km6k6J5%n9q0m2nnk1j8J8O1O2J4l0j9
161157B02L2N9L1k2o1p0n8k4K1N2N2L0Kl0m2j1M7Q9Q8M3j6m9m6k7kK9N7O7M9M
162073D96m5o0l6J1M1L5K1J3mj8lJ3ol1mM7M5jj6J1K4J1J4L6M4M3O4Q8P7J4o6
163023H58j05n6M0R3Q1O4N9J9o9j24p9RL7%k1KOm2q2o3qL8N7N5K7j8l8k9l2m7
163939F32j9M3N7jm4j7L8M6Nl5m2k8k3l0k0RK8K5K5K1Oj1k3l3pO0J09Q8K0m9q4
$$ plain form
164885 746 671 630 622 629 636 644 667 707 748 771 767 751 756 802 852 855 814 785 804 863 939 1018 1081 1104 1084 1063 1086 1147 1218 1282 1313 1281
165861 1281 1202 1122 1057 998 947 909 880 865 882 938 1056 1290 1671 2181 2771 3368 3920 4438 4943 5429 5875 6196
166528 6196 6249 5967 5428 4800 4231 3750 3289 2802 2296 1809 1395 1112 976 958 1024 1141 1263 1339 1354 1339 1336 1371
167205 1371 1423 1455 1444 1392 1315 1258 1255 1262 1220 1133 1046 980 943 954 1015 1081 1095 1050 996 979 987 1002 1050 1150 1265 1334 1346 1363 1444
168090 1444 1562 1647 1689 1725 1747 1718 1645 1592 1594 1632 1686 1736 1753 1736 1740 1832 2047 2353 2641 2823 2934 3073 3275 3489 3635
168849 3635 3677 3628 3498 3281 2993 2690 2426 2201 1976 1754 1573 1451 1370 1330 1339 1367 1370 1343 1314 1294 1286 1304 1344 1373 1360
169611 1360 1344 1404 1557 1725 1836 1891 1937 1990 2029 2031 2001 1966 1943 1923 1874 1788 1696 1642 1643 1688 1750 1798 1795 1723 1621 1557 1547 1572
170469 1572 1615 1647 1620 1531 1443 1422 1466 1521 1552 1573 1607 1654 1700 1747 1777 1760 1694 1606 1524 1478 1485 1530 1568 1584 1608 1678 1782 1881
$$ packed form
164885G46p5m1qPPQK3M0M1K3mj6NM6N0Lm1k9J9N9P6P9O3K3k0k1K3O1P1O4L1l2
165861A281p9q0o5n9n1l8k9j5J7N6J18K34L81N10N90N97N52N18N05M86M46L21
166528F196N3k82n39o28n69m81m61m87n06m87m14k83j36j8O6J17J22P6J5j5lL5
167205A371N2L2j1n2p7n7lPm2q7q7o6l7J1O1O6J4m5n4j7QJ5M8J00J15O9J2J7Q1
168090A444J18Q5M2L6K2k9p3n3KL8N4N0J7j7MR2K15L06K88J82J11J39K02K14J46
168849C635M2m9j30k17k88l03k64k25k25k22j81j22q1m0RK8Lk7k9k0qJ8M0K9j3
169611A360j6O0J53J68J11N5M6N3L9Kl0l5k3k0m9q6r2n4JM5O2M8lp2j02o4j0K5
170469A572M3L2k7q9q8k1M4N5L1K1L4M7M6M7L0j7o6q8q2m6PM5L8J6K4P0J04R9
$$ plain form
171323 1881 1940 1952 1915 1833 1732 1640 1564 1492 1433 1425 1505 1631 1722 1767 1839 1972 2114 2215 2288 2358 2395 2350 2219 2060 1950
172089 1950 1923 1953 1989 2002 1989 1969 1968 1984 1970 1904 1845 1842 1867 1857 1811 1771 1766 1785 1807 1816 1809 1806 1834 1902 1990 2087 2175 2214 2190 2144 2111
173035 2111 2077 2026 1976 1944 1916 1878 1847 1846 1883 1949 2015 2065 2107 2162 2233 2319 2406 2467 2482 2458 2426 2419 2445 2477 2469 2410 2341 2300 2272 2234
173951 2234 2204 2226 2298 2363 2382 2357 2314 2268 2232 2226 2272 2361 2448 2490 2492 2493 2514 2547 2597 2694 2832 2942 2965 2933 2933 3016 3164 3321
174805 3321 3429 3464 3467 3504 3575 3609 3586 3580 3644 3746 3834 3898 3950 4008 4105 4269 4490 4717 4923 5122 5347 5626 5965 6333
175533 6333 6739 7337 8414 10175 12544 15231 17900 20238 22165 23911 25686 27488 29124 30037 29588
175992 29588 27699 24846 21691 18807 16372 14170 11964 9676 7413 5485 4237 3783 3921 4313 4720
176448 4720 5056 5300 5445 5518 5590 5705 5810 5834 5803 5782 5779 5754 5665 5506 5324 5190 5127 5065 4929 4728 4526 4347 4189
$$ packed form
171323A881N9J2l7q2j01r2p6p2n9qQ0J26R1M5P2J33J42J01P3P0L7m5j31j59j10
172089A950k7L0L6J3j3k0jJ6j4o6n9lK5j0m6m0nJ9K2RplK8O8Q8R7Q8L9k4m6l3
173035B111l4n1n0l2k8l8l1jL7O6O6N0M2N5P1Q6Q7O1J5k4l2pK6L2qn9o9m1k8l8
173951B234l0K2P2O5J9k5m3m6l6oM6Q9Q7M2KJK1L3N0R7J38J10K3l2%Q3J48J57
174805C321J08L5LL7P1L4k3oO4J02Q8O4N2N8R7J64K21K27K06J99K25K79L39L68
175533F333M06N98J077J761K369K687K669K338J927J746J775J802J636R13m49
175992B9588j889k853l155k884k435k202k206k288k263j928j248m54J38L92M07
176448D720L36K44J45P3P2J15J05K4l1k1lk5q9j59j82j34o3o2j36k01k02j79j58
$$ plain form
177153 4189 4073 4035 4087 4199 4310 4386 4445 4536 4672 4824 4956 5039 5078 5107 5150 5193 5216 5232 5254 5268 5260 5237 5218 5209 5212 5231 5251
177973 5251 5252 5234 5219 5232 5280 5328 5315 5224 5127 5112 5171 5239 5292 5353 5416 5444 5433 5418 5413 5406 5398 5397 5396 5394 5409 5451 5499 5513 5487 5460 5448 5407
178954 5407 5300 5178 5122 5150 5216 5276 5314 5348 5402 5477 5559 5645 5729 5786 5799 5770 5720 5667 5613 5548 5478 5433 5428 5436 5419 5388 5386 5422 5468
179834 5468 5533 5660 5843 6012 6121 6197 6269 6310 6289 6242 6236 6291 6356 6371 6372 6452 6641 6856 7011 7130 7292 7490 7622 7639
180569 7639 7618 7665 7798 7942 8029 8102 8272 8585 8982 9402 9840 10297 10736 11109 11418 11721 12068 12421 12689 12846
181183 12846 12970 13160 13488 14012 14830 16187 18539 22334 27645 34100 41169 48456 55827 63314 70822
181634 70822 78023 84371 88942 90718 89428 85759 80686 74847 68294 60746 52228 43282 34684 27254
182068 27254 21633 18235 19458 33630 72807 141556 231603 331085 432149 530135 624588 716933
$$ packed form
177153D189j16l8N2J12J11P6N9R1J36J52J32Q3L9K9M3M3K3J6K2J4qk3j9rLJ9K0
177973E251Jj8j5J3M8M8j3r1r7j5N9O8N3O1O3K8j1j5npqjjkJ5M2M8J4k6k7j2m1
178954E407j07j22n6K8O6O0L8L4N4P5Q2Q6Q4N7J3k9n0n3n4o5p0m5nQj7l1kL6M6
179834E468O5J27J83J69J09P6P2M1k1m7oN5O5J5JQ0J89K15J55J19J62J98J32J7
180569G639k1M7J33J44Q7P3J70L13L97M20M38M57M39L73L09L03L47L53K68J57
181183A2846J24J90L28N24Q18J357K352L795N311O455P069P287P371P487P508
181634G0822P201O348M571J776j290l669n073n839o553p548q518q946q598p430
182068B7254n621l398J223J4172L9177O8749R0047R9482J01064R7986R4453R2345
$$ plain form
182435 716933 805799 888791 955249 980524 948462 868480 762429 650409 543904 443498
182737 443498 347257 255354 167414 86647 23545 -11840 -19476 -9351 6421 20441 30808
183075 30808 38264 43767 47681 50061 51094 51123 50487 49422 48005 46240 44205 42055 39953 38067 36524
183531 36524 35331 34375 33522 32712 31971 31349 30852 30406 29909 29329 28737 28217 27790 27420 27060 26675 26266 25856
184079 25856 25454 25052 24673 24364 24116 23823 23398 22921 22545 22303 22111 21908 21711 21553 21417 21239 20971 20630 20297
184657 20297 20023 19759 19418 19026 18700 18477 18270 18006 17740 17575 17525 17501 17420 17280 17108 16906 16666 16400 16142 15908
185273 15908 15685 15449 15177 14861 14528 14217 13944 13706 13503 13305 13059 12761 12486 12281 12094 11879 11681 11544 11414
185851 11414 11220 10971 10730 10526 10339 10138 9931 9757 9634 9529 9393 9208 9009 8832 8684 8566 8489 8464 8464 8445
$$ packed form
182435G16933Q8866Q2992O6458K5275l2062p9982j06051j12020j06505j00406
182737D43498r6241r1903q7940q0767o3102l5385p636J0125J5772J4020J0367
183075C0808P456N503L914K380J033K9o36j065j417j765k035k150k102j886j543
183531C6524j193r56q53q10p41o22m97m46m97n80n92n20m27l70l60l85m09m10
184079B5856m02m02l79l09k48k93m25m77l76k42j92k03j97j58j36j78k68l41l33
184657B0297k74k64l41l92l26k23k07k64k66j65n0k4q1j40j72k02k40k66k58k34
185273A5908k23k36k72l16l33l11k73k38k03j98k46k98k75k05j87k15j98j37j30
185851A1414j94k49k41k04j87k01k07j74j23j05j36j85j99j77j48j18p7k5%j9
$$ plain form
186457 8445 8404 8382 8402 8426 8424 8414 8408 8403 8405 8422 8439 8459 8493 8529 8536 8526 8529 8540 8527 8487 8448 8421 8396 8367 8345 8338 8328 8292 8239 8209 8227 8270
187434 8270 8317 8368 8419 8468 8523 8589 8653 8715 8802 8939 9109 9257 9339 9368 9383 9376 9315 9200 9061 8917 8780 8652 8539 8436
188169 8436 8319 8182 8062 8020 8082 8196 8277 8278 8224 8175 8174 8206 8223 8206 8178 8159 8136 8099 8064 8051 8049 8041 8027 8029 8071 8149 8225 8273 8304
189054 8304 8331 8375 8471 8634 8800 8878 8849 8774 8713 8668 8638 8641 8662 8645 8557 8404 8212 8037 7950 7961 8001 7993 7943 7920 7962 8046 8123
189881 8123 8167 8168 8123 8052 7997 7987 8008 8037 8065 8073 8044 7997 7978 7996 8008 7984 7961 8009 8112 8164 8110 8028 8013 8053 8070 8022 7943 7890 7863
190766 7863 7820 7750 7702 7721 7791 7842 7826 7766 7716 7692 7681 7679 7683 7671 7625 7549 7462 7393 7366 7370 7381 7385 7376 7365 7378 7425 7484 7533 7567 7580 7573
191712 7573 7575 7605 7624 7591 7524 7475 7457 7425 7338 7217 7115 7051 7002 6939 6870 6831 6847 6894 6931 6945 6954 6966 6975 6981 6990 7001 7002 6983 6935 6852
192627 6852 6747 6633 6509 6385 6293 6253 6248 6248 6231 6190 6135 6082 6048 6049 6082 6118 6116 6057 5957 5859 5799 5780 5787 5812 5842 5846 5807 5756 5731
$$ packed form
186457H445m1k2K0K4kj0onKJ7J7K0L4L6Pj0LJ1j3m0l9k7k5k9k2pj0l6n3l0J8M3
187434H270M7N1N1M9N5O6O4O2Q7J37J70J48Q2K9J5po1j15j39j44j37j28j13j03
188169H436j17j37j20m2O2J14Q1Jn4m9jL2J7j7k8j9k3l7l5j3kqj4KM2P8P6M8L1
189054H304K7M4R6J63J66P8k9p5o1m5l0LK1j7q8j53j92j75q7J1M0qn0k3M2Q4P7
189881H123M4Jm5p1n5j0K1K9K8Qk9m7j9J8J2k4k3M8J03N2n4q2j5M0J7m8p9n3k7
190766G863m3p0m8J9P0N1j6o0n0k4j1kMj2m6p6q7o9k7MJ1Mrj1J3M7N9M9L4J3p
191712G573KL0J9l3o7m9j8l2q7j21j02o4m9o3o9l9J6M7L7J4RJ2RORJ1Jj9m8q3
192627F852j05j14j24j24r2m0n%j7m1n5n3l4JL3L6kn9j00r8o0j9PK5L0Ml9n1k5
$$ plain form
193512 5731 5725 5713 5710 5742 5786 5786 5709 5590 5492 5442 5430 5447 5487 5518 5508 5461 5420 5407 5409 5403 5379 5340 5301 5264 5220 5177 5162 5184 5203 5179
194428 5179 5130 5113 5149 5190 5189 5160 5136 5105 5045 4986 4970 4963 4891 4746 4622 4608 4675 4720 4695 4635 4587 4560 4554 4554 4526 4468 4425 4429 4458 4471
195343 4471 4445 4368 4257 4168 4157 4218 4283 4292 4235 4165 4137 4141 4137 4120 4106 4087 4058 4035 4019 3994 3962 3952 3984 4030 4041 4007 3956 3916 3887
196228 3887 3861 3822 3752 3656 3571 3527 3511 3471 3369 3240 3164 3180 3215 3169 3040 2924 2886 2894 2888 2861 2848 2867 2907 2943 2945 2910 2897 2958
197083 2958 3061 3138 3173 3200 3255 3327 3371 3367 3335 3296 3269 3279 3325 3348 3296 3197 3120 3088 3071 3039 2994 2942 2876 2791 2686 2573 2509
197902 2509 2579 2827 3207 3650 4132 4661 5219 5758 6244 6687 7104 7424 7506 7291 6861 6336 5808 5311 4822 4316
198518 4316 3816 3374 3026 2772 2596 2483 2414 2369 2337 2312 2300 2323 2391 2464 2480 2425 2349 2304 2294 2292 2281 2262 2248 2240 2221 2189
199312 2189 2164 2159 2169 2192 2219 2224 2182 2113 2062 2047 2039 2012 1983 1993 2038 2068 2046 1988 1932 1899 1884 1880 1894 1923 1949 1959 1947 1906 1853 1827
$$ packed form
193512E731oj2lL2M4%p7j19r8n0j2J7M0L1j0m7m1j3Kok4l9l9l7m4m3j5K2J9k4
194428E179m9j7L6M1jk9k4l1o0n9j6pp2j45j24j4O7M5k5o0m8k7o%k8n8m3MK9J3
195343D471k6p7j11q9j1O1O5Rn7p0k8Mmj7j4j9k9k3j6k5l2j0L2M6J1l4n1m0k9
196228C887k6l9p0r6q5m4j6m0j02j29p6J6L5m6j29j16l8Qok7j3J9M0L6Kl5j3O1
197083B958J03P7L5K7N5P2M4ml2l9k7J0M6K3n2r9p7l2j7l2m5n2o6q5j05j13o4
197902B509P0K48L80M43M82N29N58N39M86M43M17L20Q2k15m30n25n28m97m89n06
198518D316n00m42l48k54j76j13o9m5l2k5j2K3O8P3J6n5p6m5j0kj1j9j4qj9l2
199312B189k5nJ0K3K7Nm2o9n1j5qk7k9J0M5L0k2n8n6l3j5mJ4K9K6J0j2m1n3k6
$$ plain form
200227 1827 1842 1883 1916 1912 1866 1800 1740 1712 1738 1792 1817 1793 1755 1728 1691 1632 1589 1611 1683 1739 1735 1691 1644 1588 1495 1388 1342 1383 1456
201112 1456 1488 1457 1400 1385 1444 1531 1583 1578 1536 1476 1414 1371 1377 1423 1450 1418 1371 1367 1395 1401 1374 1344 1328 1320 1314 1301 1278 1266 1292 1350 1388
202058 1388 1368 1309 1261 1243 1241 1245 1253 1255 1246 1235 1226 1211 1213 1261 1322 1322 1252 1173 1124 1084 1037 1019 1063 1126 1141 1114 1100 1110 1111 1095 1085 1077 1043
203065 1043 991 962 967 967 913 827 817 942 1071 1018 824 746 920 1159 1184 994 856 949 1147 1193 1041 879 872 986
203793 986 1080 1073 998 943 960 1028 1081 1073 1014 949 899 840 778 768 821 859 822 744 697 700 706 668 607 595 656 730 755 742 728 724 718 705
204774 705 698 697 683 647 617 623 655 667 648 639 661 660 580 472 459 571 686 647 466 349 462 694 772 605 403 407 587
205593 587 702 629 505 516 647 735 712 675 705 754 752 721 713 718 682 609 575 629 722 743 625 415 240 198 273 363 378
206417 378 319 244 195 180 189 218 269 329 362 351 330 332 340 324 285 252 259 309 345 303 202 132 145 199 211 151 76 70 148 225 217
$$ packed form
200227A827J5M1L3mm6o6o0k8K6N4K5k4l8k7l7n9m3K2P2N6mm4m7n6r3j07m6M1P3
201112A456L2l1n7j5N9Q7N2nm2o0o2m3OM6K7l2m7mK8Ok7l0j6qoj3k3j2K6N8L8
202058A388k0n9m8j8kMQKrj1rj5KM8O1%p0p9m9m0m7j8M4O3J5k7j4J0Jj6j0ql4
203065A043n2k9N%n4q6j0J25J29n3j94p8J74K39K5j90j38R3J98M6j52j62pJ14
203793I86R4pp5n5J7O8N3qn9o5n0n9o2j0N3L8l7p8m7LOl8o1j2O1P4K5j3j4moj3
204774G05pjj4l6l0OL2J2j9rK2jq0j08j3J12J15l9j81j17J13K32P8j67k02MJ80
205593E87J15p3j24J1J31Q8k3l7L0M9kl1qNl6p3l4N4R3K1j18k10j75m2P5R0J5
206417C78n9p5m9j5RK9N1O0L3j1k1KQj6l9l3PN0L6m2j01p0J3N4J2o0p5oP8P7q
$$ plain form
207363 217 137 62 40 53 74 102 138 158 141 119 144 212 259 246 203 194 252 340 380 346 289 266 267 247 191 127 96 109 136 153
208279 153 156 120 31 -55 -58 13 80 88 37 -34 -77 -72 -39 -5 11 -5 -52 -97 -104 -77 -43 -25 -35 -59 -68 -47 -22 -26 -72 -137 -169 -142
209255 -142 -96 -97 -170 -277 -341 -308 -209 -136 -153 -243 -322 -318 -246 -179 -170 -209 -255 -280 -275 -232 -163 -125 -169 -259 -299 -243 -154 -119 -152 -210
210171 -210 -248 -245 -218 -216 -255 -292 -288 -256 -228 -212 -201 -191 -194 -223 -270 -297 -281 -264 -300 -363 -381 -342 -311 -336 -387 -406 -379 -332 -291 -274 -286
211117 -286 -318 -349 -345 -301 -270 -306 -373 -383 -327 -295 -340 -399 -385 -304 -241 -249 -302 -354 -379 -384 -380 -364 -335 -309 -306 -328 -371 -411 -419 -391 -362 -367
212098 -367 -407 -452 -460 -410 -337 -290 -280 -287 -282 -241 -165 -76 7 74 97 66 10 -33 -78 -159 -266 -341 -363 -368 -401 -444 -451 -431 -448 -522 -594
213043 -594 -612 -587 -571 -576 -571 -540 -505 -485 -479 -482 -498 -525 -551 -560 -543 -510 -471 -436 -428 -464 -508 -504 -458 -422 -414 -431 -483 -556 -604 -616 -609 -578 -522
214050 -522 -488 -516 -585 -637 -630 -571 -495 -434 -415 -452 -525 -582 -602 -614 -634 -627 -568 -510 -531 -618 -676 -654 -603 -583 -580 -560 -539 -561 -614 -651
$$ packed form
207363B17q0p5k2J3K1K8L6K0j7k2K5O8M7j3m3rN8Q8M0l4n7k3Jk0n6o4l1J3K7J7
208279A53Ll6q9q6lP1O7Qn1p1m3NL3L4J6j6m7m5pK7L4J8j0k4rK1K5mm6o5l2K7
209255a42M6jp3j07o4L3R9P3j7r0p9MP2O7Rl9m6k5NM3O9L8m4r0m0N6Q9L5l3n8
210171b10l8LK7Kl9l7ML2K8J6J1J0lk9m7k7J6J7l6o3j8L9L1k5n1j9K7M7M1J7j2
211117b86l2l1MM4L1l6o7j0N6L2m5n9J4Q1O3qn3n2k5nMJ6K9K6Lk2m3m0qK8K9n
212098c67m0m5qN0P3M7J0pNM1P6Q9Q3O7K3l1n6m3m5q1j07p5k2nl3m3pK0j7p4p2
213043e94j8K5J6nNL1L5K0Olj6k7k6rJ7L3L9L5Ql6m4MM6L6Qj7n2p3m8j2PL1N6
214050e22L4k8o9n2PN9P6O1J9l7p3n7k0j2k0PN9N8k1q7n8K2N1K0LK0K1k2n3l7
$$ plain form
214966 -651 -666 -692 -725 -729 -711 -704 -704 -697 -689 -674 -633 -573 -524 -501 -507 -565 -688 -819 -883 -865 -804 -739 -706 -723 -783 -856 -905 -909 -867 -790 -693
215912 -693 -605 -552 -541 -566 -627 -692 -710 -670 -608 -558 -536 -561 -629 -672 -638 -565 -529 -544 -572 -601 -652 -721 -767 -763 -715 -652 -619 -634 -675
216797 -675 -705 -723 -742 -763 -773 -768 -753 -745 -774 -851 -937 -976 -947 -872 -794 -754 -769 -809 -819 -773 -705 -669 -680 -713 -767 -870 -1003 -1101 -1133
217682 -1133 -1117 -1073 -1013 -948 -881 -813 -763 -750 -767 -786 -772 -706 -609 -538 -535 -592 -665 -722 -750 -759 -764 -763 -753 -755 -772 -768 -726 -677 -653 -640 -626
218628 -626 -640 -708 -810 -896 -934 -927 -899 -869 -848 -847 -859 -853 -805 -742 -699 -668 -631 -609 -646 -742 -841 -887 -868 -823 -790 -776 -776 -796 -832 -850
219543 -850 -828 -789 -772 -788 -823 -857 -864 -826 -762 -728 -760 -830 -885 -905 -906 -898 -867 -812 -774 -801 -884 -951 -961 -953 -966 -981 -960 -903 -840 -797 -779
220489 -779 -790 -825 -865 -899 -906 -866 -805 -788 -829 -865 -852 -829 -849 -905 -934 -903 -850 -834 -861 -894 -899 -881 -868 -874 -893 -913 -925 -924 -913 -898 -886
221432 -886 -883 -892 -910 -928 -946 -982 -1031 -1046 -992 -902 -847 -857 -904 -946 -950 -917 -895 -928 -991 -1035 -1044 -1019 -958 -895 -880 -907 -920 -888 -835 -811 -835
$$ packed form
214966f51j5k6l3mJ8P%PQJ5M1O0M9K3on8j23j31o4J8O1O5L3j7o0p3m9mM2P7R7
215912f93Q8N3J1k5o1o5j8M0O2N0K2k5o8m3L4P3L6j5k8k9n1o9m6MM8O3L3j5m1
216797f75l0j8j9k1j0NJ5Qk9p7q6l9K9P5P8M0j5m0j0M6O8L6j1l3n4j03j33r8l2
217682a133J6M4O0O5O7O8N0J3j7j9J4O6R7P1Ln7p3n7k8rnJJ0kj7MM2M9K4J3J4
218628f26j4o8j02q6l8PK8L0K1Jj2OM8O3M3L1L7K2l7r6r9m6J9M5L3J4%k0l6j8
219543h50K2L9J7j6l5l4pL8O4L4l2p0n5k0jQL1N5L8k7q3o7j0Qj3j5K1N7O3M3J8
220489g79j1l5m0l4pM0O1J7m1l6J3K3k0n6k9L1N3J6k7l3nJ8J3oj9k0j2JJ1J5J2
221432h86Lrj8j8j8l6m9j5N4R0N5j0m7m2mL3K2l3o3m4rK5O1O3J5k7j3L2N3K4k4
$$ plain form
222378 -835 -891 -950 -987 -995 -976 -938 -896 -868 -854 -853 -874 -926 -987 -1011 -989 -974 -1001 -1031 -1025 -1001 -996 -1000 -978 -923 -885 -903 -945 -955 -926 -909 -935
223324 -935 -980 -1007 -1014 -1021 -1026 -1013 -975 -920 -872 -871 -934 -1025 -1092 -1113 -1085 -1020 -950 -900 -872 -879 -944 -1041 -1090 -1049 -969 -917 -913 -936 -976 -1036 -1089 -1086
224301 -1086 -1029 -972 -943 -939 -955 -985 -1012 -1043 -1091 -1126 -1103 -1044 -1023 -1069 -1122 -1121 -1072 -1028 -1018 -1040 -1071 -1089 -1095 -1104 -1115 -1122 -1113 -1092 -1082 -1091 -1102 -1123
225282 -1123 -1179 -1252 -1277 -1228 -1126 -1010 -916 -875 -885 -910 -937 -990 -1074 -1138 -1134 -1071 -983 -893 -827 -823 -890 -991 -1063 -1082 -1075 -1076 -1076 -1051 -1015
226162 -1015 -1006 -1028 -1032 -977 -917 -946 -1057 -1118 -1053 -950 -936 -1009 -1051 -1009 -967 -1023 -1148 -1220 -1173 -1067 -1005 -1019 -1037 -1002 -953 -963 -1029
226986 -1029 -1097 -1135 -1138 -1120 -1107 -1103 -1090 -1067 -1054 -1069 -1095 -1101 -1084 -1079 -1102 -1121 -1109 -1077 -1053 -1044 -1050 -1074 -1101 -1100 -1062 -1003 -957 -958 -999 -1037 -1059 -1089
227962 -1089 -1114 -1097 -1035 -965 -925 -934 -997 -1078 -1123 -1106 -1062 -1043 -1047 -1015 -928 -858 -882 -982 -1066 -1079 -1053 -1044 -1060 -1059 -1031 -1021 -1062 -1126 -1167 -1180
228878 -1180 -1189 -1197 -1179 -1114 -1026 -971 -975 -1020 -1082 -1150 -1214 -1265 -1302 -1309 -1263 -1166 -1059 -1001 -1016 -1065 -1082 -1048 -1013 -1027 -1079 -1117 -1113 -1092 -1095 -1131 -1179
$$ packed form
222378h35n6n9l7qJ9L8M2K8J4Jk1n2o1k4K2J5k7l0OK4NmK2N5L8j8m2j0K9J7k6
223324i35m5k7ppnJ3L8N5M8Jo3r1o7k1K8O5P0N0K8po5r7m9M1Q0N2Mk3m0o0n3L
224301a086N7N7K9Mj6l0k7l1m8l5K3N9K1m6n3JM9M4J0k2l1j8orj1pRK1J0rj1k1
225282a123n6p3k5M9J02J16R4M1j0k5k7n3q4o4MO3Q8R0O6Mo7j01p2j9Pj%K5L6
226162a015Rk2mN5O0k9j11o1O5J03J4p3m2M2M2n6j25p2M7J06O2j4j8L5M9j0o6
226986a029o8l8lJ8J3MJ3K3J3j5k6oJ7Nk3j9J2L2K4Rok4k7JL8N9M6jm1l8k2l0
227962a089k5J7O2P0M0ro3q1m5J7M4J9mL2Q7P0k4j00q4j3K6Rj6JK8J0m1o4m1j3
228878a180rqJ8O5Q8N5mm5o2o8o4n1l7pM6R7J07N8j5m9j7L4L5j4n2l8MK1ll6m8
$$ plain form
229824 -1179 -1224 -1248 -1224 -1155 -1085 -1053 -1048 -1032 -1005 -1009 -1074 -1168 -1218 -1191 -1132 -1094 -1086 -1101 -1135 -1175 -1190 -1177 -1162 -1150 -1126 -1082 -1030 -1002 -1016 -1057
230739 -1057 -1091 -1114 -1133 -1142 -1133 -1122 -1129 -1143 -1136 -1101 -1072 -1085 -1135 -1179 -1174 -1117 -1046 -1012 -1026 -1059 -1077 -1087 -1106 -1130 -1147 -1165 -1195 -1222 -1223 -1184 -1112
231690 -1112 -1025 -951 -924 -965 -1055 -1138 -1180 -1194 -1196 -1172 -1107 -1025 -970 -975 -1033 -1101 -1135 -1123 -1092 -1074 -1076 -1083 -1083 -1084 -1097 -1123 -1148 -1156 -1142 -1118 -1110 -1121
232666 -1121 -1120 -1095 -1069 -1048 -1021 -1001 -1016 -1062 -1107 -1134 -1136 -1122 -1101 -1066 -1026 -1016 -1060 -1130 -1173 -1161 -1113 -1056 -1002 -963 -963 -1000 -1033 -1033 -1023 -1042
233582 -1042 -1094 -1144 -1161 -1151 -1139 -1144 -1168 -1179 -1143 -1067 -1005 -1001 -1045 -1091 -1109 -1112 -1126 -1149 -1162 -1157 -1143 -1142 -1162 -1174 -1151 -1114 -1107 -1130 -1141 -1117 -1087
234528 -1087 -1083 -1092 -1083 -1045 -1008 -1014 -1076 -1148 -1174 -1155 -1135 -1136 -1139 -1129 -1107 -1084 -1060 -1031 -1004 -998 -1019 -1058 -1105 -1149 -1168 -1160 -1151 -1152 -1138 -1104 -1080 -1086 -1112 -1132
235562 -1132 -1133 -1123 -1115 -1105 -1080 -1041 -1016 -1035 -1095 -1160 -1191 -1175 -1134 -1097 -1085 -1089 -1081 -1044 -1006 -1001 -1036 -1091 -1139 -1165 -1185 -1210 -1220 -1193 -1138 -1076 -1032
236508 -1032 -1023 -1035 -1040 -1042 -1055 -1065 -1066 -1096 -1174 -1238 -1219 -1141 -1096 -1123 -1162 -1154 -1113 -1072 -1047 -1053 -1095 -1127 -1105 -1047 -1004 -993 -1003 -1034 -1092 -1150 -1170
$$ packed form
229824a179m5k4K4O9P0L2NJ6K7mo5r4n0K7N9L8Qj5l4m0j5J3J5J2K4M4N2K8j4m1
230739a057l4k3j9rRJ1pj4PL5K9j3n0m4NN7P1L4j4l3j8j0j9k4j7j8l0k7jL9P2
231690a112Q7P4K7m1r0q3m2j4kK4O5Q2N5nn8o8l4J2L1J8kp%jj3k6k5qJ4K4Qj1
232666a121JK5K6K1K7K0j5m6m5k7kJ4K1L5M0J0m4p0m3J2M8N7N4L9%l7l3%J0j9
233582a042n2n0j7J0J2nk4j1L6P6O2Mm4m6j8lj4k3j3NJ4Jk0j2K3L7Pk3j1K4L0
234528a087MrRL8L7oo2p2k6J9K0jlJ0K2K3K4K9K7Ok1l9m7m4j9QRjJ4L4K4ok6k0
235562a132jJ0QJ0K5L9K5j9o0o5l1J6M1L7J2mQL7L8Nl5n5m8k6k0k5j0K7N5O2M4
236508a032Rj2nkj3j0jl0p8o4J9P8M5k7l9QM1M1K5om2l2K2N8M3J1j0l1n8n8k0
$$ plain form
237454 -1170 -1161 -1157 -1166 -1167 -1155 -1147 -1146 -1146 -1150 -1151 -1127 -1066 -1008 -1000 -1047 -1111 -1160 -1191 -1208 -1209 -1183 -1123 -1057 -1035 -1077 -1144 -1183 -1178 -1155 -1149 -1171 -1202 -1223 -1223 -1195
238527 -1195 -1139 -1085 -1077 -1101 -1103 -1075 -1051 -1044 -1049 -1068 -1077 -1050 -1015 -1011 -1033 -1065 -1105 -1149 -1185 -1212 -1234 -1231 -1190 -1144 -1136 -1157 -1161 -1133 -1105 -1101 -1100 -1062 -994 -940
239561 -940 -928 -941 -955 -979 -1028 -1089 -1128 -1145 -1165 -1191 -1194 -1163 -1130 -1134 -1170 -1211 -1232 -1219 -1187 -1172 -1179 -1178 -1153 -1116 -1087 -1078 -1103 -1164 -1236 -1280 -1271 -1215
240538 -1215 -1141 -1087 -1078 -1107 -1144 -1168 -1173 -1158 -1122 -1089 -1086 -1110 -1128 -1111 -1066 -1023 -1012 -1045 -1120 -1204 -1252 -1272 -1305 -1342 -1336 -1274 -1187 -1103 -1038 -1004
241453 -1004 -1004 -1029 -1080 -1139 -1162 -1126 -1064 -1033 -1051 -1079 -1069 -1026 -996 -1017 -1093 -1185 -1244 -1256 -1240 -1228 -1241 -1269 -1270 -1227 -1170 -1135 -1126 -1123 -1124 -1136 -1138
242399 -1138 -1108 -1075 -1082 -1135 -1201 -1249 -1265 -1246 -1200 -1156 -1137 -1138 -1136 -1114 -1080 -1062 -1069 -1084 -1085 -1083 -1095 -1118 -1140 -1157 -1172 -1181 -1173 -1139 -1090 -1052 -1046 -1077 -1126
243411 -1126 -1165 -1176 -1171 -1165 -1165 -1173 -1182 -1167 -1120 -1071 -1059 -1100 -1164 -1201 -1187 -1159 -1151 -1142 -1101 -1051 -1031 -1037 -1052 -1081 -1122 -1158 -1176 -1185 -1189 -1177 -1135 -1069 -1000
244418 -1000 -964 -982 -1036 -1090 -1129 -1155 -1169 -1168 -1159 -1157 -1162 -1163 -1147 -1112 -1082 -1094 -1147 -1198 -1220 -1220 -1202 -1172 -1145 -1120 -1093 -1081 -1087 -1079 -1042 -1020 -1052 -1116
$$ packed form
237454a170RMrjJ2QJ%mjK4O1N8Qm7o4m9l1j7jK6O0O6K2m2o7l9NK3Ok2l1k1%K8
238527a195N6N4Qk4kK8K4Pnj9rK7L5Mk2l2m0m4l6k7k2LM1M6Qk1mK8K8MJL8O8N4
239561i40J2j3j4k4m9o1l9j7k0k6lL1L3ml6m1k1J3L2J5pJK5L7K9Rk5o1p2m4RN6
240538a215P4N4Rk9l7k4nJ5L6L3Lk4j8J7M5M3J1l3p5q4m8k0l3l7OO2Q7Q4O5L4
241453a004%k5n1n9k3L6O2L1j8k8J0M3L0k1p6r2n9j2J6J2j3k8jM3N7L5RLjj2k
242399a138L0L3pn3o6m8j6J9M6M4J9jKK2L4J8pj5jKj2k3k2j7j5rQL4M9L8Ol1m9
243411a126l9j1NO%qrJ5M7M9J2m1o4l7J4K8QRM1N0K0oj5k9m1l6j8rmJ2M2O6O9
244418a000L6j8n4n4l9k6j4JRKnjJ6L5L0j2n3n1k2%J8L0K7K5K7J2oQL7K2l2o4
$$ plain form
245394 -1116 -1151 -1130 -1084 -1079 -1138 -1206 -1206 -1134 -1055 -1025 -1051 -1106 -1147 -1140 -1091 -1051 -1073 -1141 -1173 -1114 -1019 -979 -1012 -1070 -1108 -1109 -1084 -1060 -1058 -1085 -1133
246337 -1133 -1166 -1157 -1123 -1108 -1117 -1127 -1133 -1132 -1105 -1064 -1056 -1090 -1126 -1127 -1091 -1058 -1071 -1132 -1200 -1239 -1253 -1248 -1209 -1131 -1054 -1014 -994 -964 -940 -972 -1055 -1131
247314 -1131 -1148 -1106 -1046 -1003 -987 -997 -1034 -1083 -1117 -1121 -1103 -1066 -1000 -919 -866 -865 -911 -989 -1075 -1136 -1144 -1110 -1091 -1125 -1179 -1205 -1204 -1193 -1166 -1116
248229 -1116 -1056 -1004 -969 -954 -969 -1024 -1111 -1203 -1258 -1244 -1171 -1095 -1058 -1041 -1017 -1009 -1042 -1108 -1169 -1183 -1140 -1084 -1064 -1079 -1101 -1118 -1127 -1125 -1112 -1079
249144 -1079 -1022 -979 -1003 -1081 -1134 -1132 -1134 -1187 -1261 -1306 -1301 -1267 -1234 -1202 -1165 -1147 -1171 -1215 -1225 -1182 -1112 -1057 -1039 -1047 -1054 -1055 -1062 -1076 -1080 -1062 -1021 -963
250121 -963 -923 -947 -1034 -1131 -1197 -1222 -1209 -1170 -1125 -1077 -1028 -1005 -1032 -1079 -1101 -1090 -1065 -1053 -1071 -1108 -1129 -1127 -1124 -1133 -1157 -1199 -1243 -1249 -1197 -1127 -1097
251067 -1097 -1111 -1131 -1135 -1123 -1102 -1073 -1034 -997 -1000 -1067 -1169 -1249 -1277 -1262 -1227 -1189 -1159 -1137 -1118 -1105 -1101 -1086 -1035 -987 -1000 -1045 -1043 -1006 -1009 -1059
251982 -1059 -1097 -1084 -1038 -1002 -1008 -1041 -1051 -1018 -984 -1001 -1061 -1102 -1091 -1052 -1013 -979 -959 -968 -1004 -1039 -1056 -1068 -1091 -1117 -1135 -1154 -1175 -1170 -1128 -1078
$$ packed form
245394a116l5K1M6Nn9o8%P2P9L0k6n5m1PM9M0k2o8l2N9R5M0l3n8l8jK5K4Kk7m8
246337a133l3RL4J5rj0oJK7M1Ql4l6jL6L3j3o1o8l9j4NL9P8P7M0K0L0K4l2q3p6
247314a131j7M2O0M3J6j0l7m9l4mJ8L7O6Q1N3Jm6p8q6o1qL4J9l4n4k6JJ1K7N0
248229a116O0N2L5J5j5n5q7r2n5J4P3P6L7J7K4Ql3o6o1j4M3N6K0j5k2j7rKJ3L3
249144a079N7M3k4p8n3Kkn3p4m5NL4L3L2L7J8k4m4j0M3P0N5J8qpjpj4mJ8M1N8
250121i63M0k4q7r7o6k5J3L9M5M8M9K3k7m7k2J1K5J2j8l7k1KLrk4m2m4oN2P0L0
251067a097j4k0mJ2K1K9L9L7lo7j02q0k8J5L5L8L0K2J9J3MJ5N1M8j3m5KL7ln0
251982a059l8J3M6L6ol3j0L3L4j7o0m1J1L9L9L4K0rl6l5j7j2k3k6j8j9k1NM2N0
$$ plain form
252898 -1078 -977 -532 684 2689 4615 5188 3918 1603 -458 -1542 -1767 -1615 -1441 -1338 -1249 -1128 -1015
253415 -1015 -971 -991 -1020 -1027 -1019 -997 -954 -912 -910 -957 -1007 -1017 -997 -983 -977 -962 -945 -946 -968 -1000 -1037 -1073 -1088 -1068 -1024 -993 -998 -1036 -1074 -1078 -1036 -972
254396 -972 -939 -971 -1045 -1103 -1104 -1045 -961 -902 -887 -906 -944 -993 -1047 -1089 -1096 -1062 -1024 -1032 -1085 -1123 -1095 -1017 -950 -932 -957 -1015 -1079 -1098 -1058 -1015
255312 -1015 -1006 -998 -957 -903 -884 -922 -995 -1054 -1070 -1056 -1045 -1044 -1025 -972 -923 -917 -927 -899 -826 -749 -724 -781 -887 -961 -969 -957 -963 -977 -997 -1041 -1086
256257 -1086 -1068 -995 -952 -986 -1055 -1098 -1098 -1067 -1033 -1021 -1026 -1022 -987 -938 -913 -929 -971 -1017 -1058 -1093 -1123 -1139 -1123 -1080 -1042 -1035 -1040 -1025 -988 -961 -969
257203 -969 -1007 -1046 -1075 -1096 -1101 -1076 -1033 -1010 -1021 -1042 -1032 -993 -962 -946 -895 -772 -627 -568 -642 -779 -885 -935 -953 -946 -895 -798 -700 -668
258058 -668 -743 -893 -1031 -1087 -1060 -1007 -993 -1036 -1102 -1144 -1140 -1099 -1048 -1006 -967 -925 -896 -895 -930 -992 -1055 -1106 -1150 -1168 -1135 -1071 -1027 -1025 -1045
258938 -1045 -1051 -1037 -1041 -1091 -1142 -1084 -879 -653 -582 -689 -838 -918 -945 -978 -1023 -1057 -1075 -1084 -1086 -1098 -1115 -1096 -1029 -959 -927 -916 -898 -867
$$ packed form
252898a078J01M45J216K005J926N73j270k315k061j084k25J52J74J03Q9J21J13
253415a015M4k0k9pQK2M3M2Km7n0j0K0J4OJ5J7jk2l2l7l6j5K0M4L1nl8l8mM2O4
254396i72L3l2p4n8jN9Q4N9J5j9l8m9n4m2pL4L8qn3l8K8P8O7J8k5n8o4j9M0M3
255312a015RQM1N4J9l8p3n9j6J4J1JJ9N3M9Oj0K8P3P7K5n7j06p4qJ2oj4k0m4m5
256257a086J8P3M3l4o9m3%L1L4J2nML5M9K5j6m2m6m1l5l0j6J6M3L8PnJ5L7K7q
257203i69l8l9k9k1nK5M3K3j1k1J0L9L1J6N1J23J45N9p4j37j06n0j8PN1R7R8L2
258058f68p5j50j38n6K7N3J4m3o6m2MM1N1M2L9M2K9Jl5o2o3n1m4j8L3O4M4Kk0
258938a045oJ4mn0n1N8K05K26P1j07j49q0k7l3m5l4j8rkj2j7J9O7P0L2J1J8L1
$$ plain form
259793 -867 -815 -730 -653 -659 -776 -941 -1067 -1112 -1094 -1049 -1008 -983 -991 -1040 -1099 -1117 -1079 -1031 -1022 -1044 -1054 -1039 -1039 -1079 -1130 -1144 -1104 -1024 -932
260678 -932 -873 -878 -939 -1019 -1089 -1147 -1189 -1183 -1113 -1020 -958 -942 -957 -993 -1038 -1066 -1072 -1070 -1060 -1032 -978 -900 -811 -740 -734 -827 -990 -1124 -1163 -1132
261593 -1132 -1090 -1060 -1048 -1049 -1030 -963 -889 -878 -938 -1002 -1010 -972 -921 -887 -901 -967 -1039 -1073 -1070 -1040 -983 -937 -958 -1027 -1065 -1046 -1024 -1029 -1018 -959
262509 -959 -895 -890 -935 -957 -916 -857 -839 -875 -943 -1015 -1054 -1032 -975 -951 -993 -1054 -1072 -1042 -997 -940 -847 -746 -726 -825 -971 -1076 -1111 -1095
263363 -1095 -1041 -982 -969 -1008 -1049 -1048 -1019 -984 -947 -925 -959 -1042 -1108 -1111 -1061 -994 -951 -961 -1019 -1079 -1109 -1112 -1115 -1136 -1166 -1166 -1103 -1000 -917 -891
264278 -891 -919 -971 -1013 -1019 -991 -956 -932 -935 -982 -1059 -1131 -1170 -1170 -1131 -1061 -978 -919 -908 -939 -987 -1052 -1135 -1210 -1224 -1123 -911 -679 -554
265136 -554 -599 -774 -971 -1100 -1155 -1185 -1207 -1182 -1089 -963 -876 -883 -986 -1116 -1197 -1216 -1204 -1160 -1066 -952 -877 -857 -866 -892 -948 -1040
265929 -1040 -1129 -1151 -1088 -989 -924 -927 -985 -1071 -1149 -1179 -1144 -1070 -991 -919 -865 -849 -886 -979 -1103 -1211 -1258 -1226 -1129 -1003 -905 -873 -915
$$ packed form
259793h67N2Q5P7oj17j65j26m5J8M5M1K5qm9n9j8L8M8Rk2j0J5%m0n1j4M0Q0R2
260678i32N9no1q0p0n8m2OP0R3O2J6j5l6m5k8oKJ0K8N4P8Q9P1Or3j63j34l9L1
261593a132M2L0J2jJ9O7P4J1o0o4qL8N1L4j4o6p2l4LL0N7M6k1o9l8J9K2nJ1N9
262509i59O4Nm5k2M1N9J8l6o8p2l9K2N7K4m2o1j8L0M5N7R3J01K0r9j46j05l5J6
263363a095N4N9J3l9m1JK9L5L7K2l4q3o6lN0O7M3j0n8o0l0llk1l0%O3J03Q3K6
264278h91k8n2m2oK8L5K4lm7p7p2l9%L9P0Q3N9J1l1m8o5q3p5j4J01K12K32J25
265136e54m5j75j97j29n5l0k2K5R3J26Q7pj03j30q1j9J2M4R4J14P5K0rk6n6r2
265929a040q9k2O3R9O5ln8q6p8l0L5P4P9P2N4J6l7r3j24j08m7L2R7J26R8L2m2
$$ plain form
266756 -915 -1013 -1135 -1227 -1249 -1200 -1118 -1044 -981 -928 -917 -976 -1075 -1146 -1162 -1135 -1078 -997 -910 -854 -859 -928 -1036 -1136 -1182 -1174 -1145 -1108 -1044
267611 -1044 -954 -869 -829 -857 -942 -1052 -1162 -1251 -1281 -1217 -1082 -965 -930 -934 -901 -841 -838 -921 -1023 -1082 -1099 -1089 -1048 -991 -964 -989 -1042
268430 -1042 -1088 -1112 -1105 -1072 -1028 -974 -910 -860 -860 -919 -1004 -1080 -1126 -1122 -1069 -1007 -970 -960 -974 -1012 -1066 -1103 -1094 -1041 -982 -954 -952 -951 -941 -943 -978 -1038
269411 -1038 -1081 -1062 -982 -903 -886 -919 -957 -989 -1025 -1052 -1058 -1056 -1050 -1034 -1014 -1002 -1001 -1011 -1031 -1047 -1048 -1036 -1024 -1022 -1029 -1038 -1035 -1015 -999 -1019 -1064 -1084 -1056
270418 -1056 -1007 -969 -946 -928 -926 -971 -1064 -1144 -1151 -1101 -1052 -1030 -1008 -970 -940 -946 -973 -988 -978 -960 -969 -1031 -1120 -1166 -1139 -1088 -1058 -1047 -1025 -986
271333 -986 -948 -944 -981 -1037 -1082 -1107 -1113 -1101 -1076 -1062 -1066 -1066 -1042 -1013 -1000 -997 -986 -970 -968 -979 -978 -963 -970 -1019 -1077 -1093 -1052 -984 -944 -964 -1025 -1082 -1098
272337 -1098 -1064 -1014 -995 -1006 -1001 -965 -937 -948 -979 -988 -957 -909 -891 -920 -965 -997 -1026 -1055 -1054 -1020 -991 -981 -976 -972 -978 -989 -993 -990 -983 -977 -984 -1010 -1045 -1067
273375 -1067 -1069 -1056 -1024 -985 -975 -1005 -1033 -1030 -1009 -1004 -1017 -1031 -1038 -1038 -1045 -1082 -1133 -1135 -1065 -982 -951 -960 -949 -915 -927 -1007 -1084 -1091 -1042 -987 -954 -945 -947 -937
$$ packed form
266756i15r8j22r2k2M9Q2P4O3N3J1n9r9p1j6K7N7Q1Q7N6no9j08j00m6QK9L7O4
267611a044R0Q5M0k8q5j10j10q9l0O4J35J17L5mL3O0Lq3j02n9j7J0M1N7K7k5n3
268430a042m6k4PL3M4N4O4N0%n9q5p6m6MN3O2L7J0j4l8n4l7RN3N9K8KJJ0kl5o0
269411a038m3J9Q0P9J7l3l8l2l6k7oKOJ6K0J2Jj0k0j6jJ2J2KprLK0J6k0m5k0K8
270418a056M9L8K3J8Km5r3q0pN0M9K2K2L8L0ok7j5J0J8ro2q9m6K7N1L0J1K2L9
271333i86L8Ml7n6m5k5oJ2K5J4m%K4K9J3LJ1J6Kj1JJ5pm9n8j6M1O8M0k0o1n7j6
272337a098L4N0J9j1NL6K8j1l1rL1M8J8k9m5l2k9k9JL4K9J0NMoj1mLPOpk6l5k2
273375a067kJ3L2L9J0l0k8LK1Nj3j4p%pl7n1kP0Q3L1rJ1L4j2q0p7pM9N5L3RkJ0
$$ plain form
274417 -937 -913 -909 -953 -1029 -1085 -1078 -1019 -970 -976 -1017 -1046 -1053 -1053 -1054 -1071 -1124 -1183 -1186 -1115 -1017 -942 -901 -904 -957 -1028 -1062 -1039 -1006 -1019 -1072 -1110 -1090 -1030
275424 -1030 -979 -971 -1016 -1084 -1111 -1068 -1017 -1027 -1070 -1069 -1006 -935 -905 -919 -950 -984 -1026 -1071 -1093 -1072 -1009 -933 -886 -886 -917 -941 -937 -897 -823 -739
276339 -739 -701 -738 -827 -917 -974 -1010 -1048 -1092 -1130 -1143 -1103 -1019 -946 -918 -923 -956 -1022 -1081 -1086 -1059 -1048 -1044 -1002 -922 -863 -885 -981 -1080 -1117 -1097
277255 -1097 -1059 -1026 -978 -875 -701 -508 -389 -404 -542 -750 -951 -1077 -1116 -1103 -1064 -985 -871 -772 -735 -760 -819 -889 -953 -994
277983 -994 -1011 -1023 -1032 -1023 -999 -987 -1000 -1026 -1041 -1043 -1046 -1055 -1048 -1016 -992 -1001 -1012 -994 -971 -979 -1006 -1019 -1012 -1010 -1024 -1036 -1026 -1000 -973 -962 -984 -1046 -1102 -1086
279025 -1086 -987 -872 -811 -823 -893 -984 -1066 -1125 -1161 -1160 -1107 -1012 -920 -878 -891 -924 -941 -938 -938 -951 -982 -1017 -1036 -1034 -1028 -1029 -1036 -1041 -1035 -1015 -987 -964
280001 -964 -964 -981 -999 -1023 -1053 -1059 -1027 -994 -984 -983 -990 -1020 -1070 -1103 -1093 -1053 -1011 -982 -971 -985 -1007 -995 -938 -890 -896 -930 -934 -904 -889 -916 -946 -913
280975 -913 -791 -645 -590 -677 -834 -955 -1009 -1018 -980 -868 -730 -678 -743 -785 -629 -248 180 399 263 -149 -614 -944
$$ packed form
274417i37K4Mm4p6n6PN9M9om1k9p%jj7n3n9lP1R8P5M1ln3p1l4K3L3j3n3l8K0O0
275424a030N1Qm5o8k7M3N1j0m3JO3P1L0j4l1l4m2m5k2K1O3P6M7%l1k4MM0P4Q4
276339g39L8l7q9r0n7l6l8m4l8j3M0Q4P3K8nl3o6n9nK7J1MM2Q0N9k2r6r9l7K0
277255a097L8L3M8J03J74J93J19j5j38k08k01j26l9J3L9P9J14R9L7k5n9p0o4m1
277983i94j7j2rRK4J2j3k6j5klrPL2K4rj1J8K3qk7j3PKj4j2J0K6K7J1k2o2n6J6
279025a086R9J15O1j2p0r1q2n9l6JN3R5R2M2j3l3j7L%j3l1l5j9KOjpnOK0K8K3
280001i64%j7j8k4l0oL2L3J0Jpl0n0l3J0M0M2K9J1j4k2J2N7M8ol4mL0J5k7l0L3
280975i13J22J46N5q7j57j21n4rL8J12J38N2o5m2J56L81M28K19j36m12m65l30
$$ plain form
281645 -944 -1106 -1159 -1154 -1109 -1040 -965 -900 -869 -878 -904 -921 -910 -872 -839 -849 -893 -925 -931 -939 -964 -986 -1000 -1014 -1014 -983 -940 -913 -902 -922 -987 -1059
282595 -1059 -1081 -1052 -1014 -987 -962 -938 -937 -963 -988 -987 -982 -1001 -1027 -1023 -987 -939 -908 -917 -963 -1007 -1026 -1029 -1026 -1010 -984 -969 -969 -969 -967 -979 -1003 -1009 -976 -924
283633 -924 -896 -911 -952 -983 -981 -968 -985 -1018 -1006 -930 -840 -782 -772 -808 -882 -969 -1034 -1051 -1024 -996 -996 -1003 -985 -952 -925 -911 -922 -968 -1026 -1065
284548 -1065 -1082 -1094 -1108 -1126 -1131 -1087 -1003 -944 -945 -962 -950 -925 -929 -967 -1015 -1047 -1051 -1032 -1002 -960 -909 -873 -873 -897 -912 -888 -799 -651 -527 -537
285464 -537 -704 -920 -1050 -1057 -1006 -985 -1007 -1019 -988 -943 -930 -940 -928 -876 -819 -793 -818 -890 -984 -1051 -1056 -1008 -943 -895 -878 -891 -928 -971
286318 -971 -989 -973 -956 -969 -993 -990 -965 -964 -998 -1022 -995 -947 -947 -1019 -1101 -1119 -1069 -1018 -1009 -1011 -979 -931 -921 -935 -906 -833 -815 -905 -1029 -1083 -1047
287264 -1047 -982 -940 -923 -918 -931 -961 -986 -989 -980 -978 -982 -987 -1005 -1033 -1047 -1036 -1016 -994 -974 -978 -1021 -1069 -1073 -1030 -987 -987 -1023 -1042 -1006 -935 -887 -898 -945
288268 -945 -962 -915 -849 -827 -855 -884 -891 -901 -926 -935 -917 -901 -916 -960 -1004 -1015 -994 -975 -979 -993 -1002 -1003 -992 -973 -970 -1002 -1037 -1017 -937 -864 -865 -940
$$ packed form
281645i44j62n3NM5O9P5O5L1rk6j7J1L8L3j0m4l2oqk5k2j4j4%L1M3K7J1k0o5p2
282595a059k2K9L8K7K5K4Jk6k5JNj9k6ML6M8L1rm6m4j9lLJ6K6J5%%Kj2k4oL3N2
283633i24K8j5m1l1KJ3j7l3J2P6R0N8J0l6p4q7o5j7K7K8%pJ8L3K7J4j1m6n8l9
284548a065j7j2j4j8nM4Q4N9jj7J2K5ml8m8l2mJ9L0M2N1L6%k4j5K4Q9J48J24j0
285464e37j67k16j30pN1K1k2j2L1M5J3j0J2N2N7K6k5p2r4o7nM8O5M8J7j3l7m3
286318i71j8J6J7j3k4LK5Jl4k4K7M8%p2q2j8N0N1RkL2M8J0j4K9P3J8r0j24n4L6
287264a047O5M2J7Nj3l0k5lRKmnj8k8j4J1K0K2K0mm3m8mM3M3%l6j9L6P1M8j1m7
288268i45j7M7O6K2k8k9pj0k5rJ8J6j5m4m4j1K1J9mj4rjJ1J9Ll2l5K0Q0P3jp5
$$ plain form
289244 -940 -1024 -1062 -1050 -1027 -1019 -1012 -969 -886 -821 -838 -928 -1014 -1037 -1006 -954 -913 -910 -952 -1012 -1053 -1054 -1024 -990 -974 -969 -960 -959 -978 -999 -989 -959 -948
290221 -948 -965 -976 -956 -916 -889 -890 -906 -925 -947 -972 -1000 -1038 -1065 -1052 -1011 -984 -986 -996 -998 -990 -973 -968 -994 -1028 -1033 -1008 -977 -952 -937 -944 -981 -1024
291202 -1024 -1039 -1017 -977 -939 -896 -842 -815 -858 -958 -1054 -1099 -1091 -1054 -1009 -967 -936 -927 -945 -982 -1020 -1032 -1007 -969 -961 -1002 -1069 -1127 -1144 -1106
292082 -1106 -1026 -944 -894 -862 -740 -416 26 287 144 -316 -783 -1024 -1049 -1018 -1036 -1073 -1067 -1018 -964 -911 -858 -828 -841 -874 -897
292845 -897 -909 -934 -983 -1032 -1050 -1023 -952 -859 -774 -733 -759 -847 -970 -1079 -1127 -1110 -1086 -1104 -1156 -1206 -1228 -1202 -1113 -997 -922 -916 -950 -977
293703 -977 -982 -989 -1025 -1071 -1086 -1056 -995 -928 -880 -863 -875 -908 -950 -983 -988 -978 -995 -1043 -1066 -1031 -969 -918 -882 -870 -898 -954 -991 -979 -941 -916
294618 -916 -921 -939 -938 -920 -921 -947 -959 -929 -885 -876 -915 -969 -998 -1006 -1025 -1056 -1062 -1025 -975 -971 -1032 -1097 -1090 -1026 -985 -996 -1013 -973 -834 -620 -443
295564 -443 -433 -612 -860 -1030 -1073 -1047 -1023 -1019 -1016 -1006 -1000 -1004 -1006 -990 -964 -956 -968 -965 -943 -945 -982 -998 -969 -938 -928 -922 -923 -960 -1028 -1070 -1043 -974
$$ packed form
289244i40q4l8J2K3QPM3Q3O5j7r0q6k3L1N2M1Lm2o0m1jL0L4J6NRJj9k1J0L0J1
290221i48j7j1K0M0K7jj6j9k2k5k8l8k7J3M1K7kj0kQJ7Nk6l4nK5L1K5J5pl7m3
291202a024j5K2M0L8M3N4K7m3j00r6m5QL7M5M2L1Rj8l7l8j2K5L8Qm1o7n8j7L8
292082a106Q0Q2N0L2J22L24M42K61j43m60m67k41k5L1j8l7OM9N4N3N3L0j3l3k3
292845h97j2k5m9m9j8K7P1R3Q5M1k6q8j23j09m8J7K4j8n2n0k2K6Q9J16P5Ol4k7
293703i77npl6m6j5L0O1O7M8J7j2l3m2l3nJ0j7m8k3L5O2N1L6J2k8n6l7J2L8K5
294618i16nj8JJ8jk6j2L0M4Rl9n4k9qj9l1oL7N0Mo1o5PO4M1j1j7M0J39K14J77
295564d43J0j79k48j70m3K6K4MLJ0OmkJ6K6Qj2LK2kl7j6K9L1J0Ojl7o8m2K7O9
$$ plain form
296538 -974 -934 -959 -1027 -1078 -1072 -1016 -959 -956 -1008 -1068 -1077 -1013 -910 -833 -826 -893 -1000 -1076 -1073 -1018 -980 -982 -997 -997 -979 -953 -938 -946 -962 -971 -973 -973 -966 -960
297575 -960 -980 -1025 -1060 -1036 -956 -888 -910 -1008 -1088 -1092 -1065 -1062 -1083 -1089 -1063 -1013 -964 -953 -990 -1029 -1029 -1014 -1028 -1064 -1066 -1025 -996 -1013 -1046 -1065 -1068 -1055
298556 -1055 -1025 -991 -961 -939 -938 -965 -990 -989 -994 -1044 -1104 -1108 -1055 -1013 -1016 -1031 -1017 -984 -969 -981 -983 -942 -875 -853 -913 -1005 -1062 -1063 -1034 -993 -957 -943
299533 -943 -961 -998 -1021 -1001 -956 -942 -984 -1046 -1070 -1043 -1002 -989 -1000 -1001 -991 -1004 -1056 -1126 -1179 -1182 -1129 -1063 -1023 -1003 -982 -954 -911 -863 -850 -901
300448 -901 -981 -1033 -1050 -1063 -1074 -1078 -1077 -1056 -1003 -944 -923 -939 -962 -976 -980 -985 -1005 -1037 -1051 -1027 -982 -953 -948 -957 -978 -1001 -1002 -982 -969 -966 -953 -930 -933
301452 -933 -978 -1031 -1037 -982 -917 -903 -932 -952 -945 -939 -971 -1035 -1092 -1113 -1101 -1068 -1024 -990 -986 -998 -1000 -1010 -1049 -1091 -1098 -1089 -1101 -1117 -1098 -1052 -1024 -1042
302428 -1042 -1102 -1172 -1215 -1219 -1201 -1176 -1147 -1108 -1066 -1044 -1058 -1091 -1103 -1059 -961 -867 -857 -950 -1073 -1131 -1100 -1044 -1021 -1014 -993 -975 -971 -956 -937
303313 -937 -959 -1006 -1016 -981 -955 -961 -972 -968 -968 -981 -974 -926 -877 -881 -937 -984 -977 -930 -889 -892 -930 -949 -917 -864 -836 -840 -855 -882 -934 -998 -1037 -1045 -1051 -1066
$$ packed form
296538i74M0k5o8n1ON6N7Ln2o0rO4J03P7Po7j07p6LN5L8kj5%J8K6J5qj6rk%PO
297575i60k0m5l5K4Q0O8k2r8q0mK7Lk1oK6N0M9J1l7l9%J5j4l6kM1K9j7l3j9lJ3
298556a055L0L4L0K2Jk7k5Jnn0o0mN3M2lj5J4L3J5j2kM1O7K2o0r2n7jK9M1L6J4
299533i43j8l7k3K0M5J4m2o2k4K7M1J3j1jJ0j3n2p0n3lN3O6M0K0K1K8M3M8J3n1
300448i01q0n2j7j3j1mJK1N3N9K1j6k3j4mnk0l2j4K4M5K9Nrk1k3jK0J3LJ3K3l
301452i33m5n3oN5O5J4k9k0POl2o4n7k1J2L3M4L4Mj2kj0l9m2pRj2j6J9M6K8j8
302428a042o0p0m3mJ8K5K9L9M2K2j4l3j2M4R8R4J0r3j23n8L1N6K3PK1J8MJ5J9
303313i37k2m7j0L5K6oj1M%j3PM8M9mn6m7PM7M1ll8j9L2N3K8mj5k7n2o4l9qoj5
$$ plain form
304351 -1066 -1074 -1064 -1037 -992 -936 -895 -893 -932 -982 -1008 -1008 -1008 -1015 -1028 -1055 -1087 -1095 -1062 -993 -909 -856 -869 -926 -964 -958 -942 -953 -983 -1000 -995 -982 -967
305332 -967 -954 -954 -956 -933 -891 -879 -921 -978 -1000 -985 -969 -980 -1013 -1037 -1040 -1036 -1033 -1034 -1048 -1065 -1050 -999 -963 -987 -1043 -1075 -1067 -1051 -1038 -1013 -974 -951
306308 -951 -968 -1007 -1024 -999 -969 -980 -1018 -1023 -976 -937 -967 -1050 -1104 -1076 -1002 -955 -965 -998 -1015 -1017 -1032 -1062 -1079 -1068 -1044 -1019 -992 -966 -938 -909
307224 -909 -905 -937 -974 -988 -995 -1024 -1064 -1088 -1089 -1065 -1007 -935 -897 -910 -940 -952 -952 -974 -1019 -1042 -999 -925 -886 -894 -911 -930 -961 -992 -999 -992 -1004 -1044
308200 -1044 -1082 -1088 -1062 -1029 -1020 -1025 -997 -931 -879 -889 -947 -1001 -1006 -959 -907 -898 -934 -983 -1012 -1010 -988 -980 -1014 -1066 -1077 -1021 -937 -892 -926 -1005 -1058 -1040
309174 -1040 -962 -875 -843 -880 -948 -1000 -1016 -987 -930 -887 -898 -957 -1020 -1054 -1042 -991 -944 -942 -979 -1013 -1005 -956 -907 -918 -999 -1091 -1130 -1109 -1082
310059 -1082 -1090 -1112 -1109 -1073 -1015 -945 -897 -904 -942 -948 -922 -925 -970 -1002 -993 -984 -998 -1010 -1004 -1005 -1023 -1024 -973 -887 -811 -790 -848 -959 -1067 -1139 -1172 -1154
311035 -1154 -1059 -907 -800 -832 -973 -1096 -1121 -1079 -1034 -998 -957 -918 -908 -937 -980 -1016 -1046 -1052 -989 -862 -768 -783 -880 -988 -1088
$$ packed form
304351a066qJ0K7M5N6M1Kl9n0k6%%pj3k7l2qL3O9Q4N3j3n7l8OJ6j1l0j7NJ3J5
305332i67J3%kK3M2J2m2n7k2J5J6j1l3k4lMLjj4j7J5N1L6k4n6l2QJ6J3K5L9K3
306308i51j7l9j7K5L0j1l8nM7L9l0q3n4K8P4M7j0l3j7kj5l0j7J1K4K5K7K6K8K9
307224i09Ml2l7j4pk9m0k4jK4N8P2L8j3l0j2%k2m5k3M3P4L9qj7j9l1l1pPj2m0
308200a044l8oK6L3RnK8O6N2j0n8n4nM7N2Rl6m9k9KK2Ql4n2j1N6Q4M5l4p9n3J8
309174a040P8Q7L2l7o8n2j6K9N7M3j1n9o3l4J2N1M7Kl7l4QM9M9j1q1r2l9K1K7
310059a082qk2LL6N8P0M8pl8oK6lm5l2RRj4j2Ojj8jN1Q6P6K1n8j11j08p2l3J8
311035a154R5J52J07l2j41j23k5M2M5L6M1L9J0k9m3l6l0oO3J27R4j5r7j08j00
$$ plain form
311801 -1088 -1199 -1309 -1348 -1272 -1114 -937 -772 -652 -637 -753 -921 -1025 -1016 -937 -847 -773 -740 -792 -941 -1125 -1257 -1298 -1268
312498 -1268 -1195 -1069 -901 -769 -759 -866 -1007 -1086 -1059 -964 -880 -833 -809 -835 -960 -1132 -1225 -1180 -1067 -995 -993 -1008 -988 -943 -908
313264 -908 -895 -894 -910 -945 -965 -923 -841 -796 -843 -961 -1075 -1126 -1103 -1035 -966 -926 -909 -903 -912 -935 -951 -940 -902 -865 -855 -870 -898 -946 -1016
314149 -1016 -1080 -1116 -1127 -1116 -1069 -987 -916 -895 -898 -888 -884 -913 -961 -984 -968 -947 -967 -1012 -1025 -983 -926 -901 -915 -938 -943 -930 -911 -898 -916 -982
315065 -982 -1057 -1079 -1044 -1023 -1052 -1082 -1058 -1000 -970 -989 -1013 -992 -934 -891 -887 -896 -908 -947 -1016 -1069 -1068 -1023 -972 -952 -973 -985 -949 -897 -885 -905
315980 -905 -926 -955 -1013 -1075 -1091 -1051 -996 -980 -1012 -1045 -1031 -981 -944 -941 -970 -1012 -1043 -1045 -1009 -942 -888 -898 -953 -991 -997 -999 -1001 -997 -998 -1016 -1040 -1047 -1030
316987 -1030 -1018 -1044 -1083 -1062 -984 -928 -923 -918 -889 -873 -904 -968 -1023 -1037 -1007 -958 -944 -984 -1019 -976 -888 -871 -970 -1107 -1179 -1167 -1120 -1082 -1051
317872 -1051 -988 -886 -813 -849 -973 -1068 -1057 -988 -944 -943 -948 -938 -919 -919 -969 -1052 -1107 -1085 -1000 -923 -911 -949 -982 -978 -964 -988 -1052 -1103 -1099 -1049
$$ packed form
311801a088j11j10l9P6J58J77J65J20J5j16j68j04RP9R0P4L3n2j49j84j32m1L0
312498a268P3J26J68J32J0j07j41p9K7R5Q4M7K4k6j25j72r3M5J13P2Kj5K0M5L5
313264i08J3Jj6l5k0M2Q2M5m7j18j14n1K3O8O9M0J7Ork3j6J1L8L7J0j5k8m8p0
314149a016o4l6j1J1M7Q2P1K1lJ0Mk9m8k3J6K1k0m5j3M2N7K5j4k3nJ3J9J3j8o6
315065i82p5k2L5K1k9l0K4N8L0j9k4K1N8M3Mrj2l9o9n3JM5N1K0k1j2L6N2J2k0
315980i05k1k9n8o2j6M0N5J6l2l3J4N0L7Lk9m2l1kL6O7N4j0n5l8okkMjj8k4pJ7
316987a030J2k6l9K1P8N6NNK9J6l1o4n5j4L0M9J4m0l5M3Q8J7r9j37p2J2M7L8L1
317872a051O3J02P3l6j24r5J1O9M4JnJ0J9%n0q3n5K2Q5P7J2l8l3MJ4k4o4n1MN0
$$ plain form
318788 -1049 -983 -921 -888 -901 -943 -978 -989 -980 -969 -980 -1006 -1010 -968 -918 -913 -954 -998 -1011 -991 -964 -958 -968 -965 -944 -933 -964 -1028 -1071 -1063 -1040 -1043 -1057
319761 -1057 -1039 -985 -941 -938 -957 -958 -944 -937 -935 -924 -921 -945 -979 -987 -950 -891 -856 -867 -904 -932 -940 -939 -938 -928 -911 -895 -880 -874 -915 -993 -1019 -953 -881
320776 -881 -895 -970 -1021 -1027 -1025 -1028 -1007 -959 -924 -924 -940 -939 -928 -935 -965 -990 -994 -988 -982 -976 -978 -1003 -1048 -1083 -1080 -1060 -1047 -1029 -991 -941 -890 -849 -841 -876 -937
321841 -937 -982 -982 -957 -954 -985 -1002 -970 -928 -928 -954 -965 -956 -935 -893 -852 -852 -894 -926 -919 -907 -945 -1030 -1106 -1125 -1073 -983 -892 -819 -779 -792 -846 -913
322817 -913 -975 -1016 -1026 -1013 -990 -958 -930 -936 -978 -1015 -1012 -988 -977 -980 -976 -977 -995 -1012 -997 -938 -865 -833 -886 -1017 -1145 -1171 -1062 -900 -809
323702 -809 -825 -881 -921 -951 -992 -1043 -1073 -1052 -993 -954 -957 -955 -915 -874 -872 -898 -936 -997 -1056 -1054 -991 -949 -969 -998 -983 -952 -965 -1018 -1046 -1008 -927
324648 -927 -845 -799 -813 -867 -913 -920 -903 -887 -875 -864 -868 -912 -984 -1041 -1040 -980 -911 -891 -921 -944 -934 -923 -941 -967 -971 -958 -947 -950 -968 -998 -1031
325594 -1031 -1038 -1005 -951 -905 -872 -856 -861 -886 -925 -977 -1029 -1062 -1067 -1063 -1060 -1036 -974 -909 -889 -914 -947 -971 -983 -971 -943 -936 -963 -983 -978 -985 -1027 -1058
$$ packed form
318788a049O6O2L3j3m2l5j1RJ1j1k6mM2N0Nm1m4j3K0K7Oj0LK1J1l1o4m3QK3lj4
319761a057J8N4M4Lj9jJ4PKJ1Lk4l4qL7N9L5j1l7k8qJJJ0J7J6J5Om1p8k6O6P2
320776h81j4p5n1oKlK1M8L5%j6JJ1pl0k5mOOOkk5m5l5LK0J3J8L8N0N1M1Ql5o1
321841i37m5%K5Ll1j7L2M2%k6j1RK1M2M1%m2l2PJ2l8q5p6j9N2R0R1P3M0j3n4o7
322817i13o2m1j0J3K3L2K8om2l7LK4J1lMjj8j7J5N9P3L2n3j31j28k6J09J62R1
323702h09j6n6m0l0m1n1l0K1N9L9lKM0M1Kk6l8o1n9KO3M2k0k9J5L1j3n3k8L8Q1
324648i27Q2M6j4n4m6pJ7J6J2J1mm4p2n7JO0O9K0l0k3J0J1j8k6mJ3J1lj8l0l3
325594a031pL3N4M6L3J6nk5l9n2n2l3nMLK4O2O5K0k5l3k4j2J2K8Pk7k0Npm2l1
$$ plain form
326567 -1058 -1035 -1000 -1024 -1098 -1148 -1129 -1058 -986 -945 -921 -892 -871 -882 -919 -945 -945 -932 -907 -865 -836 -846 -882 -909 -908 -889 -883 -904 -943 -989 -1026
327483 -1026 -1035 -1019 -999 -981 -964 -948 -920 -868 -825 -834 -895 -970 -1020 -1026 -985 -922 -880 -894 -954 -1017 -1045 -1040 -1022 -1000 -971 -944 -938 -960 -987 -989 -974
328429 -974 -973 -986 -1001 -1015 -1026 -1029 -1023 -1026 -1051 -1088 -1093 -1041 -964 -928 -953 -998 -1022 -1011 -979 -953 -935 -901 -830 -745 -707 -753 -856 -952 -984 -952 -912
329375 -912 -900 -901 -911 -940 -969 -969 -933 -880 -838 -826 -847 -889 -928 -940 -917 -887 -882 -905 -939 -969 -977 -962 -946 -936 -914 -887 -893 -953 -1034 -1081 -1043
330321 -1043 -920 -788 -741 -792 -870 -927 -966 -989 -984 -960 -937 -918 -897 -898 -946 -1024 -1063 -1016 -917 -841 -818 -842 -916 -1025 -1120 -1150 -1110 -1027
331175 -1027 -930 -848 -805 -815 -870 -934 -950 -890 -801 -758 -783 -854 -940 -1009 -1033 -1020 -1005 -992 -949 -878 -816 -778 -720 -602 -437 -273 -128
332002 -128 17 149 219 222 232 283 312 247 106 -45 -187 -355 -569 -770 -859 -819 -755 -770 -864 -970 -1034 -1036 -989 -939 -926
332765 -926 -950 -969 -947 -894 -847 -833 -860 -925 -1008 -1061 -1047 -981 -913 -871 -847 -842 -865 -920 -982 -1011 -985 -928 -886 -881 -916 -978 -1032 -1022 -926 -806
$$ packed form
326567a058K3L5k4p4n0J9P1P2M1K4K9K1j1l7k6%J3K5M2K9j0l6k7JJ9Ok1l9m6l7
327483a026rJ6K0J8J7J6K8N2M3ro1p5n0oM1O3M2j4o0o3k8NJ8K2K9K7Ok2k7kJ5
328429i74Jj3j5j4j1lOlk5l7nN2P7L6k5m5k4J1L2K6J8L4P1Q5L8m6j03r6l2L2M0
329375i12J2jj0k9k9%L6N3M2J2k1m2l9j2K3L0Nk3l4l0qJ5J6J0K2K7oo0q1m7L8
330321a043J23J32M7n1p8n7l9k3NK4K3J9K1jm8p8l9M7R9P6K3k4p4j09r5l0M0Q3
331175a027R7Q2M3j0n5o4j6O0Q9M3k5p1q6o9k4J3J5J3M3P1O2L8N8J18J65J64J45
332002a28J45J32P0LJ0N1K9o5j41j51j42j68k14k01q9M0O4j5r4j06o4kM7N0J3
332765i26k4j9K2N3M7J4k7o5q3n3J4O6O8M2K4Nk3n5o2k9K6N7M2Nl5o2n4J0R6J20
$$ plain form
333680 -806 -756 -804 -886 -928 -925 -914 -907 -914 -951 -1003 -1025 -994 -929 -871 -851 -867 -894 -908 -894 -867 -875 -945 -1013 -992 -904 -855 -877 -916 -930 -932 -942
334626 -942 -950 -938 -921 -929 -944 -907 -820 -767 -812 -907 -949 -912 -873 -896 -952 -970 -924 -850 -805 -818 -879 -956 -990 -932 -829 -801 -884 -984 -1029
335511 -1029 -1043 -1049 -1029 -979 -938 -925 -903 -853 -833 -889 -978 -1032 -1041 -1026 -986 -923 -874 -890 -960 -1014 -1003 -947 -886 -845 -833 -834 -836 -855 -901 -946
336427 -946 -964 -964 -945 -901 -851 -836 -875 -949 -994 -962 -881 -827 -835 -895 -968 -1010 -1005 -968 -922 -882 -867 -881 -916 -952 -970 -959 -939 -940 -973 -1022 -1058
337373 -1058 -1072 -1077 -1078 -1064 -1043 -1048 -1084 -1108 -1082 -1019 -962 -945 -967 -993 -991 -960 -925 -894 -874 -889 -952 -1025 -1048 -1005 -927 -878 -890 -926 -921 -868 -833
338319 -833 -863 -929 -961 -932 -884 -880 -941 -1024 -1061 -1043 -1021 -1018 -1008 -986 -993 -1030 -1041 -1001 -956 -960 -1004 -1047 -1077 -1100 -1088 -1023 -945 -915 -938 -970 -975
339265 -975 -948 -908 -890 -907 -944 -971 -972 -950 -933 -946 -979 -994 -973 -930 -886 -861 -858 -877 -915 -958 -980 -974 -965 -975 -994 -998 -979 -949 -931 -933 -935 -931 -946
340276 -946 -990 -1033 -1059 -1072 -1051 -981 -898 -848 -840 -889 -1004 -1108 -1089 -962 -880 -934 -1041 -1077 -1031 -976 -950 -916 -845 -771 -765 -854 -985
$$ packed form
333680h06N0m8q2m2LJ1Ppl7n2k2L1O5N8K0j6k7j4J4K7qp0o8K1Q8M9k2l9j4kj0
334626i42qJ2J7qj5L7Q7N3m5r5m2L7L9k3n6j8M6P4M5j3o1p7l4N8J03K8q3j00m5
335511a029j4oK0N0M1J3K2N0K0n6q9n4rJ5M0O3M9j6p0n4J1N6O1M1J2jkj9m6m5
336427i46j8%J9M4N0J5l9p4m5L2Q1N4qo0p3m2NL7M6M0J5j4l5l6j8J1K0jl3m9l6
337373a058j4njJ4K1nl6k4K6O3N7J7k2k6KL1L5L1K0j5o3p3k3M3P8M9j2l6NN3L5
338319h33l0o6l2K9M8Mo1q3l7J8K2LJ0K2pl7j1M0M5mm4m3l0k3J2O5P8L0k3l2n
339265i75K7M0J8j7l7k7jK2J7j3l3j5K1M3M4K5Lj9l8m3k2ORj0j9mJ9L0J8kkMj5
340276i46m4m3k6j3K1P0Q3N0Qm9j15j04J9J27Q2n4j07l6M6N5K6L4P1P4Oq9j31
$$ plain form
341096 -985 -1065 -1050 -985 -937 -933 -944 -939 -927 -932 -935 -910 -867 -830 -822 -856 -898 -908 -908 -948 -1005 -1003 -930 -867 -874 -911 -916 -898 -901 -932 -955 -950 -940 -954 -978
342138 -978 -965 -922 -903 -916 -914 -889 -886 -923 -964 -991 -1014 -1035 -1035 -1005 -959 -916 -891 -884 -892 -912 -944 -982 -1022 -1051 -1043 -988 -925 -903 -912 -910 -899 -919 -972
343145 -972 -1019 -1032 -1020 -1006 -990 -953 -897 -842 -816 -834 -887 -938 -948 -904 -828 -771 -778 -851 -938 -994 -1020 -1043 -1052 -1022 -962 -912 -894 -903 -929 -948
344060 -948 -946 -938 -939 -952 -964 -950 -902 -858 -874 -958 -1058 -1114 -1111 -1078 -1044 -1009 -973 -966 -992 -1000 -958 -891 -836 -809 -811 -833 -852 -870 -919 -1006 -1094 -1149
345034 -1149 -1163 -1147 -1120 -1087 -1026 -919 -768 -609 -492 -449 -492 -606 -739 -847 -945 -1061 -1180 -1249 -1231 -1135 -1019 -945 -913
345734 -913 -862 -763 -670 -655 -732 -852 -948 -975 -953 -952 -1011 -1094 -1118 -1048 -937 -864 -852 -882 -937 -981 -957 -853 -748 -742 -852 -1012 -1145
346558 -1145 -1215 -1221 -1171 -1069 -932 -812 -747 -730 -729 -732 -760 -813 -825 -707 -497 -477 -920 -1614 -1976 -1757 -1252 -838 -629 -529
347293 -529 -438 -357 -362 -493 -690 -848 -927 -969 -1038 -1151 -1264 -1323 -1314 -1259 -1158 -992 -799 -682 -699 -796 -875 -893 -889 -926 -1009 -1076
$$ packed form
341096i85q0J5O5M8Mj1NJ2nlK5M3L7Ql4m2j0%m0n7KP3O3pl7nJ8ll1k3NJ0j4k4
342138i78J3M3J9j3KK5Ll7m1k7k3k1%L0M6M3K5Pqk0l2l8m0k9QN5O3K2rKJ1k0n3
343145i72m7j3J2J4J6L7N6N5K6j8n3n1j0M4P6N7pp3q7n6k6k3rL0O0N0J8rk6j9
344060i48KQjj3j2J4M8M4j6q4j00n6LL3L4L5L6Pk6qM2O7N5K7kk2j9j8m9q7q8n5
345034a149j4J6K7L3O1J07J51J59J17M3m3j14j33j08r8j16j19o9J8R6J16P4L2
345734i13N1R9R3J5p7j20r6k7K2Jn9q3k4P0J11P3J2l0n5m4K4J04J05Oj10j60j33
346558a145p0oN0J02J37J20O5J7Jlk8n3j2J18K10K0m43o94l62K19N05M14K09J00
347293e29R1Q1nj31j97j58p9m2o9j13j13n9RN5J01J66J93J17j7r7p9j8Ml7q3o7
$$ plain form
348082 -1076 -1076 -1020 -972 -970 -982 -973 -960 -947 -902 -825 -775 -797 -866 -927 -959 -983 -1010 -1036 -1050 -1036 -988 -944 -959 -1023 -1067 -1038 -949 -876 -883 -938
349005 -938 -967 -960 -958 -970 -984 -999 -994 -933 -839 -789 -828 -928 -1022 -1061 -1040 -985 -929 -905 -933 -988 -1018 -1005 -976 -952 -933 -900 -860 -870 -959 -1057
349921 -1057 -1074 -1005 -926 -917 -978 -1035 -1026 -962 -895 -872 -903 -948 -944 -894 -861 -880 -911 -924 -937 -964 -983 -981 -978 -998 -1028 -1032 -1001 -969 -962 -961 -944 -924
350894 -924 -926 -967 -1023 -1036 -982 -907 -868 -875 -897 -908 -907 -907 -920 -956 -1008 -1054 -1068 -1046 -1007 -984 -986 -985 -953 -899 -854 -841 -865 -913 -951 -965 -974 -975 -928
351901 -928 -838 -796 -887 -1060 -1156 -1082 -926 -848 -893 -970 -983 -935 -908 -955 -1019 -995 -888 -833 -905 -1015 -1041 -1000 -1000 -1071 -1141 -1142 -1082 -1009
352755 -1009 -972 -984 -999 -975 -932 -907 -901 -904 -909 -911 -919 -949 -999 -1050 -1071 -1044 -1004 -1009 -1050 -1055 -992 -908 -868 -890 -940 -965 -938 -883 -859 -887 -909 -876
353732 -876 -846 -900 -989 -985 -875 -792 -845 -980 -1058 -1025 -962 -960 -1002 -1008 -971 -945 -951 -961 -957 -950 -951 -963 -971 -957 -925 -892 -868 -855 -865 -913 -985 -1027
354708 -1027 -1009 -969 -972 -1013 -1028 -992 -963 -993 -1059 -1089 -1049 -968 -889 -845 -854 -905 -963 -992 -985 -961 -946 -957 -985 -1000 -977 -926 -886 -888 -934 -995
$$ packed form
348082a076%N6M8Kj2RJ3J3M5P7N0k2o9o1l2k4k7k6j4J4M8M4j5o4m4K9Q9P3pn5
349005i38k9PKj2j4j5NO1R4N0l9j00r4l9K1N5N6K4k8n5l0J3K9K4J9L3M0j0q9r8
349921a057j7O9P9Ro1n7RO4O7K3l1m5MN0L3j9l1j3j3k7j9KLk0l0mL1L2PJJ7K0
350894i24km1n6j3N4P5L9pk2j1J%j3l6n2m6j4K2L9K3kJL2N4M5J3k4m8l8j4rjM7
351901i28R0M2r1j73r6P4J56P8m5p7j3M8K7m7o4K4J07N5p2j10k6M1%p1p0jO0P3
352755a009L7j2j5K4M3K5Olnkql0n0n1k1K7M0nm1nO3Q4M0k2n0k5K7N5K4k8k2L3
353732h76L0n4q9MJ10Q3n3j35p8L3O3Km2oL7K6oj0MPjj2qJ4L2L3K4J3j0m8p2m2
354708a027J8M0lm1j5L6K9l0o6l0M0Q1P9M4rn1n8k9PK4J5j1k8j5K3N1M0km6o1
$$ plain form
355624 -995 -1041 -1055 -1031 -978 -928 -918 -940 -947 -912 -860 -833 -844 -889 -943 -967 -953 -944 -968 -993 -977 -935 -944 -1049 -1174 -1191 -1074 -932 -878
356478 -878 -912 -958 -976 -994 -1015 -1006 -968 -938 -933 -931 -910 -873 -859 -909 -1005 -1070 -1052 -972 -896 -866 -870 -870 -862 -873 -915 -970 -1010 -1028 -1042 -1061 -1063 -1039
357455 -1039 -1009 -980 -941 -895 -866 -867 -905 -977 -1045 -1047 -987 -938 -947 -982 -984 -945 -903 -890 -912 -946 -964 -989 -1060 -1141 -1149 -1065 -951 -885 -888 -919 -925
358398 -925 -897 -874 -882 -906 -913 -889 -852 -853 -926 -1025 -1069 -1032 -961 -913 -899 -901 -919 -974 -1048 -1063 -976 -841 -761 -781 -862 -945 -1000 -1032 -1071 -1123
359313 -1123 -1159 -1156 -1120 -1070 -1020 -978 -945 -923 -915 -923 -957 -1031 -1122 -1160 -1109 -1032 -997 -969 -912 -879 -924 -1005 -1050 -1037 -984 -943 -975 -1068 -1111 -1038
360229 -1038 -917 -870 -917 -970 -978 -979 -1016 -1077 -1132 -1162 -1162 -1147 -1135 -1151 -1192 -1217 -1194 -1121 -998 -854 -749 -721 -742 -775 -808 -832 -834 -821
361086 -821 -812 -805 -787 -776 -811 -890 -958 -970 -951 -951 -965 -968 -981 -1033 -1085 -1060 -949 -833 -798 -845 -916 -963 -971 -954 -956 -998 -1034 -1017 -961 -914 -902
362032 -902 -924 -963 -988 -977 -949 -949 -978 -966 -882 -807 -845 -978 -1086 -1065 -931 -814 -826 -949 -1076 -1122 -1073 -967 -875 -851 -880 -908
$$ packed form
355624i95m6j4K4N3N0J0k2pL5N2K7j1m5n4k4J4Rk4k5J6M2rj05j25j7J17J42N4
356478h78l4m6j8j8k1RL8L0NKK1L7J4n0r6o5J8Q0P6L0m%Qj1m2n5m0j8j4j9kK4
357455a039L0K9L9M6K9jl8p2o8kO0M9rl5kL9M2J3k2l4j8k5p1q1qQ4J14O6ll1o
358398i25K8K3qk4pK4L7jp3r9m4L7P1M8J4kj8n5p4j5Q7J35Q0k0q1q3n5l2l9n2
359313a123l6LL6N0N0M2L3K2Qql4p4r1l8N1P7L5K8N7L3m5q1m5J3N3M1l2r3m3P3
360229a038J21M7m7n3qjl7o1n5l0%J5J2j6m1k5K3P3J23J44J05K8k1l3l3k4kJ3
361086h21RPJ8J1l5p9o8j2J9%j4lj3n2n2K5J11J16L5m7p1m7qJ7km2l6J7N6M7J2
362032i02k2l9k5J1K8%k9J2Q4P5l8j33j08K1J34J17j2j23j27m6M9J06R2K4k9k8
$$ plain form
362825 -908 -891 -800 -651 -555 -613 -789 -941 -976 -912 -834 -807 -834 -872 -890 -897 -908 -922 -945 -994 -1060 -1090 -1040 -934 -862 -901 -1022 -1109
363652 -1109 -1070 -912 -717 -606 -665 -854 -1023 -1057 -957 -814 -739 -790 -921 -1016 -1007 -931 -841 -761 -724 -763 -867 -987 -1059 -1028
364380 -1028 -900 -759 -693 -727 -844 -1008 -1147 -1158 -1006 -811 -750 -846 -956 -985 -978 -970 -951 -942 -950 -934 -888 -860 -869 -895 -923 -956 -983
365204 -983 -963 -876 -775 -738 -771 -823 -883 -985 -1115 -1184 -1116 -969 -876 -878 -916 -952 -976 -955 -884 -820 -814 -852 -902 -942 -953 -934 -912 -909
366062 -909 -923 -934 -922 -892 -853 -811 -805 -884 -1022 -1122 -1103 -975 -855 -860 -966 -1036 -994 -905 -884 -944 -980 -927 -866 -903 -1012 -1083 -1068
366886 -1068 -996 -904 -828 -808 -843 -893 -916 -918 -924 -932 -924 -910 -897 -866 -828 -831 -890 -961 -1000 -992 -948 -893 -859 -871 -909 -927 -896 -834 -785 -789 -856 -947
367862 -947 -1004 -1003 -971 -956 -963 -962 -926 -855 -790 -793 -866 -934 -944 -937 -960 -982 -957 -904 -882 -912 -971 -1030 -1051 -1011 -950 -922 -897 -822 -725 -680 -689 -688
368835 -688 -662 -672 -738 -804 -864 -967 -1090 -1133 -1059 -923 -825 -858 -1035 -1241 -1331 -1259 -1083 -910 -835 -861 -913 -958 -1026 -1077 -1009
$$ packed form
362825i08J7R1J49R6n8j76j52l5O4P8K7k7l8j8pj1j4k3m9o6l0N0J06P2l9j21q7
363652a109L9J58J95J11n9j89j69l4J00J43P5n1j31r5RP6R0Q0L7l9j04j20p2L1
364380a028J28J41O6l4j17j64j39j1J52J95O1r6j10k9PQJ9RqJ6M6K8rk6k8l3k7
365204i83K0Q7J01L7l3n2o0j02j30o9O8J47R3kl8l6k4K1P1O4Ol8n0m0j1J9K2L
366062i09j4j1J2L0L9M2Op9j38j00J9J28J20nj06p0M2Q9K1o0l6N3O1l7j09p1J5
366886a068P2R2P6K0l5n0k3koqQJ4J3L1L8ln9p1l9QM4N5L4j2l8j8L1O2M9mo7r1
367862i47n7JL2J5pJL6P1O5lp3o8j0Pk3k2K5N3K2l0n9n9k1M0O1K8K5P5R7M5rJ
368835f88K6j0o6o6o0j03j23m3P4J36R8l3j77k06r0P2J76J73P5k6n2m5o8n1O8
$$ plain form
369601 -1009 -834 -696 -679 -730 -791 -868 -948 -972 -936 -905 -921 -914 -715 -309 -88 -445 -1105 -1430 -1302 -1082 -962 -892 -881
370306 -881 -964 -1064 -1095 -1072 -1039 -998 -940 -886 -875 -912 -948 -923 -843 -755 -696 -699 -801 -976 -1092 -1030 -825 -647 -633 -774 -961
371065 -961 -1104 -1194 -1263 -1300 -1261 -1147 -997 -848 -768 -840 -1026 -1161 -1146 -1026 -895 -821 -836 -914 -998 -1053 -1057 -979 -836 -742 -812
371830 -812 -1017 -1182 -1164 -989 -822 -784 -859 -967 -1061 -1109 -1073 -975 -907 -933 -1008 -1059 -1083 -1119 -1165 -1177 -1136 -1062 -999 -981 -973 -908 -822
372650 -822 -816 -890 -959 -978 -952 -915 -920 -986 -1086 -1182 -1230 -1203 -1119 -1018 -913 -815 -748 -735 -775 -860 -965 -1031 -998 -892 -810 -806 -845 -859
373504 -859 -831 -814 -861 -932 -966 -1004 -1081 -1108 -1022 -903 -852 -869 -888 -869 -841 -863 -932 -995 -1000 -916 -796 -764 -870 -1036 -1151 -1150 -1052
374328 -1052 -958 -948 -990 -998 -945 -865 -824 -896 -1044 -1096 -976 -833 -808 -849 -853 -806 -743 -737 -879 -1121 -1249 -1137 -919 -846 -1001
375094 -1001 -1213 -1259 -1152 -1080 -1090 -1036 -840 -634 -612 -821 -1118 -1246 -1052 -705 -534 -614 -727 -749 -796 -959 -1135 -1205
$$ packed form
369601a009J75J38J7n1o1p7q0k4L6L1j6PJ99M06K21l57o60l25J28K20J20P0J1
370306h81q3j00l1K3L3M1N8N4J1l7l6K5Q0Q8N9lj02j75j16O2K05J78J4j41j87
371065i61j43r0o9l7L9J14J50J49Q0p2j86j35J5J20J31P4j5p8q4n5mP8J43R4p0
371830h12k05j65J8J75J67L8p5j08r4m8L6R8O8k6p5n1k4l6m6j2M1P4O3J8QO5Q6
372650h22Op4o9j9K6L7no6j00r6m8K7Q4J01J05R8O7J3m0q5j05o6L3J06Q2Ml9j4
373504h59K8J7m7p1l4l8p7k7Q6J19N1j7j9J9K8k2o9o3nQ4J20L2j06j66j15JR8
374328a052R4J0m2qN3Q0M1p2j48n2J20J43K5m1mM7O3Oj42k42j28J12K18P3j55
375094a001k12m6J07P2j0N4J96K06K2k09k97j28J94L47J71q0j13k2m7j63j76p0
$$ plain form
375764 -1205 -1213 -1236 -1270 -1267 -1162 -969 -865 -968 -1123 -1137 -1065 -1049 -1065 -1014 -874 -659 -424 -280 -337 -642 -1083 -1352 -1263
376469 -1263 -999 -803 -741 -863 -1124 -1248 -1113 -966 -1018 -1150 -1121 -919 -837 -1029 -1187 -1032 -763 -506 64 869
377082 869 859 -562 -2088 -1990 -527 566 311 -809 -1759 -1940 -1509 -972 -664 -672 -965 -1356 -1547 -1428 -1185
377660 -1185 -986 -855 -851 -1002 -1142 -1121 -992 -864 -751 -685 -774 -1032 -1266 -1266 -1043 -780 -604 -521 -559 -756 -991 -1086
378330 -1086 -1075 -1085 -1107 -1069 -1010 -1023 -1084 -1045 -838 -650 -697 -887 -951 -847 -769 -824 -918 -951 -940 -933 -926 -890 -856 -908 -1031 -1065 -909
379154 -909 -685 -577 -627 -751 -860 -893 -833 -754 -761 -870 -1030 -1164 -1168 -1016 -818 -708 -727 -831 -949 -1027 -1021 -924 -825 -848
379889 -848 -1002 -1183 -1286 -1236 -1026 -779 -660 -741 -918 -998 -910 -798 -815 -943 -1070 -1114 -1062 -977 -966 -1063 -1154 -1100 -951
380587 -951 -900 -996 -1073 -1025 -944 -933 -947 -893 -802 -823 -985 -1111 -1057 -890 -756 -710 -706 -677 -637 -651 -700 -707 -684 -718 -828 -940 -974
$$ packed form
375764a205qk3l4LJ05J93J04j03j55j4P2J6j6N1J40K15K35J44n7l05m41k69Q9
376469a263K64J96O2j22k61j24J35J47n2j32K9K02Q2j92j58J55K69K57N70Q05
377082H69j0j421j526R8J463J093k55j120r50j81M31N37L08qk93l91j91J19K43
377660a185J99J31Mj51j40K1J29J28J13O6q9k58k34%K23K63J76Q3l8j97k35r5
378330a086J1j0k2L8N9j3o1L9K07J88m7j90o4J04P8n5r4l3J1PPL6L4n2j23l4J56
379154i09K24J08n0j24j09l3O0P9pj09j60j34mJ52J98J10j9j04j18p8OR7R9k3
379889h48j54j81j03N0K10K47J19q1j77q0Q8J12j7j28j27m4N2Q5J1r7r1N4J49
380587i51N1r6p7M8Q1J1j4N4R1k1j62j26N4J67J34M6MK9M0j4m9pK3l4j10j12l4
$$ plain form
381414 -974 -926 -877 -901 -977 -1014 -978 -935 -951 -1034 -1142 -1186 -1065 -800 -555 -460 -517 -663 -828 -959 -1053 -1153 -1235 -1196 -1033
382142 -1033 -895 -890 -949 -966 -932 -879 -814 -755 -757 -849 -971 -1010 -918 -775 -718 -801 -933 -990 -953 -902 -898 -938 -976 -978 -935 -857 -765 -700
382996 -700 -719 -837 -980 -1058 -1053 -1005 -944 -880 -838 -855 -911 -940 -925 -907 -895 -857 -780 -710 -734 -904 -1133 -1239 -1139 -920 -720
383762 -720 -631 -705 -905 -1096 -1158 -1085 -974 -934 -1020 -1207 -1367 -1331 -1102 -890 -838 -883 -898 -854 -822 -859 -904 -889 -860 -889 -934
384528 -934 -939 -952 -1009 -1052 -1029 -974 -940 -937 -947 -946 -918 -876 -851 -842 -845 -880 -958 -1028 -1024 -952 -882 -871 -916 -966 -963 -902 -834 -816 -874 -976 -1032 -975
385501 -975 -851 -771 -796 -897 -1017 -1101 -1103 -1015 -904 -861 -895 -935 -959 -1005 -1067 -1093 -1079 -1069 -1062 -1043 -1029 -1031 -998 -885 -745 -686 -744
386328 -744 -861 -956 -991 -988 -996 -1019 -1012 -967 -937 -949 -962 -944 -907 -884 -916 -1013 -1084 -1020 -854 -734 -742 -830 -910 -949 -965 -982 -1002 -1027 -1062
387213 -1062 -1085 -1063 -1006 -949 -901 -862 -848 -868 -889 -885 -890 -941 -999 -994 -929 -882 -905 -968 -1013 -1002 -940 -862 -801 -774 -794 -855 -927 -980 -1001 -998
$$ packed form
381414i74M8M9k4p6l7L6M3j6q3j08m4J21K65K45R5n7j46j65j31r4j00q2L9J63
382142a033J38Nn9j7L4N3O5N9kr2j22l9R2J43N7q3j32n7L7N1Mm0l8kM3P8R2O5
382996g00j9j18j43p8NM8O1O4M2j7n6k9J5J8J2L8P7P0k4j70k29j06J00K19K00
383762g20Q9p4k00j91o2P3J11M0q6j87j60L6K29K12N2m5j5M4L2l7m5J5K9k9m5
384528i34nj3n7m3K3N5L4Lj0JK8M2K5Rll5p8p0MP2P0J1m5n0LO1O8J8n8j02n6N7
385501i75J24Q0k5j01j20q4kQ8J11M3l4m0k4m6o2k6J4J0PJ9J4kL3J13J40N9n8
386328g44j17r5l5Lqk3PM5L0j2j3J8L7K3l2r7p1O4J66J20qq8q0l9j6j7k0k5l5
387213a062k3K2N7N7M8L9J4k0k1Mnn1n8NO5M7k3o3m5J1O2P8O1K7k0o1p2n3k1L
$$ plain form
388129 -998 -995 -1001 -993 -965 -954 -980 -997 -960 -893 -837 -805 -795 -814 -871 -949 -1024 -1073 -1074 -1024 -952 -892 -870 -878 -880 -866 -855 -847 -842 -878 -968 -1058 -1075 -1007
389136 -1007 -925 -918 -992 -1055 -1038 -957 -873 -833 -833 -836 -836 -847 -877 -910 -906 -865 -853 -900 -921 -853 -781 -820 -940 -1021 -1012 -959 -909 -884 -901 -970 -1049
390079 -1049 -1079 -1054 -1008 -959 -908 -871 -861 -887 -936 -973 -963 -903 -841 -850 -940 -1032 -1029 -921 -794 -730 -750 -851 -1006 -1123 -1113 -1015 -941
390905 -941 -943 -984 -1005 -983 -944 -930 -954 -984 -983 -953 -937 -972 -1009 -978 -909 -880 -886 -876 -865 -905 -981 -1010 -960 -914 -949 -1014 -1012 -930 -851 -866 -972
391851 -972 -1063 -1050 -952 -859 -828 -853 -907 -969 -1002 -959 -853 -780 -815 -907 -957 -939 -892 -851 -846 -896 -978 -1032 -1031 -1018 -1036 -1054 -1024 -970 -943
392736 -943 -922 -854 -763 -717 -735 -804 -925 -1062 -1122 -1050 -906 -791 -774 -857 -979 -1050 -1045 -1015 -991 -936 -830 -735 -714 -761 -833 -884
393525 -884 -891 -883 -922 -1009 -1083 -1098 -1069 -1041 -1057 -1108 -1130 -1050 -881 -732 -695 -748 -805 -814 -778 -722 -681 -687 -749 -843 -936 -1011 -1065 -1082 -1031 -910
394441 -910 -764 -661 -628 -626 -605 -593 -671 -827 -939 -929 -862 -834 -866 -912 -946 -969 -978 -975 -996 -1053 -1070 -969 -795 -654 -588 -610 -751
$$ packed form
388129i98LoQK8J1k6j7L7O7N6L2J0j9n7p8p5m9jN0P2O0K2qkJ4J1QNl6r0r0j7O8
389136a007Q2Pp4o3J7Q1Q4M0%l%j1l0l3MM1J2m7k1O8P2l9j20q1RN3N0K5j7o9p9
390079a049l0K5M6M9N1L7J0k6m9l7J0O0O2rr0r2LJ08J27O4k0j01j55j17J0R8P4
390905i41km1k1K2L9J4k4l0JL0J6l5l7L1O9K9oJ0J1m0p6k9N0M6l5o5KQ2P9j5j06
391851i72r1J3R8R3L1k5n4o2l3M3J06P3l5r2n0J8M7M1Nn0q2n4JJ3j8j8L0N4K7
392736i43K1O8R1M6j8o9j21j37o0P2J44J15J7q3j22p1NL0K4N5J06R5K1m7p2n1
393525h84pQl9q7p4j5K9K8j6n1k2Q0J69J49L7n3n7rL6N6M1oo2r4r3p5n4j7N1J21
394441i10J46J03L3KK1J2p8j56j12J0O7K8l2m6l4k3rLk1n7j7J01J74J41O6k2j41
$$ plain form
395265 -751 -971 -1140 -1172 -1119 -1061 -1023 -1002 -1010 -1049 -1071 -1002 -810 -541 -269 -47 96 133 44 -144 -353 -517 -624 -698 -762
396000 -762 -832 -947 -1178 -1545 -1898 -2023 -1875 -1587 -1325 -1174 -1130 -1125 -1089 -1003 -897 -813 -792 -822 -840 -838 -886 -992 -1055 -1033
396735 -1033 -992 -985 -1006 -1036 -1076 -1130 -1183 -1204 -1169 -1090 -1012 -965 -936 -917 -915 -944 -1012 -1094 -1115 -1039 -955 -969 -1061 -1128 -1127 -1098 -1068 -1006 -895
397620 -895 -795 -773 -828 -922 -1007 -1046 -1049 -1055 -1091 -1161 -1215 -1177 -1037 -889 -817 -827 -871 -891 -854 -772 -688 -654 -690 -773 -878 -991 -1083
398440 -1083 -1118 -1097 -1048 -983 -897 -805 -748 -763 -825 -869 -864 -846 -864 -902 -915 -894 -880 -897 -920 -913 -878 -872 -933 -1018 -1056 -1038 -991 -926 -859 -821
399355 -821 -824 -852 -891 -926 -936 -926 -913 -897 -880 -871 -885 -917 -949 -961 -959 -953 -934 -892 -842 -815 -834 -877 -895 -885 -902 -972 -1036 -1028 -972 -945 -959
400301 -959 -956 -907 -865 -877 -930 -971 -987 -997 -1001 -990 -977 -978 -990 -999 -994 -966 -927 -905 -917 -947 -957 -937 -913 -912 -932 -952 -957 -946 -950 -991 -1038 -1032 -958
401313 -958 -875 -854 -908 -985 -1029 -1020 -974 -922 -893 -888 -900 -937 -993 -1025 -988 -904 -853 -883 -964 -1027 -1025 -970 -938 -984 -1050 -1045 -990 -990 -1065 -1107 -1036
$$ packed form
395265g51k20j69l2N3N8L8K1ql9k2O9J92K69K72K22J43L7q9j88k09j64j07p4o4
396000g62p0j15k31l67l53j25J48K88K62J51M4NL6Q6J06Q4K1l0j8Km8j06o3K2
396735a033M1Pk1l0m0n4n3k1L5P9P8M7K9J9Kk9o8q2k1P6Q4j4r2o7JK9L0O2J11
397620h95J00K2n5r4q5l9lol6p0n4L8J40J48P2j0m4k0L7Q2Q4L4l6q3j05j13r2
398440a083l5K1M9O5Q6R2N7j5o2m4NJ8j8l8j3K1J4j7k3PL5Oo1q5l8J8M7O5O7L8
399355h21lk8l9l5j0J0J3J6J7Rj4l2l2j2KOJ9M2N0K7j9m3j8J0j7p0o4QN6K7j4
400301i59LM9M2j2n3m1j6j0mJ1J3jj2rNK8L9K2j2l0j0K0K4Jk0k0nJ1mm1m7OP4
401313i58Q3K1n4p7m4RM6N2K9Nj2l7n6l2L7Q4N1l0q1o3KN5L2m6o6NN5%p5m2P1
$$ plain form
402259 -1036 -910 -834 -815 -780 -709 -662 -697 -794 -895 -941 -911 -840 -804 -843 -929 -999 -1003 -938 -863 -853 -913 -964 -932 -840 -760 -739 -777 -842
403113 -842 -887 -897 -885 -869 -870 -903 -947 -960 -921 -852 -799 -809 -898 -1016 -1080 -1054 -979 -912 -866 -830 -823 -869 -934 -943 -875 -766 -662 -621 -669
403998 -669 -756 -835 -890 -888 -821 -751 -755 -837 -938 -1029 -1118 -1151 -1094 -1039 -1076 -1182 -1287 -1338 -1312 -1211 -1055 -911 -860 -912 -1019 -1110
404787 -1110 -1116 -1016 -893 -852 -892 -926 -916 -900 -913 -936 -929 -882 -824 -809 -869 -964 -1003 -973 -948 -975 -1014 -1019 -1004 -1004 -1016 -1001 -943 -871 -831
405672 -831 -839 -881 -934 -979 -997 -991 -980 -985 -1004 -1012 -997 -981 -984 -990 -987 -1002 -1050 -1092 -1093 -1064 -1035 -994 -912 -822 -796 -846 -893 -852 -754 -717 -788 -889
406648 -889 -923 -891 -861 -872 -894 -890 -881 -917 -998 -1079 -1156 -1260 -1285 -1004 -473 -142 -274 -606 -796 -818 -806 -818 -842 -882 -947 -1006
407445 -1006 -994 -889 -772 -750 -825 -902 -911 -872 -857 -915 -1006 -1025 -926 -789 -746 -841 -992 -1061 -1000 -906 -897 -970 -1030 -1026 -978 -925 -873 -808
408299 -808 -754 -762 -830 -902 -947 -982 -1009 -996 -953 -936 -955 -948 -885 -827 -838 -900 -954 -966 -942 -901 -863 -853 -897 -971 -989 -916 -830 -811 -846 -874
$$ packed form
402259a036J26P6J9L5P1M7l5r7j01m6L0P1L6l9q6p0mO5P5J0o0n1L2R2Q0K1l8o5
403113h42m5j0J2J6jl3m4j3L9O9N3j0q9j18o4K6P5O7M6L6Pm6o5rO8J09J04M1m8
403998f69q7p9n5KO7P0mq2j01r1q9l3N7N5l7j06j05n1K6J01J56J44N1n2j07r1
404787a110oJ00J23M1m0l4J0J6j3k3PM7N8J5o0r5l9L0K5k7l9nJ5%j2J5N8P2M0
405672h31qm2n3m5j8OJ1nj9qJ5J6loLj5m8m2jK9K9M1Q2R0K6n0m7M1R8L7p1j01
406648h89l4L2L0j1k2MRl6q1q1p7j04k5K81N31L31j32l32j90k2J2j2k4m0o5n9
407445a006J2J05J17K2p5p7rL9J5n8r1j9R9J37M3r5j51o9O1R4Rp3o0MM8N3N2O5
408299h08N4qo8p2m5l5k7J3M3J7j9PO3N8j1o2n4j2K4M1L8J0m4p4j8P3Q6J9l5k8
$$ plain form
409215 -874 -881 -887 -892 -894 -913 -967 -1015 -990 -888 -798 -797 -857 -893 -883 -888 -935 -969 -937 -875 -856 -891 -926 -914 -861 -817 -837 -918 -987 -973 -892 -821
410161 -821 -818 -867 -901 -885 -853 -851 -880 -907 -912 -916 -948 -994 -1018 -1009 -986 -967 -952 -926 -884 -840 -816 -830 -877 -924 -944 -941 -943 -958 -969 -958 -931 -907
411134 -907 -890 -860 -813 -773 -774 -814 -870 -924 -960 -967 -951 -934 -932 -951 -972 -973 -965 -957 -925 -854 -788 -785 -826 -840 -822 -827 -865 -887 -886 -894 -918 -927 -923 -943 -993
412202 -993 -1022 -1003 -964 -963 -1020 -1082 -1059 -953 -869 -895 -995 -1058 -1035 -982 -957 -957 -966 -985 -1001 -980 -915 -846 -824 -859 -905 -910 -876 -851 -859 -874
413118 -874 -880 -893 -925 -951 -939 -898 -859 -846 -877 -939 -968 -894 -763 -715 -797 -906 -945 -922 -903 -929 -992 -1044 -1041 -989 -922 -866 -835 -845 -884
414002 -884 -914 -921 -912 -913 -953 -1038 -1116 -1130 -1078 -1015 -984 -987 -1007 -1031 -1061 -1086 -1085 -1052 -1015 -1008 -1026 -1031 -999 -945 -897 -866 -859 -871 -881 -874 -867 -884 -914 -931
415044 -931 -930 -931 -932 -912 -864 -813 -784 -787 -808 -833 -854 -861 -851 -842 -847 -853 -847 -842 -885 -979 -1040 -1000 -921 -918 -996 -1056 -1028 -935 -842 -797 -820 -908 -1020 -1076
416079 -1076 -1034 -953 -924 -958 -989 -968 -914 -883 -908 -968 -1026 -1050 -1022 -969 -952 -983 -993 -936 -840 -759 -713 -717 -776 -858 -914 -942 -968 -987 -984
$$ packed form
409215h74ponkj9n4m8K5J02R0Jo0l6J0nm7l4L2O2J9l5l5J2N3M4k0q1o9J4Q1P1
410161h21Lm9l4J6L2Kk9k7nml2m6k4RK3J9J5K6M2M4K4j4m7m7k0Lkj5j1J1K7K4
411134i07J7L0M7M0jm0n6n4l6pJ6J7Kj9k1jQQL2P1O6Lm1j4J8nl8k2Jqk4rMk0n0
412202i93k9J9L9Jn7o2K3J06Q4k6j00o3K3N3K5%rj9j6K1O5O9K2l5m6nL4K5qj5
413118h74oj3l2k6J2M1L9J3l1o2k9P4J31M8q2j09l9K3J9k6o3n2LN2O7N6L1j0l9
414002h84l0pRjm0q5p8j4N2O3L1lk0k4l0k5JL3L7Pj8nL2N4M8L1Pj2j0PPj7l0j7
415044i31JjjK0M8N1K9lk1k5k1pJ0RnoONm3r4o1M0P9Lp8o0K8R3R3M5k3q8j12n6
416079a076M2Q1K9l4l1K1N4L1k5o0n8k4K8N3J7l1j0N7R6Q1M6mn9q2n6k8k6j9L
$$ plain form
416967 -984 -981 -990 -984 -939 -867 -805 -773 -764 -770 -805 -881 -969 -1013 -994 -950 -933 -961 -1005 -1008 -941 -834 -734 -684 -709 -796 -898 -983 -1046 -1083 -1091 -1070
417910 -1070 -1027 -977 -928 -856 -741 -635 -628 -737 -867 -930 -929 -911 -900 -908 -938 -974 -993 -994 -988 -962 -907 -855 -839 -855 -878 -891 -882 -857 -836
418798 -836 -835 -859 -905 -952 -976 -977 -987 -1029 -1085 -1112 -1082 -1003 -908 -825 -770 -757 -784 -815 -813 -790 -795 -872 -1027 -1200 -1276 -1188 -995 -825 -727
419683 -727 -683 -687 -750 -849 -952 -1047 -1110 -1110 -1062 -1012 -952 -852 -739 -680 -689 -722 -758 -823 -930 -1038 -1094 -1082 -1035 -994 -967 -930 -869 -819
420537 -819 -825 -888 -940 -934 -905 -892 -880 -866 -881 -923 -951 -951 -944 -936 -919 -893 -868 -854 -869 -918 -960 -945 -882 -819 -787 -797 -847 -900 -917 -909 -910 -913 -891
421544 -891 -861 -869 -911 -942 -940 -913 -864 -813 -802 -847 -911 -955 -984 -1016 -1037 -1021 -968 -914 -877 -831 -780 -779 -851 -942 -995 -994 -948 -880 -838 -862 -925
422487 -925 -972 -983 -979 -977 -970 -947 -904 -867 -865 -894 -934 -970 -991 -984 -944 -901 -904 -954 -986 -949 -884 -864 -900 -946 -977 -990 -978 -950 -937 -954 -963 -926
423464 -926 -857 -799 -795 -862 -964 -1037 -1052 -1031 -985 -907 -837 -840 -913 -964 -934 -879 -881 -931 -960 -946 -926 -938 -981 -1022 -1026 -993 -941 -878 -817 -792
$$ packed form
416967i84LrOM5P2O2L2Rol5p6q8m4J9M4J7k8m4lO7J07J00N0k5q7j02q5o3l7qK1
417910a070M3N0M9P2J15J06Pj09j30o3JJ8J1ql0l6j9jOK6N5N2J6j6k3j3RK5K1
418798h36Jk4m6m7k4jj0m2n6k7L0P9R5Q3N5J3k7l1KK3np7j55j73p6Q8J93J70R8
419683g27M4mo3r9j03r5o3%M8N0O0J00J13N9rl3l6o5j07j08n6J2M7M1K7L7O1N0
420537h19oo3n2OK9J3J2J4j5m2k8%PQJ7K6K5J4j5m9m2J5O3O3L2j0n0n3j7QjlK2
421544h91L0qm2l1KK7M9N1J1m5o4m4k9l2k1J6N3N4L7M6N1Jp2r1n3JM6O8M2k4o3
422487i25m7j1MKPK3M3L7Kk9m0l6k1PM0M3ln0l2L7O5K0l6m6l1j3J2K8J3j7rL7
423464i26O9N8Mo7j02p3j5K1M6P8P0lp3n1L0N5kn0k9J4K0j2m3m1mL3N2O3O1K5
$$ plain form
424379 -792 -814 -856 -890 -910 -911 -884 -851 -847 -873 -908 -955 -1003 -1015 -977 -933 -922 -930 -930 -919 -890 -829 -758 -750 -847 -991 -1071 -1054 -1001 -966 -941 -897
425325 -897 -845 -825 -841 -875 -921 -968 -985 -964 -946 -956 -969 -958 -928 -901 -887 -878 -880 -914 -973 -1010 -991 -932 -876 -848 -842 -845 -861 -894 -922 -918 -876
426271 -876 -826 -820 -883 -967 -1008 -1008 -1005 -1003 -981 -945 -926 -938 -961 -967 -947 -915 -890 -880 -883 -907 -946 -962 -926 -880 -897 -985 -1066 -1066 -987 -888 -824 -809
427252 -809 -834 -871 -913 -975 -1041 -1068 -1042 -986 -929 -898 -909 -948 -973 -959 -925 -916 -952 -1017 -1061 -1038 -948 -847 -792 -793 -815 -820 -820 -854 -926 -981
428167 -981 -968 -921 -911 -940 -957 -950 -950 -969 -977 -945 -874 -798 -761 -778 -826 -866 -896 -935 -980 -1006 -1014 -1025 -1034 -1017 -973 -923 -888 -885 -910 -935 -937 -927
429144 -927 -947 -1027 -1149 -1246 -1245 -1143 -1006 -900 -853 -854 -869 -886 -907 -917 -900 -888 -915 -977 -1039 -1065 -1027 -947 -893 -907 -948 -933 -842 -737
429998 -737 -680 -675 -701 -762 -855 -933 -957 -936 -901 -880 -891 -908 -893 -857 -854 -885 -895 -863 -824 -803 -796 -796 -811 -853 -924 -994 -1033 -1050 -1051 -1025 -977
430944 -977 -912 -814 -710 -673 -736 -855 -980 -1076 -1106 -1067 -1011 -982 -956 -903 -857 -854 -881 -902 -911 -926 -963 -1011 -1045 -1052 -1039 -1022 -994 -935 -853
$$ packed form
424379g92k2m2l4k0jK7L3Mk6l5m7m8j2L8M4J1q%J1K9O1P1Qr7j44q0J7N3L5K5M4
425325h97N2K0j6l4m6m7j7K1J8j0j3J1L0K7J4Rkl4n9l7J9N9N6K8Olj6l3k8MM2
426271h76N0Oo3q4m1%LKK2L6J9j2k3oK0L2K5J0lk4l9j6L6M6j7q8q1%P9R9O4J5
427252h09k5l7m2o2o6k7K6N6N7L1j1l9k5J4L4Rl6o5m4K3R0J01N5jk2n%l4p2n5
428167i81J3M7J0k9j7P%j9qL2P1P6L7j7m8m0l0l9m5k6qj1rJ7M4N0L5Lk5k5kJ0
429144i27k0q0j22r7JJ02J37J06M7jj5j7k1j0J7J2k7o2o2k6L8Q0N4j4m1J5R1J05
429998g37N7Nk6o1r3p8k4K1L5K1j1j7J5L6Ll1j0L2L9K1P%j5m2p1p0l9j7jK6M8
430944i77O5R8J04L7o3j19j25r6l0L9N6K9K6N3M6Lk7k1rj5l7m8l4pJ3J7K8N9Q2
$$ plain form
431829 -853 -788 -761 -770 -818 -902 -971 -979 -932 -867 -807 -767 -775 -833 -901 -953 -998 -1031 -1011 -925 -816 -738 -711 -730 -776 -842 -920 -968 -954 -916 -892
432745 -892 -865 -813 -770 -773 -812 -862 -917 -973 -1005 -988 -941 -906 -889 -878 -873 -877 -882 -880 -889 -933 -996 -1032 -1024 -985 -936 -909 -922 -927 -869 -773 -714 -734 -823
433752 -823 -929 -993 -995 -967 -958 -976 -991 -972 -918 -856 -829 -862 -924 -957 -942 -910 -897 -906 -917 -914 -897 -876 -873 -900 -940 -959 -946 -907 -860 -836 -845
434698 -845 -868 -893 -928 -959 -946 -897 -857 -845 -847 -862 -895 -917 -888 -818 -769 -789 -870 -961 -1021 -1041 -1035 -1011 -976 -938 -910 -895 -895 -914 -938 -933 -888
435644 -888 -843 -851 -915 -984 -997 -951 -900 -884 -889 -892 -892 -877 -816 -726 -678 -729 -855 -964 -991 -955 -913 -880 -844 -822 -847 -913 -973 -994 -986 -985 -987
436587 -987 -970 -942 -943 -974 -985 -956 -933 -942 -959 -964 -965 -958 -927 -885 -837 -776 -754 -848 -1000 -1073 -1036 -965 -911 -870 -845 -845 -854 -849 -841 -867 -944 -1035 -1088
437594 -1088 -1076 -1016 -950 -913 -909 -924 -957 -999 -1011 -975 -932 -921 -924 -915 -915 -931 -920 -858 -802 -804 -828 -816 -782 -777 -800 -813 -806 -809 -842 -892 -928 -935 -914
438605 -914 -881 -861 -877 -933 -996 -1029 -1017 -970 -923 -907 -920 -937 -938 -910 -844 -764 -723 -771 -895 -1010 -1046 -1016 -969 -923 -878 -847 -849 -883 -921
$$ packed form
431829h53O5K7rm8q4o9qM7O5O0M0qn8o8n2m5l3K0Q6J09P8K7j9m6o6p8m8J4L8K4
432745h92K7N2M3ll9n0n5n6l2J7M7L5J7J1NmnKrm4o3l6QL9M9K7j3nN8R6N9k0q9
433752h23j06o4kK8Rj8j5J9N4O2K7l3o2l3J5L2J3rj1LJ7K1Lk7m0j9J3L9M7K4r
434698h45k3k5l5l1J3M9M0J2kj5l3k2K9P0M9k0q1r1o0k0OK4L5L8K8J5%j9k4NM5
435644h88M5qo4o9j3M6N1J6nl%J5O1R0M8n1j26j09k7L6M2L3L6K2k5o6o0k1QJk
436587i87J7K8jl1j1K9K3rj7njPL1M2M8O1K2r4j52p3L7P1N4M1K5%rNQk6p7r1n3
437594a088J2O0O6L7Mj5l3m2j2L6M3J1lR%j6J1O2N6kk4J2L4Nk3j3Pll3n0l6pK1
438605i14L3K0j6n6o3l3J2M7M7J6j3j7jK8O6Q0M1m8j24j15l6L0M7M6M5L1kl4l8
$$ plain form
439486 -921 -929 -909 -900 -937 -1013 -1084 -1099 -1047 -978 -958 -996 -1033 -1010 -930 -845 -803 -812 -849 -887 -906 -900 -895 -921 -957 -964 -953 -958 -963 -933 -888 -884 -929 -947
440497 -947 -880 -775 -744 -838 -997 -1110 -1104 -1000 -887 -829 -818 -821 -839 -888 -958 -1016 -1036 -1017 -966 -893 -827 -793 -783 -792 -839 -914 -959 -956
441352 -956 -954 -968 -955 -903 -865 -876 -903 -896 -849 -787 -739 -733 -790 -885 -968 -1003 -996 -972 -949 -932 -909 -865 -823 -832 -897 -943 -919 -870 -861 -871 -866 -876
442328 -876 -931 -993 -1006 -970 -926 -895 -858 -812 -795 -834 -896 -936 -953 -976 -1004 -1009 -979 -938 -911 -913 -949 -994 -1002 -965 -923 -895 -877 -871 -885 -909 -917
443274 -917 -909 -907 -915 -921 -909 -876 -839 -826 -846 -885 -933 -984 -1022 -1029 -1015 -1011 -1016 -995 -940 -891 -879 -887 -890 -881 -859 -836 -849 -901 -933 -908 -860 -846 -877 -905
444309 -905 -884 -830 -802 -828 -882 -938 -992 -1031 -1025 -989 -970 -977 -977 -961 -960 -986 -1010 -1014 -1005 -997 -987 -974 -964 -937 -872 -806 -806 -871 -923 -919 -906 -932 -967
445316 -967 -939 -831 -708 -668 -746 -873 -950 -947 -923 -947 -1022 -1082 -1066 -980 -895 -866 -887 -917 -930 -925 -919 -924 -934 -940 -945 -942 -923 -900 -909 -959 -1007
446262 -1007 -999 -941 -886 -873 -889 -910 -935 -965 -971 -934 -878 -843 -856 -912 -971 -986 -949 -884 -831 -836 -907 -988 -1015 -987 -946 -904 -857 -827 -845 -900
$$ packed form
439486i21qK0Rl7p6p1j5N2O9K0l8l7K3Q0Q5M2rl7l8j9ONk6l6pJ1nnL0M5Mm5j8
440497i47O7J05L1r4j59j13OJ04J13N8J1lj8m9p0n8k0J9N1P3O6L4J0rm7p5m5L
441352i56Kj4J3N2L8j1k7PM7O2M8On7r5q3l5PK4K3J7K3M4M2ro5m6K4M9Rj0Nj0
442328h76n5o2j3L6M4L1L7M6J7l9o2m0j7k3k8nL0M1K7kl6m5qL7M2K8J8Oj4k4q
443274i17QKqoJ2L3L7J3k0l9m8n1l8pJ4MnK1N5M9J2qlRK2K3j3n2l2K5M8J4l1k8
444309i05K1N4K8k6n4n6n4l9OL6J9p%J6Jk6k4mRQJ0J3J0K7O5O6%o5n2MJ3k6l5
445316i67K8J08J23M0p8j27p7LK4k4p5o0J6Q6Q5K9k1l0j3NOnj0onLJ9K3rn0m8
446262a007QN8N5J3j6k1k5l0oL7N6L5j3n6n9j5L7O5N3np1q1k7K8M1M2M7L0j8n5
$$ plain form
447177 -900 -948 -958 -939 -930 -963 -1018 -1035 -995 -937 -896 -877 -886 -926 -966 -963 -923 -891 -887 -894 -898 -915 -968 -1031 -1045 -1000 -945 -917 -897 -870 -865 -897 -940
448158 -940 -974 -1006 -1035 -1056 -1061 -1042 -1010 -976 -937 -890 -859 -862 -883 -895 -898 -899 -887 -866 -872 -918 -973 -1003 -1004 -978 -933 -895 -870 -847 -825 -810 -797 -802
449134 -802 -841 -884 -890 -872 -871 -901 -952 -1006 -1033 -1012 -959 -908 -877 -872 -892 -921 -938 -944 -940 -922 -915 -942 -977 -978 -945 -908 -887 -878 -875 -892 -931 -950 -906
450138 -906 -834 -806 -832 -861 -860 -831 -790 -764 -773 -813 -869 -917 -930 -907 -872 -843 -823 -814 -827 -848 -843 -816 -815 -847 -860 -831 -812 -847 -915 -965 -966 -929
451115 -929 -895 -895 -918 -922 -876 -797 -754 -790 -858 -876 -841 -815 -823 -837 -849 -878 -923 -956 -958 -942 -938 -964 -1007 -1028 -1004 -954 -900 -847 -796 -750 -731
452061 -731 -769 -852 -924 -948 -936 -901 -855 -821 -832 -900 -983 -1004 -930 -826 -780 -788 -780 -755 -777 -864 -958 -1008 -1033 -1069 -1106 -1102 -1048 -990 -978 -996
452976 -996 -994 -963 -928 -899 -875 -858 -848 -843 -847 -871 -916 -965 -985 -967 -936 -911 -905 -956 -1056 -1119 -1076 -974 -907 -901 -916 -919 -899 -870 -849 -838 -834
453922 -834 -856 -900 -933 -931 -910 -882 -857 -852 -875 -907 -933 -959 -991 -1013 -1002 -957 -912 -888 -873 -852 -833 -838 -859 -861 -827 -787 -789 -844 -923 -995 -1036
$$ packed form
447177i00m8j0J9Rl3n5j7M0N8M1J9rm0m0LM0L2Mpmj7n3o3j4M5N5K8K0K7Nl2m3
448158i40l4l2k9k1nJ9L2L4L9M7L1lk1j2ljJ2K1om6n5l0jK6M5L8K5K3K2J5J3n
449134h02l9m3oJ8Jl0n1n4k7K1N3N1L1Nk0k9j7oMJ8Pk7l5jL3L7K1RLj7l9j9M4
450138i06P2K8k6k9JK9M1K6rm0n6m8j3K3L5K9K0Rj3k1NK7Jl2j3K9J9l5o8n0jL7
451115i29L4%k3mM6P9M3l6o8j8L5K6qj4j2k9m5l3kJ6Mk6m3k1K4N0N4N3N1M6J9
452061g31l8q3p2k4J2L5M6L4j1o8q3k1P4J04M6qQK5k2q7r4n0k5l6l7MN4N8J2j8
452976i96KL1L5K9K4J7J0Nmk4m5m9k0J8L1K5On1j00o3M3J02O7Oj5lK0K9K1J1M
453922h34k2m4l3KK1K8K5Nk3l2k6k6l2k2J1M5M5K4J5K1J9nk1kL4M0kn5p9p2m1
$$ plain form
454868 -1036 -1028 -979 -936 -932 -946 -935 -901 -881 -886 -883 -842 -783 -754 -782 -856 -939 -1002 -1027 -1015 -978 -929 -885 -858 -850 -863 -899 -940 -957 -949 -933 -903
455819 -903 -852 -817 -842 -905 -957 -983 -990 -969 -923 -874 -846 -854 -905 -982 -1034 -1011 -928 -848 -815 -816 -822 -843 -892 -953 -989 -975 -924 -878 -867 -878 -884
456765 -884 -886 -893 -903 -906 -907 -911 -910 -893 -869 -848 -832 -834 -874 -936 -977 -986 -980 -967 -946 -923 -915 -920 -920 -906 -886 -884 -911 -940 -930 -887 -861 -877 -914 -940 -949 -948
457860 -948 -943 -930 -905 -878 -864 -867 -877 -892 -905 -895 -868 -860 -891 -937 -945 -901 -852 -842 -853 -850 -837 -842 -875 -912 -928 -935 -957 -988 -992 -947 -865 -792 -781
458867 -781 -838 -908 -926 -872 -801 -784 -829 -880 -901 -910 -918 -911 -899 -910 -941 -959 -942 -903 -884 -912 -955 -968 -941 -898 -862 -858 -888 -929 -950 -952 -941
459813 -941 -910 -864 -834 -836 -862 -904 -954 -983 -964 -904 -833 -781 -767 -789 -812 -814 -825 -872 -923 -933 -913 -896 -882 -859 -837 -834 -855 -887 -900 -871
460729 -871 -827 -829 -886 -941 -938 -891 -855 -861 -895 -919 -910 -889 -893 -923 -938 -922 -914 -953 -1016 -1039 -980 -878 -820 -846 -909 -927 -882 -824 -797 -797 -812 -854
461710 -854 -920 -964 -951 -913 -900 -906 -896 -875 -868 -872 -875 -879 -899 -925 -933 -920 -906 -908 -920 -920 -900 -871 -852 -852 -874 -913 -959 -984 -978 -966 -985 -1029 -1047 -1006
$$ packed form
454868a036QM9M3Mj4J1L4K0nLM1N9K9k8p4q3o3k5J2L7M9M4K7Qj3l6m1j7QJ6L0
455819i03N1L5k5o3n2k6pK1M6M9K8qn1p7n2K3Q3Q0L3jok1m9o1l6J4N1M6J1j1o
456765h84kpj0ljmJJ7K4K1J6km0o2m1rOJ3K1K3Qn%J4K0Kk7k9J0M3K6j6l7k6rJ
457860i48NJ3K5K7J4lj0j5j3J0K7Ql1m6qM4M9J0j1LJ3nl3l7j6pk2l1mM5Q2P3J1
458867g81n7p0j8N4P1J7m5n1k1rqPJ2j1l1j8J7L9J9k8m3j3K7M3L6Ml0m1k1kJ1
459813i41L1M6L0kk6m2n0k9J9O0P1N2J4k2k3kj1m7n1j0K0J7J4K3K2Lk1l2j3K9
460729h71M4kn7n5LM7L6ol4k4RK1ml0j5J6Ql9o3k3N9J02N8k6o3j8M5N8K7%j5m2
461710h54o6m4J3L8J3oJ0K1Pmlmk0k6qJ3J4kj2%K0K9J9%k2l9m6k5OJ2j9m4j8M1
$$ plain form
462747 -1006 -927 -853 -814 -812 -820 -800 -758 -749 -805 -876 -902 -886 -859 -836 -835 -874 -930 -952 -911 -838 -790 -792 -825 -847 -844 -842 -863 -892 -895 -871 -845 -843 -877
463751 -877 -918 -913 -860 -832 -873 -935 -947 -909 -883 -903 -923 -891 -833 -825 -892 -970 -982 -926 -864 -841 -869 -920 -941 -919 -905 -933 -968 -970 -954 -949 -951
464697 -951 -936 -895 -838 -784 -768 -812 -880 -909 -901 -911 -953 -977 -948 -879 -810 -781 -807 -853 -877 -873 -861 -843 -808 -762 -728 -727 -770 -845 -915 -932
465613 -932 -893 -844 -831 -851 -880 -913 -948 -954 -913 -862 -853 -895 -955 -988 -953 -846 -739 -716 -771 -831 -862 -891 -923 -923 -885 -864 -892 -912 -869
466498 -869 -795 -771 -839 -946 -996 -953 -881 -850 -861 -877 -898 -935 -960 -939 -893 -887 -940 -990 -969 -898 -868 -910 -953 -943 -917 -915 -908 -871 -846 -881
467413 -881 -966 -1041 -1064 -1037 -999 -964 -915 -854 -825 -855 -908 -948 -965 -958 -923 -888 -903 -956 -974 -920 -853 -834 -849 -847 -823 -820 -860 -920 -971 -992
468328 -992 -972 -930 -898 -879 -866 -863 -860 -845 -826 -826 -851 -887 -912 -916 -909 -903 -903 -909 -913 -901 -869 -836 -829 -861 -911 -940 -935 -908 -879 -862 -870 -892 -902 -884 -842
469394 -842 -797 -777 -798 -851 -910 -945 -949 -931 -900 -863 -847 -871 -902 -895 -870 -873 -895 -901 -886 -870 -864 -869 -881 -897 -920 -948 -985 -1024 -1024 -945 -825 -760
$$ packed form
462747a006P9P4L9KqK0M2Rn6p1k6J6K7K3Jl9n6k2M1P3M8kl3k2LKk1k9lK4K6Kl4
463751h77m1NN3K8m1o2j2L8K6k0k0L2N8Qo7p8j2N6O2K3k8n1k1K2J4k8l5kJ6Nk
464697i51J5M1N7N4J6m4o8k9Qj0m2k4K9O9O9K9k6m6k4MJ2J8L5M6L4Jm3p5p0j7
465613i32L9M9J3k0k9l3l5oM1N1Rm2o0l3L5J07J07K3n5o0l1k9l2%L8K1k8k0M3
466498h69P4K4o8j07n0M3P2L1j1j6k1l7k5K1M6On3n0K1P1L0m2m3J0K6KPL7K5l5
467413h81q5p5k3K7L8L5M9O1K9l0n3m0j7PL5L5j5n3j8N4O7J9j5KK4Lm0o0n1k1
468328i92K0M2L2J9J3LLJ5J9%k5l6k5mPO%omJ2L2L3Pl2n0k9NK7K9J7qk2j0J8M2
469394h42M5K0k1n3n9l5mJ8L1L7J6k4l1PK5lk2oJ5J6Onj2j6k3k8l7l9%P9J20O5
$$ plain form
470370 -760 -790 -864 -918 -933 -919 -900 -894 -896 -888 -871 -873 -907 -946 -955 -935 -909 -899 -913 -933 -920 -865 -802 -768 -779 -828 -884 -918 -929 -925 -902 -861 -826
471346 -826 -815 -814 -820 -848 -895 -919 -905 -899 -929 -940 -882 -794 -760 -811 -902 -969 -983 -969 -967 -978 -956 -891 -844 -865 -926 -959 -930 -868 -835 -860 -914
472297 -914 -940 -919 -884 -884 -913 -930 -923 -924 -945 -956 -932 -888 -865 -881 -903 -898 -891 -928 -990 -1008 -957 -894 -869 -870 -859 -829 -800 -805 -860 -933 -966 -938
473273 -938 -899 -900 -926 -919 -873 -847 -878 -926 -939 -915 -888 -875 -872 -878 -906 -949 -972 -944 -884 -845 -858 -893 -920 -943 -971 -978 -950 -919 -903 -882 -841
474219 -841 -800 -792 -839 -931 -1022 -1055 -1008 -918 -845 -814 -804 -788 -774 -800 -877 -962 -993 -950 -868 -804 -807 -882 -959 -965 -911 -874 -894 -932 -944 -922
475135 -922 -874 -822 -808 -843 -887 -900 -901 -915 -914 -860 -790 -788 -871 -967 -1002 -969 -906 -855 -836 -842 -846 -836 -826 -838 -874 -923 -963 -976 -964 -935 -887
476081 -887 -834 -818 -841 -848 -812 -788 -816 -858 -874 -887 -927 -980 -1016 -1014 -979 -937 -918 -923 -922 -901 -879 -881 -910 -934 -914 -866 -855 -903 -948 -938 -896
477027 -896 -880 -905 -937 -951 -955 -978 -996 -945 -818 -726 -757 -856 -915 -922 -941 -993 -1031 -1008 -938 -878 -872 -916 -958 -952 -911 -899 -931 -950 -926 -902
$$ packed form
470370g60l0p4n4j5J4J9OkQJ7kl4l9rK0K6J0j4k0J3N5O3L4j1m9n6l4j1MK3M1L5
471346h26J1Jok8m7k4J4Ol0j1N8Q8L4n1r1o7j4J4Kj1K2O5M7k1o1l3K9O2L3k5n4
472297i14k6K1L5%k9j7Pjk1j1K4M4K3j6k2NPl7o2j8N1O3K5jJ1L0K9nn5p3l3K8
473273i38L9jk6PM6K6l1m8j3K4K7J3Lok8m3k3K8O0L9j3l5k7k3k8pK8L1J6K1M1
474219h41M1Qm7r2r1l3M7R0P3L1J0J6J4k6p7q5l1M3Q2O4lp5p7oN4L7k0l8j2K2
475135i22M8N2J4l5m4j3jj4JN4P0Kq3r6l5L3O3N1J9omJ0J0j2l6m9m0j3J2K9M8
476081h87N3J6k3pL6K4k8m2j6j3m0n3l6KL5M2J9nJK1K2kk9k4K0M8J1m8m5J0M2
477027h96J6k5l2j4mk3j8N1J27R2l1r9n9pj9n2l8K3P0O0Om4m2OM1J2l2j9K4K4
$$ plain form
477942 -902 -913 -938 -947 -944 -937 -916 -885 -859 -845 -846 -858 -866 -866 -884 -940 -1007 -1021 -968 -903 -879 -891 -908 -923 -950 -981 -988 -964 -936 -927 -934 -945 -958 -961 -936
478977 -936 -880 -823 -810 -851 -907 -930 -916 -909 -944 -1001 -1034 -1024 -975 -902 -839 -829 -862 -890 -901 -925 -961 -964 -930 -902 -904 -917 -921 -925 -930 -921 -893 -866
479953 -866 -866 -887 -901 -906 -925 -949 -939 -894 -855 -842 -838 -840 -881 -966 -1031 -1007 -916 -853 -872 -937 -992 -1008 -987 -948 -915 -900 -900 -898 -891 -891 -922 -986 -1048
480965 -1048 -1065 -1032 -980 -933 -895 -873 -868 -864 -868 -907 -964 -982 -939 -876 -845 -862 -909 -964 -1013 -1040 -1038 -1024 -1016 -1007 -964 -901 -871 -892 -935 -966 -969 -941
481941 -941 -891 -849 -838 -846 -847 -842 -850 -867 -876 -889 -924 -973 -1008 -1003 -949 -884 -871 -923 -989 -1025 -1024 -1004 -985 -976 -946 -871 -820 -875 -1012 -1108 -1087 -993
482915 -993 -929 -929 -933 -898 -860 -875 -931 -970 -966 -933 -891 -854 -839 -859 -912 -980 -1027 -1012 -939 -870 -859 -893 -924 -919 -887 -853 -844 -856 -865 -872 -907 -965
483891 -965 -994 -951 -853 -775 -770 -814 -849 -868 -897 -940 -967 -957 -933 -928 -932 -921 -910 -918 -930 -926 -927 -962 -1004 -993 -928 -870 -856 -874 -908 -956 -1009 -1029
484868 -1029 -994 -935 -892 -866 -845 -845 -881 -926 -931 -893 -852 -849 -875 -886 -856 -818 -820 -858 -889 -891 -878 -868 -869 -876 -886 -908 -951 -982 -964 -912 -886 -898
$$ packed form
477942i02j1k5rLPK1L1K6J4jj2q%j8n6o7j4N3O5K4j2j7j5k7l1pK4K8Rpj1j3lK5
478977i36N6N7J3m1n6k3J4Pl5n7l3J0M9P3O3J0l3k8j1k4l6lL4K8kj3mmnRK8K7
479953h66%k1j4nj9k4J0M5L9J3Mkm1q5o5K4R1O3j9o5n5j6K1L9L3J5%KP%l1o4o2
480965a048j7L3N2M7L8K2NMml9n7j8M3O3L1j7m7n5m9k7KJ4QRM3O3L0k1m3l1lK8
481941i41N0M2J1qjNqj7rj3l5m9l5NN4O5J3n2o6l6JK0J9RL0P5N1n5j37r6K1R4
482915i93O4%mL5L8j5n6l9ML3M2L7J5k0n3o8m7J5P3O9J1l4l1NL2L4Rj2rpl5n8
483891i65k9M3R8P8Nm4l5j9k9m3k7J0K4NmJ1J1qj2Mjl5m2J1O5N8J4j8l4m8n3k0
484868a029L5N9M3K6K1%l6m5nL8M1Lk6j1L0L8kl8l1kJ3J0jpj0k2m3l1J8N2K6j2
$$ plain form
485849 -898 -910 -909 -911 -912 -899 -885 -895 -923 -946 -949 -934 -913 -889 -860 -832 -829 -860 -911 -964 -1005 -1008 -961 -906 -893 -908 -899 -856 -814 -803 -817 -841 -866
486825 -866 -891 -920 -959 -994 -991 -940 -878 -860 -899 -950 -948 -880 -797 -745 -722 -724 -781 -896 -1005 -1045 -1025 -988 -952 -920 -902 -914 -954 -988 -981 -945
487741 -945 -942 -991 -1028 -991 -899 -822 -801 -828 -873 -913 -938 -932 -886 -815 -764 -770 -821 -874 -910 -938 -976 -1010 -1008 -951 -858 -782 -766 -810 -879 -950 -1017
488687 -1017 -1064 -1058 -983 -871 -776 -741 -768 -821 -874 -936 -998 -1020 -976 -905 -875 -897 -919 -911 -901 -915 -930 -917 -889 -877 -881 -868 -843 -839 -852 -847
489602 -847 -832 -843 -874 -884 -867 -855 -874 -913 -957 -998 -1010 -976 -930 -926 -957 -955 -901 -864 -904 -987 -1026 -994 -948 -960 -1020 -1055 -1033 -987 -940 -883
490518 -883 -826 -800 -815 -854 -894 -915 -921 -919 -908 -888 -883 -917 -969 -991 -973 -954 -948 -932 -891 -844 -822 -858 -944 -1010 -999 -921 -829 -775 -777 -805 -817
491464 -817 -815 -816 -824 -838 -851 -847 -835 -840 -858 -874 -882 -881 -869 -848 -841 -881 -970 -1059 -1104 -1097 -1066 -1034 -987 -922 -865 -841 -847 -887 -965 -1036 -1035 -960 -884 -869
492498 -869 -890 -892 -866 -839 -829 -831 -837 -850 -881 -924 -961 -978 -965 -917 -859 -834 -864 -929 -992 -1027 -1035 -1023 -991 -943 -903 -893 -920 -969 -1000 -976 -918
$$ packed form
485849h98j2JkjJ3J4j0k8k3lJ5K1K4K9K8Ll1n1n3m1lM7N5J3j5RM3M2J1j4k4k5
486825h66k5k9l9l5LN1O2J8l9n1KO8Q3N2K3kn7j15j09m0K0L7L6L2J8j2m0l4PL6
487741i45Lm9l7L7R2P7K1k7m5m0k5OM6P1N1on1n3l6k8l8l4KN7R3P6J6m4o9p1o7
488687a017m7OP5J12R5L5k7n3n3o2o2k2M4P1L0k2k2QJ0j4j5J3K8J2mJ3K5Mj3N
489602h47J5j1l1j0J7J2j9l9m4m1j2L4M6Ml1KN4L7m0q3l9L2M6j2o0l5K2M6M7N7
490518h83N7K6j5l9m0k1oKJ1K0Nl4n2k2J8J9OJ6M1M7K2l6q6o6J1P8R2N4kk8j2
491464h17Kjqj4j3MJ2nj8j6qJJ2K1Pm0q9q9m5PL1L2M7O5N7K4om0p8p1JP5P6J5
492498h69k1kK6K7J0koj3l1m3l7j7J3M8N8K5l0o5o3l5qJ2L2M8M0J0k7m9l1K4N8
$$ plain form
493444 -918 -874 -850 -815 -768 -744 -780 -869 -943 -933 -850 -774 -767 -809 -849 -886 -947 -1004 -1003 -955 -924 -932 -938 -920 -907 -927 -962 -982 -994 -1026 -1062 -1059
494390 -1059 -995 -897 -815 -801 -862 -937 -957 -929 -916 -945 -984 -992 -951 -884 -846 -874 -931 -945 -903 -865 -883 -934 -960 -943 -913 -900 -904 -916 -926
495275 -926 -920 -903 -899 -915 -939 -960 -971 -970 -970 -978 -986 -973 -928 -873 -850 -881 -925 -931 -909 -905 -927 -947 -959 -960 -926 -864 -829 -863 -932 -978 -976 -931 -873 -834
496317 -834 -827 -853 -913 -993 -1044 -1028 -964 -914 -913 -955 -1008 -1031 -992 -911 -841 -818 -844 -897 -936 -943 -938 -939 -933 -895 -842 -830 -884 -957 -986 -957 -901 -851
497293 -851 -823 -827 -871 -944 -1002 -1014 -995 -976 -959 -931 -891 -860 -867 -921 -987 -1017 -1009 -987 -963 -946 -954 -990 -1028 -1042 -1021 -982 -959 -972 -1008 -1033 -1026
498239 -1026 -1001 -993 -1009 -1011 -962 -883 -829 -823 -845 -868 -891 -917 -934 -928 -908 -903 -924 -958 -974 -950 -912 -898 -898 -881 -865 -883 -914 -920 -906 -894 -886 -892 -933
499243 -933 -1001 -1051 -1053 -1015 -972 -946 -933 -907 -855 -799 -782 -808 -839 -852 -863 -893 -944 -996 -1031 -1037 -1009 -955 -901 -874 -873 -876 -866 -855 -858 -880 -923
500189 -923 -989 -1050 -1060 -1008 -933 -882 -875 -891 -904 -917 -944 -979 -994 -977 -941 -915 -908 -908 -908 -912 -927 -947 -960 -952 -929 -923 -951 -981 -975 -948 -936 -937 -926
$$ packed form
493444i18M4K4L5M7K4l6q9p4J0Q3P6Pm2m0l7o1n7JM8L1qoJ8J3k0l5k0j2l2l6L
494390a059O4R8Q2J4o1p5k0K8J3k9l9qM1O7L8k8n7j4M2L8j8n1k6J7L0J3mj2j0
495275i26OJ7Mj6k4k1j1J%qqJ3M5N5K3l1m4oK2Mk2k0j2jL4O2L5l4o9m6KM5N8L9
496317h34Pk6o0q0n1J6O4N0Jm2n3k3L9Q1P0K3k6n3l9pNjOL8N3J2n4p3k9K9N6N0
497293h51K8mm4p3n8j2J9J9J7K8M0L1pn4o6l0QK2K4J7ql6l8j4K1L9K3j3l6k5P
498239a026K5Qj6kM9P9N4Ok2k3k3k6j7OK0Nk1l4j6K4L8J4%J7J6j8l1oJ4J2Qom1
499243i33o8n0kL8M3K6J3K6N2N6J7k6l1j3j1l0n1n2l5oK8N4N4K7JlJ0J1lk2m3
500189i23o6o1j0N2P5N1Pj6j3j3k7l5j5J7L6K6P%%mj5k0j3QK3Ok8l0OK7J2jJ1
$$ plain form
501196 -926 -898 -865 -847 -863 -910 -974 -1036 -1062 -1023 -943 -895 -916 -963 -967 -903 -822 -792 -829 -885 -911 -913 -913 -918 -911 -896 -897 -926 -959 -966 -937 -895 -883
502177 -883 -910 -940 -940 -928 -941 -981 -1006 -993 -956 -910 -865 -839 -846 -868 -880 -891 -919 -962 -996 -994 -941 -865 -824 -837 -879 -922 -955 -976 -985 -985 -970
503123 -970 -928 -873 -842 -862 -901 -909 -887 -878 -918 -987 -1036 -1039 -1016 -999 -995 -987 -974 -968 -963 -938 -893 -854 -829 -811 -811 -840 -882 -922 -949 -950 -920 -892 -897 -931
$$ packed form
501196i26K8L3J8j6m7o4o2k6L9Q0M8k1m7mO4Q1L0l7n6k6k%nPJ5jk9l3pK9M2J2
502177h83k7l0%J2j3m0k5J3L7M6M5K6pk2j2j1k8m3l4KN3P6M1j3m2m3l3k1r%J5
503123i70M2N5L1k0l9qK2Rm0o9m9lK3J7MQJ3ONK5M5L9K5J8%k9m2m0k7jL0K8nl4
$$ [...]
##END=
